@startuml classes
set namespaceSeparator none
class "ADC" as cmrseq.core.bausteine._adc.ADC #aliceblue {
  adc_center : Quantity
  adc_phase : Quantity
  adc_timing : Quantity
  frequency_offset : Quantity
  phase_offset : Quantity
  tmax : Quantity
  tmin : Quantity
  flip(time_flip: Quantity)
  shift(time_shift: Quantity) -> None
  {abstract}snap_to_raster(system_specs: SystemSpec) -> None
  validate(system_specs: SystemSpec)
}
class "ArbitraryGradient" as cmrseq.core.bausteine._gradients.ArbitraryGradient #aliceblue {
  gradients : Tuple[Quantity, Quantity]
}
class "ArbitraryRFPulse" as cmrseq.core.bausteine._rf.ArbitraryRFPulse #aliceblue {
  rf_events : Tuple[Quantity, Quantity]
}
class "Delay" as cmrseq.core.bausteine._delay.Delay #aliceblue {
  gradients : Tuple[Quantity, Quantity]
}
class "Gradient" as cmrseq.core.bausteine._gradients.Gradient #aliceblue {
  gradients : Tuple[Quantity, Quantity]
  tmax : Quantity
  tmin : Quantity
  flip(time_flip: Quantity)
  rotate_gradients(rotation_matrix: np.ndarray) -> None
  scale_gradients(factor: float) -> None
  shift(time_shift: Quantity)
  snap_to_raster(system_specs: SystemSpec)
  split(t: Quantity) -> (Quantity, Quantity)
  validate(system_specs: SystemSpec) -> None
}
class "GridSamplingADC" as cmrseq.core.bausteine._adc.GridSamplingADC #aliceblue {
  tmax : Quantity
  tmin : Quantity
}
class "HardRFPulse" as cmrseq.core.bausteine._rf.HardRFPulse #aliceblue {
  rf_events : Tuple[Quantity, Quantity]
}
class "RFPulse" as cmrseq.core.bausteine._rf.RFPulse #aliceblue {
  bandwidth : Quantity
  frequency_offset : Quantity
  normalized_waveform : Quantity
  phase_offset : Quantity
  rf : Tuple[Quantity, Quantity]
  rf_events : Tuple[Quantity, Quantity]
  tmax : Quantity
  tmin : Quantity
  flip(time_flip: Quantity)
  shift(time_shift: Quantity) -> None
  snap_to_raster(system_specs: SystemSpec)
  validate(system_specs: SystemSpec)
}
class "SequenceBaseBlock" as cmrseq.core.bausteine._base.SequenceBaseBlock #aliceblue {
  duration : Quantity
  name : str
  tmax : Quantity
  tmin : Quantity
  copy() -> SequenceBaseBlock
  {abstract}flip(time_flip: Quantity) -> None
  {abstract}shift(time_shift: Quantity) -> None
  {abstract}snap_to_raster(system_specs: SystemSpec) -> None
  {abstract}validate(system_specs: SystemSpec) -> None
}
class "SincRFPulse" as cmrseq.core.bausteine._rf.SincRFPulse #aliceblue {
  rf_events : Tuple[Quantity, Quantity]
  from_shortest(system_specs: SystemSpec, ...)
}
class "SymmetricADC" as cmrseq.core.bausteine._adc.SymmetricADC #aliceblue {
  tmax : Quantity
  tmin : Quantity
}
class "TrapezoidalGradient" as cmrseq.core.bausteine._gradients.TrapezoidalGradient #aliceblue {
  amplitude : Quantity
  area : Quantity
  fall_time : Quantity
  flat_duration : Quantity
  gradients : tuple
  magnitude : Quantity
  rise_time : Quantity
  signed_amplitude: Quantity
  from_area(system_specs: SystemSpec, ...)
  from_dur_amp(system_specs: SystemSpec, ...)
  from_dur_area(system_specs: SystemSpec, ...'
  from_fdur_amp(system_specs: SystemSpec, ...)
  from_fdur_area(system_specs: SystemSpec, ...)
  from_fdur_farea(system_specs: SystemSpec, ...)
}
cmrseq.core.bausteine._adc.ADC --|> cmrseq.core.bausteine._base.SequenceBaseBlock
cmrseq.core.bausteine._adc.GridSamplingADC --|> cmrseq.core.bausteine._adc.ADC
cmrseq.core.bausteine._adc.SymmetricADC --|> cmrseq.core.bausteine._adc.ADC
cmrseq.core.bausteine._delay.Delay --|> cmrseq.core.bausteine._gradients.Gradient
cmrseq.core.bausteine._gradients.ArbitraryGradient --|> cmrseq.core.bausteine._gradients.Gradient
cmrseq.core.bausteine._gradients.Gradient --|> cmrseq.core.bausteine._base.SequenceBaseBlock
cmrseq.core.bausteine._gradients.TrapezoidalGradient --|> cmrseq.core.bausteine._gradients.Gradient
cmrseq.core.bausteine._rf.ArbitraryRFPulse --|> cmrseq.core.bausteine._rf.RFPulse
cmrseq.core.bausteine._rf.HardRFPulse --|> cmrseq.core.bausteine._rf.RFPulse
cmrseq.core.bausteine._rf.RFPulse --|> cmrseq.core.bausteine._base.SequenceBaseBlock
cmrseq.core.bausteine._rf.SincRFPulse --|> cmrseq.core.bausteine._rf.RFPulse
@enduml
