<?xml version="1.0" encoding="UTF-8" standalone="no"?>
<!-- Generator: Adobe Illustrator 16.0.0, SVG Export Plug-In . SVG Version: 6.00 Build 0)  -->

<svg
   version="1.1"
   id="Layer_1"
   x="0px"
   y="0px"
   width="501.59201"
   height="94.138"
   viewBox="0 0 501.59199 94.137999"
   enable-background="new 0 0 640.629 476.221"
   xml:space="preserve"
   sodipodi:docname="logo.svg"
   inkscape:version="1.3.2 (091e20ef0f, 2023-11-25)"
   xmlns:inkscape="http://www.inkscape.org/namespaces/inkscape"
   xmlns:sodipodi="http://sodipodi.sourceforge.net/DTD/sodipodi-0.dtd"
   xmlns="http://www.w3.org/2000/svg"
   xmlns:svg="http://www.w3.org/2000/svg"><defs
   id="defs35" /><sodipodi:namedview
   id="namedview35"
   pagecolor="#ffffff"
   bordercolor="#000000"
   borderopacity="0.25"
   inkscape:showpageshadow="2"
   inkscape:pageopacity="0.0"
   inkscape:pagecheckerboard="0"
   inkscape:deskcolor="#d1d1d1"
   inkscape:zoom="1.6399948"
   inkscape:cx="252.7447"
   inkscape:cy="55.1831"
   inkscape:window-width="1920"
   inkscape:window-height="1011"
   inkscape:window-x="0"
   inkscape:window-y="0"
   inkscape:window-maximized="1"
   inkscape:current-layer="Layer_1" />
<g
   id="g35"
   transform="translate(-67.916,-183.21)">
	<path
   fill="#231f20"
   d="m 255.917,227.167 c -1.775,-3.927 -5.447,-6.839 -11.023,-6.839 -5.574,0 -9.244,2.912 -11.019,6.839 -1.012,2.408 -1.394,4.181 -1.521,7.096 h 25.083 c -0.126,-2.916 -0.508,-4.688 -1.52,-7.096 z m -23.563,18.367 c 0,8.488 5.195,14.697 14.443,14.697 7.22,0 10.766,-2.028 14.945,-6.209 l 10.009,9.755 c -6.715,6.714 -13.172,10.388 -25.083,10.388 -15.58,0 -30.53,-7.096 -30.53,-33.822 0,-21.536 11.657,-33.696 28.756,-33.696 18.37,0 28.755,13.429 28.755,31.543 v 7.345 h -41.295 z"
   id="path1" />
	<path
   fill="#231f20"
   d="m 309.494,273.406 c -13.427,0 -19.129,-9.5 -19.129,-18.877 v -32.683 h -6.967 v -12.54 h 6.967 v -19.509 h 16.467 v 19.509 h 11.657 v 12.54 h -11.657 v 31.671 c 0,3.799 1.775,5.955 5.702,5.955 h 5.955 v 13.934 z"
   id="path2" />
	<path
   fill="#231f20"
   d="m 371.307,273.406 v -40.284 c 0,-8.741 -5.572,-11.653 -10.766,-11.653 -5.195,0 -10.641,3.04 -10.641,11.653 v 40.284 H 333.432 V 183.21 H 349.9 v 30.277 c 4.434,-4.562 10.006,-6.841 15.834,-6.841 14.439,0 22.041,10.133 22.041,24.067 v 42.692 h -16.468 z"
   id="path3" />
	<path
   fill="#231f20"
   d="M 104.727,271.363 H 91.954 L 67.916,206.13 h 17.153 l 13.271,40.317 13.148,-40.317 h 17.154 z"
   id="path4" />
	<path
   fill="#009fe3"
   d="m 168.548,199.333 c -21.511,0 -39.012,17.632 -39.012,39.306 0,18.141 12.262,33.441 28.874,37.952 v -0.068 c 2.346,0.568 4.873,0.825 7.379,0.825 5.314,0 10.533,-1.151 13.687,-2.91 4.958,-2.767 8.305,-6.506 9.947,-11.117 1.759,-4.939 1.577,-9.809 -0.548,-14.468 -1.112,-2.429 -2.87,-4.915 -5.232,-7.395 l -4.949,-5.18 c -4.953,-5.173 -6.719,-7.604 -7.35,-8.768 -0.724,-1.281 -1.443,-3.212 -0.766,-5.114 0.378,-1.066 1.521,-3.074 4.922,-4.57 1.987,-0.874 3.077,-1.053 3.515,-1.085 l 1.098,-4.286 c -5.998,-1.787 -18.414,-1.607 -24.033,11.543 -1.658,3.871 -1.734,8.089 -0.227,12.196 1.328,3.625 4.151,7.676 8.634,12.38 l 4.268,4.49 c 3.103,3.243 4.246,4.896 4.652,5.703 0.783,1.574 0.837,3.253 0.169,5.136 -0.62,1.736 -1.521,2.82 -3.216,3.861 -0.942,0.576 -5.978,3.354 -12.882,1.361 v 10e-4 c -12.775,-4.554 -21.929,-16.727 -21.929,-31.063 0,-18.225 14.774,-32.998 33,-32.998 18.225,0 32.998,14.773 32.998,32.998 0,6.322 -1.781,12.227 -4.863,17.245 l 4.523,4.791 c 4.012,-6.176 6.354,-13.545 6.354,-21.461 0,-21.673 -17.502,-39.305 -39.013,-39.305 z"
   id="path5" />
	<path
   fill="#009fe3"
   d="m 430.114,207.963 h -2.74 l -3.939,12.444 -3.939,-12.444 h -2.69 l 5.622,17.104 h 2.018 z"
   id="path6" />
	<path
   fill="#009fe3"
   d="m 442.047,219.686 v -1.082 c 0,-3.459 -1.896,-5.861 -5.164,-5.861 -3.123,0 -5.166,2.282 -5.166,6.223 0,4.636 2.428,6.246 5.479,6.246 2.139,0 3.314,-0.649 4.564,-1.898 l -1.563,-1.465 c -0.863,0.865 -1.584,1.249 -2.955,1.249 -1.992,0 -3.098,-1.322 -3.098,-3.411 h 7.903 z m -2.425,-1.706 h -5.477 c 0.023,-0.744 0.07,-1.105 0.311,-1.657 0.385,-0.913 1.275,-1.538 2.428,-1.538 1.153,0 2.018,0.625 2.402,1.538 0.24,0.552 0.312,0.913 0.336,1.657 z"
   id="path7" />
	<path
   fill="#009fe3"
   d="m 454.672,213.896 c -0.842,-0.841 -1.73,-1.153 -2.908,-1.153 -1.367,0 -2.617,0.601 -3.242,1.466 v -1.322 h -2.402 v 12.181 h 2.451 v -7.398 c 0,-1.683 1.105,-2.739 2.426,-2.739 0.842,0 1.273,0.264 1.826,0.816 z"
   id="path8" />
	<path
   fill="#009fe3"
   d="m 467.928,218.966 c 0,-1.851 -0.143,-3.917 -1.369,-5.142 -0.672,-0.672 -1.73,-1.081 -2.955,-1.081 -1.297,0 -2.305,0.313 -3.195,1.37 v -6.15 h -2.449 v 17.104 h 2.402 v -1.297 c 0.912,1.105 1.898,1.441 3.219,1.441 1.225,0 2.307,-0.409 2.979,-1.082 1.226,-1.224 1.368,-3.315 1.368,-5.163 z m -2.449,0 c 0,2.162 -0.313,4.06 -2.523,4.06 -2.21,0 -2.547,-1.897 -2.547,-4.06 0,-2.163 0.336,-4.036 2.547,-4.036 2.211,0 2.523,1.873 2.523,4.036 z"
   id="path9" />
	<path
   fill="#009fe3"
   d="m 481.254,225.067 v -8.145 c 0,-2.762 -1.682,-4.18 -5.021,-4.18 -2.018,0 -3.219,0.409 -4.373,1.754 l 1.611,1.513 c 0.672,-0.864 1.32,-1.176 2.666,-1.176 1.898,0 2.666,0.744 2.666,2.281 v 0.865 h -3.219 c -2.787,0 -4.205,1.466 -4.205,3.507 0,1.034 0.336,1.97 0.961,2.619 0.746,0.744 1.754,1.105 3.268,1.105 1.514,0 2.354,-0.361 3.244,-1.249 v 1.104 h 2.402 z m -2.451,-4.396 c 0,0.864 -0.168,1.441 -0.527,1.803 -0.65,0.624 -1.346,0.695 -2.283,0.695 -1.537,0 -2.234,-0.624 -2.234,-1.729 0,-1.105 0.744,-1.753 2.186,-1.753 h 2.859 v 0.984 z"
   id="path10" />
	<path
   fill="#009fe3"
   d="m 495.715,225.067 v -7.783 c 0,-1.37 -0.289,-2.523 -1.227,-3.437 -0.721,-0.695 -1.752,-1.104 -3.002,-1.104 -1.227,0 -2.402,0.457 -3.244,1.37 v -1.227 h -2.402 v 12.181 h 2.451 v -7.424 c 0,-1.874 1.152,-2.714 2.523,-2.714 1.367,0 2.449,0.816 2.449,2.714 v 7.424 z"
   id="path11" />
	<path
   fill="#009fe3"
   d="m 509.799,225.067 v -17.104 h -2.449 v 6.15 c -0.891,-1.058 -1.898,-1.37 -3.195,-1.37 -1.225,0 -2.283,0.409 -2.955,1.081 -1.227,1.225 -1.369,3.291 -1.369,5.142 0,1.849 0.143,3.939 1.369,5.164 0.672,0.673 1.754,1.082 2.979,1.082 1.32,0 2.307,-0.336 3.219,-1.441 v 1.297 h 2.401 z m -2.449,-6.101 c 0,2.162 -0.313,4.06 -2.523,4.06 -2.21,0 -2.547,-1.897 -2.547,-4.06 0,-2.163 0.336,-4.036 2.547,-4.036 2.211,0 2.523,1.873 2.523,4.036 z"
   id="path12" />
	<path
   fill="#009fe3"
   d="m 530.772,225.067 v -17.104 h -2.451 v 6.15 c -0.889,-1.058 -1.898,-1.37 -3.195,-1.37 -1.225,0 -2.281,0.409 -2.953,1.081 -1.227,1.225 -1.371,3.291 -1.371,5.142 0,1.849 0.145,3.939 1.371,5.164 0.672,0.673 1.752,1.082 2.979,1.082 1.32,0 2.307,-0.336 3.219,-1.441 v 1.297 h 2.401 z m -2.451,-6.101 c 0,2.162 -0.313,4.06 -2.521,4.06 -2.211,0 -2.547,-1.897 -2.547,-4.06 0,-2.163 0.336,-4.036 2.547,-4.036 2.208,-0.001 2.521,1.873 2.521,4.036 z"
   id="path13" />
	<path
   fill="#009fe3"
   d="m 545.219,219.686 v -1.082 c 0,-3.459 -1.896,-5.861 -5.164,-5.861 -3.123,0 -5.166,2.282 -5.166,6.223 0,4.636 2.428,6.246 5.479,6.246 2.139,0 3.314,-0.649 4.564,-1.898 l -1.561,-1.465 c -0.865,0.865 -1.586,1.249 -2.957,1.249 -1.992,0 -3.098,-1.322 -3.098,-3.411 h 7.903 z m -2.426,-1.706 h -5.477 c 0.023,-0.744 0.07,-1.105 0.311,-1.657 0.385,-0.913 1.275,-1.538 2.428,-1.538 1.154,0 2.018,0.625 2.402,1.538 0.241,0.552 0.313,0.913 0.336,1.657 z"
   id="path14" />
	<path
   fill="#009fe3"
   d="m 557.844,213.896 c -0.842,-0.841 -1.729,-1.153 -2.908,-1.153 -1.367,0 -2.617,0.601 -3.242,1.466 v -1.322 h -2.402 v 12.181 h 2.451 v -7.398 c 0,-1.683 1.105,-2.739 2.426,-2.739 0.842,0 1.273,0.264 1.826,0.816 z"
   id="path15" />
	<path
   fill="#009fe3"
   d="m 429.61,244.941 c 0,-1.464 -0.457,-2.69 -1.395,-3.507 -0.721,-0.648 -1.609,-1.032 -3.195,-1.272 l -1.945,-0.288 c -0.793,-0.121 -1.489,-0.409 -1.922,-0.794 -0.457,-0.407 -0.649,-0.961 -0.649,-1.586 0,-1.513 1.105,-2.665 3.124,-2.665 1.441,0 2.666,0.312 3.723,1.32 l 1.658,-1.634 c -1.465,-1.369 -3.051,-1.945 -5.309,-1.945 -3.556,0 -5.718,2.041 -5.718,5.021 0,1.394 0.407,2.475 1.249,3.267 0.744,0.698 1.85,1.179 3.242,1.37 l 2.018,0.289 c 1.01,0.144 1.441,0.312 1.875,0.721 0.457,0.407 0.672,1.032 0.672,1.777 0,1.657 -1.297,2.618 -3.531,2.618 -1.754,0 -3.122,-0.385 -4.371,-1.634 l -1.73,1.706 c 1.635,1.657 3.483,2.259 6.055,2.259 3.577,0 6.149,-1.874 6.149,-5.023 z"
   id="path16" />
	<path
   fill="#009fe3"
   d="m 438.534,249.819 v -2.091 h -1.01 c -0.912,0 -1.346,-0.528 -1.346,-1.417 v -6.582 h 2.355 v -1.874 h -2.355 v -3.699 h -2.449 v 3.699 h -1.395 v 1.874 h 1.395 v 6.702 c 0,1.754 1.057,3.388 3.338,3.388 z"
   id="path17" />
	<path
   fill="#009fe3"
   d="m 452.182,249.819 v -12.181 h -2.451 v 7.424 c 0,1.874 -1.152,2.714 -2.523,2.714 -1.369,0 -2.451,-0.816 -2.451,-2.714 v -7.424 h -2.449 v 7.783 c 0,1.37 0.287,2.523 1.227,3.437 0.721,0.696 1.752,1.105 3.002,1.105 1.225,0 2.402,-0.458 3.244,-1.37 v 1.226 z"
   id="path18" />
	<path
   fill="#009fe3"
   d="m 466.385,249.819 v -17.104 h -2.451 v 6.149 c -0.891,-1.057 -1.898,-1.37 -3.195,-1.37 -1.225,0 -2.281,0.409 -2.955,1.082 -1.227,1.225 -1.369,3.291 -1.369,5.142 0,1.849 0.143,3.939 1.369,5.164 0.674,0.673 1.754,1.082 2.979,1.082 1.32,0 2.307,-0.337 3.221,-1.441 v 1.297 h 2.401 z m -2.451,-6.101 c 0,2.162 -0.313,4.059 -2.523,4.059 -2.21,0 -2.547,-1.896 -2.547,-4.059 0,-2.163 0.336,-4.036 2.547,-4.036 2.211,0 2.523,1.873 2.523,4.036 z"
   id="path19" />
	<path
   fill="#009fe3"
   d="m 473.504,249.819 v -12.181 h -2.451 v 12.181 z m 0.073,-14.583 v -2.595 h -2.594 v 2.595 z"
   id="path20" />
	<path
   fill="#009fe3"
   d="m 487.891,244.438 v -1.082 c 0,-3.46 -1.896,-5.862 -5.164,-5.862 -3.123,0 -5.166,2.283 -5.166,6.224 0,4.636 2.428,6.246 5.479,6.246 2.139,0 3.314,-0.649 4.564,-1.899 l -1.561,-1.464 c -0.865,0.864 -1.586,1.249 -2.957,1.249 -1.992,0 -3.098,-1.322 -3.098,-3.411 h 7.904 -10e-4 z m -2.424,-1.707 h -5.479 c 0.023,-0.744 0.072,-1.104 0.313,-1.656 0.383,-0.913 1.273,-1.538 2.426,-1.538 1.154,0 2.02,0.625 2.402,1.538 0.241,0.552 0.313,0.912 0.338,1.656 z"
   id="path21" />
	<path
   fill="#009fe3"
   d="m 500.516,238.647 c -0.842,-0.84 -1.729,-1.153 -2.906,-1.153 -1.369,0 -2.619,0.602 -3.242,1.467 v -1.322 h -2.402 v 12.181 h 2.449 v -7.399 c 0,-1.682 1.105,-2.738 2.426,-2.738 0.842,0 1.273,0.264 1.826,0.816 z"
   id="path22" />
	<path
   fill="#009fe3"
   d="m 513.086,244.438 v -1.082 c 0,-3.46 -1.898,-5.862 -5.166,-5.862 -3.123,0 -5.164,2.283 -5.164,6.224 0,4.636 2.426,6.246 5.477,6.246 2.139,0 3.316,-0.649 4.564,-1.899 l -1.563,-1.464 c -0.863,0.864 -1.584,1.249 -2.953,1.249 -1.994,0 -3.1,-1.322 -3.1,-3.411 h 7.905 z m -2.427,-1.707 h -5.477 c 0.025,-0.744 0.072,-1.104 0.313,-1.656 0.385,-0.913 1.273,-1.538 2.426,-1.538 1.153,0 2.018,0.625 2.402,1.538 0.24,0.552 0.312,0.912 0.336,1.656 z"
   id="path23" />
	<path
   fill="#009fe3"
   d="m 527.032,249.819 v -7.783 c 0,-1.37 -0.289,-2.523 -1.227,-3.437 -0.721,-0.696 -1.752,-1.105 -3.002,-1.105 -1.227,0 -2.402,0.458 -3.244,1.37 v -1.226 h -2.402 v 12.181 h 2.451 v -7.424 c 0,-1.874 1.152,-2.714 2.523,-2.714 1.367,0 2.449,0.816 2.449,2.714 v 7.424 z"
   id="path24" />
	<path
   fill="#009fe3"
   d="m 541.116,249.819 v -17.104 h -2.451 v 6.149 c -0.889,-1.057 -1.896,-1.37 -3.193,-1.37 -1.227,0 -2.283,0.409 -2.957,1.082 -1.225,1.225 -1.367,3.291 -1.367,5.142 0,1.849 0.143,3.939 1.367,5.164 0.674,0.673 1.756,1.082 2.98,1.082 1.32,0 2.305,-0.337 3.219,-1.441 v 1.297 h 2.402 z m -2.451,-6.101 c 0,2.162 -0.311,4.059 -2.521,4.059 -2.21,0 -2.547,-1.896 -2.547,-4.059 0,-2.163 0.336,-4.036 2.547,-4.036 2.211,0 2.521,1.873 2.521,4.036 z"
   id="path25" />
	<path
   fill="#009fe3"
   d="m 555.563,244.438 v -1.082 c 0,-3.46 -1.896,-5.862 -5.164,-5.862 -3.123,0 -5.166,2.283 -5.166,6.224 0,4.636 2.428,6.246 5.477,6.246 2.139,0 3.316,-0.649 4.564,-1.899 l -1.561,-1.464 c -0.865,0.864 -1.586,1.249 -2.955,1.249 -1.994,0 -3.098,-1.322 -3.098,-3.411 h 7.903 z m -2.426,-1.707 h -5.477 c 0.023,-0.744 0.07,-1.104 0.311,-1.656 0.385,-0.913 1.273,-1.538 2.428,-1.538 1.152,0 2.018,0.625 2.402,1.538 0.241,0.552 0.311,0.912 0.336,1.656 z"
   id="path26" />
	<path
   fill="#009fe3"
   d="m 569.508,249.819 v -7.783 c 0,-1.37 -0.289,-2.523 -1.225,-3.437 -0.721,-0.696 -1.754,-1.105 -3.004,-1.105 -1.225,0 -2.402,0.458 -3.242,1.37 v -1.226 h -2.402 v 12.181 h 2.451 v -7.424 c 0,-1.874 1.152,-2.714 2.521,-2.714 1.369,0 2.449,0.816 2.449,2.714 v 7.424 z"
   id="path27" />
	<path
   fill="#009fe3"
   d="m 427.592,273.113 v -8.143 c 0,-2.764 -1.684,-4.181 -5.023,-4.181 -2.018,0 -3.219,0.408 -4.371,1.753 l 1.609,1.515 c 0.674,-0.865 1.321,-1.178 2.666,-1.178 1.898,0 2.668,0.745 2.668,2.282 v 0.865 h -3.219 c -2.787,0 -4.205,1.465 -4.205,3.508 0,1.032 0.336,1.97 0.961,2.617 0.745,0.746 1.754,1.105 3.268,1.105 1.514,0 2.354,-0.359 3.242,-1.249 v 1.104 h 2.402 0.002 z m -2.451,-4.395 c 0,0.865 -0.17,1.441 -0.529,1.801 -0.648,0.625 -1.346,0.698 -2.283,0.698 -1.537,0 -2.232,-0.625 -2.232,-1.73 0,-1.104 0.744,-1.754 2.186,-1.754 h 2.859 v 0.985 z"
   id="path28" />
	<path
   fill="#009fe3"
   d="m 442.051,273.115 v -7.784 c 0,-1.37 -0.289,-2.522 -1.225,-3.436 -0.721,-0.696 -1.756,-1.105 -3.004,-1.105 -1.225,0 -2.402,0.457 -3.242,1.37 v -1.226 h -2.402 v 12.181 h 2.449 v -7.424 c 0,-1.874 1.154,-2.715 2.521,-2.715 1.371,0 2.451,0.817 2.451,2.715 v 7.424 z"
   id="path29" />
	<path
   fill="#009fe3"
   d="M 462.903,273.115 V 256.01 h -2.449 v 6.15 c -0.889,-1.057 -1.898,-1.37 -3.195,-1.37 -1.227,0 -2.283,0.409 -2.955,1.082 -1.225,1.225 -1.369,3.29 -1.369,5.141 0,1.85 0.145,3.94 1.369,5.165 0.672,0.672 1.754,1.081 2.979,1.081 1.322,0 2.307,-0.336 3.219,-1.441 v 1.298 h 2.401 z m -2.449,-6.103 c 0,2.162 -0.313,4.06 -2.523,4.06 -2.209,0 -2.545,-1.897 -2.545,-4.06 0,-2.163 0.336,-4.036 2.545,-4.036 2.21,0 2.523,1.874 2.523,4.036 z"
   id="path30" />
	<path
   fill="#009fe3"
   d="m 477.35,267.733 v -1.081 c 0,-3.46 -1.896,-5.862 -5.164,-5.862 -3.123,0 -5.166,2.283 -5.166,6.223 0,4.636 2.428,6.246 5.479,6.246 2.139,0 3.314,-0.649 4.564,-1.898 l -1.561,-1.465 c -0.865,0.865 -1.586,1.25 -2.957,1.25 -1.992,0 -3.098,-1.322 -3.098,-3.412 h 7.903 z m -2.426,-1.706 h -5.477 c 0.023,-0.744 0.072,-1.105 0.313,-1.657 0.383,-0.913 1.273,-1.537 2.426,-1.537 1.154,0 2.018,0.624 2.402,1.537 0.241,0.552 0.313,0.913 0.336,1.657 z"
   id="path31" />
	<path
   fill="#009fe3"
   d="m 489.973,261.943 c -0.84,-0.84 -1.729,-1.153 -2.904,-1.153 -1.371,0 -2.621,0.602 -3.244,1.466 v -1.321 h -2.402 v 12.181 h 2.449 v -7.399 c 0,-1.682 1.105,-2.739 2.428,-2.739 0.84,0 1.271,0.264 1.826,0.817 z"
   id="path32" />
	<path
   fill="#009fe3"
   d="m 510.875,273.115 v -2.331 h -8.336 v -5.142 h 7.111 v -2.306 h -7.111 v -4.997 h 8.336 v -2.33 h -10.932 v 17.105 h 10.932 z"
   id="path33" />
	<path
   fill="#009fe3"
   d="m 526.389,258.34 v -2.33 h -12.012 v 2.33 h 4.709 v 14.775 h 2.594 V 258.34 Z"
   id="path34" />
	<path
   fill="#009fe3"
   d="M 542.475,273.115 V 256.01 h -2.594 v 7.304 h -6.943 v -7.304 h -2.594 v 17.105 h 2.594 v -7.473 h 6.943 v 7.473 z"
   id="path35" />
</g>
</svg>
