<?xml version="1.0" encoding="UTF-8" standalone="no"?>
<svg
   width="100%"
   height="100%"
   viewBox="0 0 54 54"
   version="1.1"
   xml:space="preserve"
   style="fill-rule:evenodd;clip-rule:evenodd;stroke-linejoin:round;stroke-miterlimit:1.41421;"
   id="svg1"
   sodipodi:docname="signet-mono.svg"
   inkscape:version="1.3 (0e150ed6c4, 2023-07-21)"
   xmlns:inkscape="http://www.inkscape.org/namespaces/inkscape"
   xmlns:sodipodi="http://sodipodi.sourceforge.net/DTD/sodipodi-0.dtd"
   xmlns="http://www.w3.org/2000/svg"
   xmlns:svg="http://www.w3.org/2000/svg"><defs
     id="defs1" /><sodipodi:namedview
     id="namedview1"
     pagecolor="#ffffff"
     bordercolor="#000000"
     borderopacity="0.25"
     inkscape:showpageshadow="2"
     inkscape:pageopacity="0.0"
     inkscape:pagecheckerboard="0"
     inkscape:deskcolor="#d1d1d1"
     inkscape:zoom="13.333333"
     inkscape:cx="27"
     inkscape:cy="26.9625"
     inkscape:window-width="1920"
     inkscape:window-height="1011"
     inkscape:window-x="0"
     inkscape:window-y="0"
     inkscape:window-maximized="1"
     inkscape:current-layer="svg1" /><g
     id="g1"
     style="fill:#ffffff"><path
       d="M27,0c-14.889,0 -27,12.204 -27,27.207c0,12.556 8.487,23.148 19.983,26.269l0,-0.046c1.623,0.393 3.373,0.57 5.108,0.57c3.678,0 7.289,-0.796 9.472,-2.015c3.432,-1.913 5.748,-4.501 6.883,-7.694c1.219,-3.421 1.091,-6.79 -0.38,-10.015c-0.767,-1.681 -1.984,-3.402 -3.618,-5.118l-3.425,-3.585c-3.429,-3.58 -4.652,-5.263 -5.088,-6.069c-0.501,-0.887 -1,-2.223 -0.529,-3.541c0.262,-0.737 1.053,-2.127 3.407,-3.162c1.374,-0.606 2.128,-0.729 2.43,-0.752l0.762,-2.967c-4.152,-1.236 -12.744,-1.112 -16.635,7.99c-1.146,2.68 -1.199,5.598 -0.156,8.443c0.919,2.509 2.874,5.313 5.975,8.569l2.954,3.108c2.148,2.244 2.939,3.389 3.219,3.947c0.542,1.09 0.581,2.252 0.118,3.554c-0.429,1.203 -1.053,1.954 -2.226,2.674c-0.651,0.399 -4.137,2.322 -8.916,0.942l-0.001,0.001c-8.839,-3.152 -15.176,-11.578 -15.176,-21.501c0,-12.615 10.226,-22.841 22.838,-22.841c12.614,0 22.84,10.226 22.84,22.841c0,4.375 -1.232,8.462 -3.365,11.936l3.129,3.317c2.777,-4.274 4.397,-9.377 4.397,-14.855c0,-15.003 -12.111,-27.207 -27,-27.207Z"
       style="fill:#ffffff;fill-rule:nonzero"
       id="path1" /></g></svg>
