{
	"primaryColor": "#009FE3",
	"disclaimer": "https://account.vseth.ethz.ch/impressum",
	"privacy": "https://account.vseth.ethz.ch/legal/privacy",
	"copyright": "Copyright 2023 VSETH",
	"languages": [
		{ "key": "en", "label": "English" },
		{ "key": "de", "label": "Deutsch" }
	],
	"externalNav": [
    {
      "title": {
        "en": "About us",
        "de": "Über uns"
      },
      "childItems": [
        {
          "title": {
            "en": "Board",
            "de": "Vorstand"
          },
          "href": "https://vmp.ethz.ch/de/home/#vorstand"
        },
        {
          "title": {
            "en": "University Politics",
            "de": "Hochschulpolitik"
          },
          "href": "https://vmp.ethz.ch/de/home/hopo/"
        },
        {
          "title": {
            "en": "Statues",
            "de": "Statuten"
          },
          "href": "https://vmp.ethz.ch/de/home/statuten/"
        },
        {
          "title": {
            "de": "Hall of Fame",
            "en": "Hall of Fame"
          },
          "href": "https://vmp.ethz.ch/de/home/hall-of-fame/"
        },
        {
          "title": {
            "de": "Kontakt",
            "en": "Contact"
          },
          "href": "https://vmp.ethz.ch/de/home/#kontakt"
        }
      ]
    },
    {
      "title": "Services",
      "childItems": [
        {
          "title": {
            "en": "Events",
            "de": "Events"
          },
          "href": "https://vmp.ethz.ch/de/events/"
        },
        {
          "title": {
            "en": "Coffee & Beer",
            "de": "Kaffee & Bier"
          },
          "href": "https://vmp.ethz.ch/de/studium/#kaffee-automat"
        },
        {
          "title": {
            "en": "Exam Collection",
            "de": "Prüfungssammlung"
          },
          "href": "http://exams.vmp.ethz.ch/"
        }
      ]
    },
    {
      "title": {
        "en": "Committees",
        "de": "Komissionen"
      },
      "childItems": [
        {
          "title": {
            "en": "[MindPhair]",
            "de": "[MindPhair]"
          },
          "href": "https://mindphair.ch/index.php/en/mindphair-3/"
        },
        {
          "title": {
            "en": "Phimale",
            "de": "Phimale"
          },
          "href": "http://phimale.ethz.ch/"
        },
        {
          "title": {
            "en": "KuMa",
            "de": "KuMa"
          },
          "href": "https://vmp.ethz.ch/de/events/kuma/"
        }
      ]
    }
  ],
	"socialMedia": [
		{ "type": "instagram", "link": "https://www.instagram.com/vsethz" },
		{ "type": "email", "link": "mailto:vseth@vseth.ethz.ch" }
	]
}
