2023-09-05T14:53:04.976 INFO [Next.js Server] TypeError: fetch failed
2023-09-05T14:53:04.988 INFO [Next.js Server]     at Object.fetch (node:internal/deps/undici/undici:11576:11)
2023-09-05T14:53:04.988 INFO [Next.js Server]     at async invokeRequest (/papperlaweb/node_modules/next/dist/server/lib/server-ipc/invoke-request.js:21:12)
2023-09-05T14:53:04.988 INFO [Next.js Server]     at async invokeRender (/papperlaweb/node_modules/next/dist/server/lib/router-server.js:229:29)
2023-09-05T14:53:04.988 INFO [Next.js Server]     at async handleRequest (/papperlaweb/node_modules/next/dist/server/lib/router-server.js:422:24)
2023-09-05T14:53:04.988 INFO [Next.js Server]     at async requestHandler (/papperlaweb/node_modules/next/dist/server/lib/router-server.js:439:13) {
2023-09-05T14:53:04.988 INFO [Next.js Server]   cause: SocketError: other side closed
2023-09-05T14:53:04.988 INFO [Next.js Server]       at Socket.onSocketEnd (/papperlaweb/node_modules/next/dist/compiled/undici/index.js:1:63301)
2023-09-05T14:53:04.988 INFO [Next.js Server]       at Socket.emit (node:events:526:35)
2023-09-05T14:53:04.988 INFO [Next.js Server]       at endReadableNT (node:internal/streams/readable:1359:12)
2023-09-05T14:53:04.988 INFO [Next.js Server]       at process.processTicksAndRejections (node:internal/process/task_queues:82:21) {
2023-09-05T14:53:04.988 INFO [Next.js Server]     code: 'UND_ERR_SOCKET',
2023-09-05T14:53:04.988 INFO [Next.js Server]     socket: {
2023-09-05T14:53:04.988 INFO [Next.js Server]       localAddress: '127.0.0.1',
2023-09-05T14:53:04.988 INFO [Next.js Server]       localPort: 40058,
2023-09-05T14:53:04.988 INFO [Next.js Server]       remoteAddress: '127.0.0.1',
2023-09-05T14:53:04.988 INFO [Next.js Server]       remotePort: 46551,
2023-09-05T14:53:04.988 INFO [Next.js Server]       remoteFamily: 'IPv4',
2023-09-05T14:53:04.988 INFO [Next.js Server]       timeout: undefined,
2023-09-05T14:53:04.988 INFO [Next.js Server]       bytesWritten: 11798,
2023-09-05T14:53:04.988 INFO [Next.js Server]       bytesRead: 5407
2023-09-05T14:53:04.988 INFO [Next.js Server]     }
2023-09-05T14:53:04.988 INFO [Next.js Server]   }
2023-09-05T14:53:04.988 INFO [Next.js Server] }
2023-09-05T14:53:04.988 INFO [Next.js Server] TypeError: fetch failed
2023-09-05T14:53:04.988 INFO [Next.js Server]     at Object.fetch (node:internal/deps/undici/undici:11576:11)
2023-09-05T14:53:04.988 INFO [Next.js Server]     at async invokeRequest (/papperlaweb/node_modules/next/dist/server/lib/server-ipc/invoke-request.js:21:12)
2023-09-05T14:53:04.988 INFO [Next.js Server]     at async invokeRender (/papperlaweb/node_modules/next/dist/server/lib/router-server.js:229:29)
2023-09-05T14:53:04.988 INFO [Next.js Server]     at async handleRequest (/papperlaweb/node_modules/next/dist/server/lib/router-server.js:422:24)
2023-09-05T14:53:04.988 INFO [Next.js Server]     at async requestHandler (/papperlaweb/node_modules/next/dist/server/lib/router-server.js:439:13) {
2023-09-05T14:53:04.988 INFO [Next.js Server]   cause: SocketError: other side closed
2023-09-05T14:53:04.988 INFO [Next.js Server]       at Socket.onSocketEnd (/papperlaweb/node_modules/next/dist/compiled/undici/index.js:1:63301)
2023-09-05T14:53:04.988 INFO [Next.js Server]       at Socket.emit (node:events:526:35)
2023-09-05T14:53:04.988 INFO [Next.js Server]       at endReadableNT (node:internal/streams/readable:1359:12)
2023-09-05T14:53:04.988 INFO [Next.js Server]       at process.processTicksAndRejections (node:internal/process/task_queues:82:21) {
2023-09-05T14:53:04.988 INFO [Next.js Server]     code: 'UND_ERR_SOCKET',
2023-09-05T14:53:04.988 INFO [Next.js Server]     socket: {
2023-09-05T14:53:04.988 INFO [Next.js Server]       localAddress: '127.0.0.1',
2023-09-05T14:53:04.988 INFO [Next.js Server]       localPort: 40068,
2023-09-05T14:53:04.988 INFO [Next.js Server]       remoteAddress: '127.0.0.1',
2023-09-05T14:53:04.988 INFO [Next.js Server]       remotePort: 46551,
2023-09-05T14:53:04.988 INFO [Next.js Server]       remoteFamily: 'IPv4',
2023-09-05T14:53:04.988 INFO [Next.js Server]       timeout: undefined,
2023-09-05T14:53:04.988 INFO [Next.js Server]       bytesWritten: 7885,
2023-09-05T14:53:04.988 INFO [Next.js Server]       bytesRead: 2648
2023-09-05T14:53:04.988 INFO [Next.js Server]     }
2023-09-05T14:53:04.988 INFO [Next.js Server]   }
2023-09-05T14:53:04.988 INFO [Next.js Server] }
2023-09-05T14:53:04.988 INFO [Next.js Server] TypeError: fetch failed
2023-09-05T14:53:04.988 INFO [Next.js Server]     at Object.fetch (node:internal/deps/undici/undici:11576:11)
2023-09-05T14:53:04.988 INFO [Next.js Server]     at async invokeRequest (/papperlaweb/node_modules/next/dist/server/lib/server-ipc/invoke-request.js:21:12)
2023-09-05T14:53:04.988 INFO [Next.js Server]     at async invokeRender (/papperlaweb/node_modules/next/dist/server/lib/router-server.js:229:29)
2023-09-05T14:53:04.988 INFO [Next.js Server]     at async handleRequest (/papperlaweb/node_modules/next/dist/server/lib/router-server.js:422:24)
2023-09-05T14:53:04.988 INFO [Next.js Server]     at async requestHandler (/papperlaweb/node_modules/next/dist/server/lib/router-server.js:439:13) {
2023-09-05T14:53:04.988 INFO [Next.js Server]   cause: SocketError: other side closed
2023-09-05T14:53:04.988 INFO [Next.js Server]       at Socket.onSocketEnd (/papperlaweb/node_modules/next/dist/compiled/undici/index.js:1:63301)
2023-09-05T14:53:04.988 INFO [Next.js Server]       at Socket.emit (node:events:526:35)
2023-09-05T14:53:04.988 INFO [Next.js Server]       at endReadableNT (node:internal/streams/readable:1359:12)
2023-09-05T14:53:04.988 INFO [Next.js Server]       at process.processTicksAndRejections (node:internal/process/task_queues:82:21) {
2023-09-05T14:53:04.988 INFO [Next.js Server]     code: 'UND_ERR_SOCKET',
2023-09-05T14:53:04.988 INFO [Next.js Server]     socket: {
2023-09-05T14:53:04.988 INFO [Next.js Server]       localAddress: '127.0.0.1',
2023-09-05T14:53:04.988 INFO [Next.js Server]       localPort: 40076,
2023-09-05T14:53:04.988 INFO [Next.js Server]       remoteAddress: '127.0.0.1',
2023-09-05T14:53:04.988 INFO [Next.js Server]       remotePort: 46551,
2023-09-05T14:53:04.988 INFO [Next.js Server]       remoteFamily: 'IPv4',
2023-09-05T14:53:04.988 INFO [Next.js Server]       timeout: undefined,
2023-09-05T14:53:04.988 INFO [Next.js Server]       bytesWritten: 7884,
2023-09-05T14:53:04.988 INFO [Next.js Server]       bytesRead: 2395
2023-09-05T14:53:04.988 INFO [Next.js Server]     }
2023-09-05T14:53:04.988 INFO [Next.js Server]   }
2023-09-05T14:53:04.988 INFO [Next.js Server] }

"""
const dns = require("dns");

dns.setDefaultResultOrder("ipv4first")
"""

in next.config.js might fix it
