             nan              nan              nan
             nan              nan              nan
             nan              nan              nan
             nan              nan              nan
             nan              nan              nan
             nan              nan              nan
  3.801658801067   0.008731431961   0.614521738970
             nan              nan              nan
  4.680649457077   0.315549143316  -0.188084391445
             nan              nan              nan
             nan              nan              nan
  5.400302211977  -0.272733896534  -0.260423723339
             nan              nan              nan
             nan              nan              nan
             nan              nan              nan
             nan              nan              nan
             nan              nan              nan
             nan              nan              nan
             nan              nan              nan
             nan              nan              nan
  5.278413256466  -0.123008962370  -0.268639832489
             nan              nan              nan
             nan              nan              nan
             nan              nan              nan
             nan              nan              nan
             nan              nan              nan
             nan              nan              nan
  5.342134665708   0.469262660702  -0.046984213170
             nan              nan              nan
             nan              nan              nan
  5.172393979971  -0.083897712075  -0.070792045063
  5.341633878726   0.079257138638   0.007039279634
             nan              nan              nan
  4.956512905541   0.030893961522   0.092174795724
             nan              nan              nan
  5.151107245677   0.375281164229  -0.315119111190
  4.761352735664  -0.231608124843  -0.076890837427
             nan              nan              nan
             nan              nan              nan
             nan              nan              nan
             nan              nan              nan
             nan              nan              nan
             nan              nan              nan
             nan              nan              nan
             nan              nan              nan
             nan              nan              nan
             nan              nan              nan
  4.897132615082   0.110940788199   0.043090206291
  4.060096314506   0.406592996664   0.130828487991
             nan              nan              nan
             nan              nan              nan
             nan              nan              nan
             nan              nan              nan
             nan              nan              nan
  4.226600847054   0.158173249341  -0.001263916457
             nan              nan              nan
             nan              nan              nan
             nan              nan              nan
             nan              nan              nan
             nan              nan              nan
             nan              nan              nan
  5.442837174835   0.027184395283   0.235002707544
             nan              nan              nan
             nan              nan              nan
             nan              nan              nan
  4.388361649089   0.282625848495   0.348795780766
             nan              nan              nan
  4.597348268388   0.006356951651   0.096373444447
  4.978166149675   0.079605094327   0.063373018422
             nan              nan              nan
             nan              nan              nan
  5.728851775209   0.202674363773   0.068339017012
  5.153808321956  -0.116331671411   0.279033176852
  5.332917791306  -0.024037494158  -0.042480064967
  5.495582211988  -0.126826271372   0.031878188866
             nan              nan              nan
  5.333337947518   0.027446984180  -0.046586099641
             nan              nan              nan
             nan              nan              nan
             nan              nan              nan
             nan              nan              nan
             nan              nan              nan
             nan              nan              nan
             nan              nan              nan
             nan              nan              nan
             nan              nan              nan
             nan              nan              nan
  4.567180904550   0.222581978498  -0.064190682576
             nan              nan              nan
  5.418639071462  -0.108976386785  -0.088187892963
  4.484208116511  -0.034276464193  -0.144257022141
  4.751528940617  -0.514806157189  -0.086078945848
             nan              nan              nan
             nan              nan              nan
             nan              nan              nan
             nan              nan              nan
  4.667823871538   0.502644066954  -0.184446699319
             nan              nan              nan
  4.121896240654  -0.043450612019   0.283569822283
             nan              nan              nan
             nan              nan              nan
             nan              nan              nan
             nan              nan              nan
             nan              nan              nan
  5.458993082954  -0.056385249487  -0.323298479601
             nan              nan              nan
  5.429795965085  -0.502590467834  -0.493330478143
  5.975603445709  -0.105204958688  -0.402332111805
             nan              nan              nan
             nan              nan              nan
             nan              nan              nan
  5.091835196926   0.066137514577  -0.040120303982
  5.025353989005   0.514879979695  -0.115729121881
  4.908082887570   0.338303364364  -0.131117180003
             nan              nan              nan
             nan              nan              nan
             nan              nan              nan
             nan              nan              nan
             nan              nan              nan
             nan              nan              nan
  4.960483184666  -0.046741168932   0.096068617436
             nan              nan              nan
  4.711944120736   0.196276547525   0.125072221940
             nan              nan              nan
             nan              nan              nan
  5.574172389780  -0.089522949927  -0.063984996529
             nan              nan              nan
             nan              nan              nan
             nan              nan              nan
             nan              nan              nan
             nan              nan              nan
             nan              nan              nan
             nan              nan              nan
             nan              nan              nan
             nan              nan              nan
  5.866366688893   0.302090639593  -0.174497669589
             nan              nan              nan
  5.125655932937  -0.370701993642   0.072246660744
             nan              nan              nan
             nan              nan              nan
             nan              nan              nan
  6.397671229888   0.161709002389  -0.585149222427
             nan              nan              nan
             nan              nan              nan
             nan              nan              nan
             nan              nan              nan
             nan              nan              nan
             nan              nan              nan
  5.341395070647  -0.121993732840  -0.037698630817
  5.203200704898   0.118507254155   0.321251970664
             nan              nan              nan
             nan              nan              nan
             nan              nan              nan
             nan              nan              nan
             nan              nan              nan
  4.705705654296   0.051276910417   0.179974874765
  5.190271271651   0.105921940294   0.068644737935
             nan              nan              nan
             nan              nan              nan
             nan              nan              nan
             nan              nan              nan
             nan              nan              nan
  4.527176468987   0.317858674897   0.336818326880
             nan              nan              nan
  5.299775033153   0.149170569102  -0.052167843831
             nan              nan              nan
             nan              nan              nan
  4.608246642530   0.068022245003   0.065611681238
             nan              nan              nan
             nan              nan              nan
             nan              nan              nan
  4.884216698003  -0.344426531725   0.203009535705
             nan              nan              nan
             nan              nan              nan
  5.055143860220  -0.069874197117  -0.566749965837
             nan              nan              nan
             nan              nan              nan
  4.951477942463   0.095714044519   0.146595351259
             nan              nan              nan
  4.346105852048  -0.119978003279   0.474557093763
             nan              nan              nan
             nan              nan              nan
             nan              nan              nan
             nan              nan              nan
  4.795178558577   0.335457130090  -0.076797934314
  4.928945680133  -0.013074674975   0.057588559618
             nan              nan              nan
             nan              nan              nan
             nan              nan              nan
             nan              nan              nan
             nan              nan              nan
  4.996466950524   0.146667914919  -0.280078139410
  5.287210972085  -0.014321339553   0.221621820921
             nan              nan              nan
  5.491025890697   0.049969245301  -0.245676089028
             nan              nan              nan
             nan              nan              nan
             nan              nan              nan
             nan              nan              nan
             nan              nan              nan
             nan              nan              nan
             nan              nan              nan
             nan              nan              nan
  5.724560450538  -0.123135820397  -0.529122260499
  4.027463985474  -0.174790473217  -0.328105489969
             nan              nan              nan
             nan              nan              nan
  6.082613233934  -0.344592907967  -0.120224805092
             nan              nan              nan
  5.900700552505  -0.011850861135  -0.139994915974
             nan              nan              nan
  5.265584138390   0.187369662621  -0.133129313122
  5.306873152430   0.080875594659  -0.196639514947
             nan              nan              nan
             nan              nan              nan
             nan              nan              nan
             nan              nan              nan
             nan              nan              nan
             nan              nan              nan
             nan              nan              nan
  5.543428184406   0.350046791184   0.355895433759
             nan              nan              nan
  5.154676514549   0.144601226963   0.227036621710
             nan              nan              nan
             nan              nan              nan
             nan              nan              nan
             nan              nan              nan
             nan              nan              nan
             nan              nan              nan
             nan              nan              nan
             nan              nan              nan
             nan              nan              nan
             nan              nan              nan
             nan              nan              nan
  4.859941152718   0.044045839988  -0.125768460113
             nan              nan              nan
             nan              nan              nan
             nan              nan              nan
             nan              nan              nan
             nan              nan              nan
             nan              nan              nan
             nan              nan              nan
  4.572323566642  -0.177009932988   0.084231168799
             nan              nan              nan
             nan              nan              nan
             nan              nan              nan
  5.266401988568  -0.052852831218  -0.014712781129
             nan              nan              nan
  4.971032906950  -0.047866340006  -0.211517187971
  4.504203861741   0.021238396966   0.418784858745
             nan              nan              nan
  4.583859530238   0.022918405075   0.149151929619
  4.516274256298  -0.009503478330   0.060218232556
             nan              nan              nan
             nan              nan              nan
             nan              nan              nan
  5.361887802703  -0.242306073800   0.318057714056
             nan              nan              nan
             nan              nan              nan
  5.427924879876  -0.135122884452  -0.121356832889
             nan              nan              nan
             nan              nan              nan
             nan              nan              nan
             nan              nan              nan
  5.062681573784  -0.605168035890  -0.056863918232
             nan              nan              nan
  5.109352559329   0.051789775562   0.034975263196
             nan              nan              nan
             nan              nan              nan
  5.009796084312   0.158596571483   0.329962708927
  4.726869504793   0.173678583554  -0.074780538486
             nan              nan              nan
             nan              nan              nan
             nan              nan              nan
  4.511590316630  -0.098483027662   0.108122232856
             nan              nan              nan
  5.221128808226  -0.524151720111  -0.276579129376
             nan              nan              nan
             nan              nan              nan
             nan              nan              nan
             nan              nan              nan
             nan              nan              nan
             nan              nan              nan
             nan              nan              nan
  5.596815981123  -0.072055954108  -0.619537096728
             nan              nan              nan
             nan              nan              nan
             nan              nan              nan
             nan              nan              nan
             nan              nan              nan
  5.156818904711   0.221960811673   0.158472112435
             nan              nan              nan
             nan              nan              nan
             nan              nan              nan
             nan              nan              nan
             nan              nan              nan
  5.727143440511  -0.549361271564  -0.364462881335
             nan              nan              nan
             nan              nan              nan
             nan              nan              nan
             nan              nan              nan
             nan              nan              nan
  5.714714274566   0.186976994139   0.081600077231
  5.096858019254  -0.157309609219  -0.142835895831
             nan              nan              nan
             nan              nan              nan
             nan              nan              nan
             nan              nan              nan
  4.906472985281  -0.095120761807  -0.243238717731
             nan              nan              nan
             nan              nan              nan
  5.293965258464  -0.291401185813   0.013780152219
  4.682567660468   0.186934222174   0.108179413564
             nan              nan              nan
  5.453567326988   0.273293835122  -0.347797393513
             nan              nan              nan
  5.017661353855  -0.101838668331  -0.077741457817
             nan              nan              nan
  5.314403922234   0.028988313515  -0.087869128056
             nan              nan              nan
             nan              nan              nan
             nan              nan              nan
             nan              nan              nan
  5.081875073251  -0.260067709279   0.036886544745
             nan              nan              nan
  5.298653811278  -0.096038219353   0.009668313632
             nan              nan              nan
  5.071265753844  -0.173586419695   0.113583188802
             nan              nan              nan
  4.853710176536  -0.100584477567   0.210571095157
             nan              nan              nan
             nan              nan              nan
             nan              nan              nan
             nan              nan              nan
  4.435312678172   0.111228750512   0.051735548773
             nan              nan              nan
             nan              nan              nan
             nan              nan              nan
             nan              nan              nan
             nan              nan              nan
             nan              nan              nan
  5.521715004259   0.337144255764  -0.011132875561
             nan              nan              nan
             nan              nan              nan
             nan              nan              nan
             nan              nan              nan
             nan              nan              nan
             nan              nan              nan
             nan              nan              nan
  6.169792004616   0.293340902757  -0.552308980355
             nan              nan              nan
  5.507865247319   0.124436323815   0.030486016301
  5.843349386830  -0.147640125245  -0.395031219462
             nan              nan              nan
  4.509826140470   0.019802364481  -0.193237872819
             nan              nan              nan
  5.439167948944  -0.542818068571   0.085632817534
             nan              nan              nan
             nan              nan              nan
             nan              nan              nan
             nan              nan              nan
  5.420539661583   0.006051739404  -0.406720312170
  4.588081330621   0.195761671700  -0.150256863097
             nan              nan              nan
  4.345692314097   0.278181361641   0.002935576308
             nan              nan              nan
             nan              nan              nan
             nan              nan              nan
             nan              nan              nan
             nan              nan              nan
             nan              nan              nan
  5.373670683358  -0.203415612025  -0.058278244201
  4.963793215991  -0.350665018796   0.259386350589
  4.352391337488  -0.076802223511   0.032266603236
  4.577318229240  -0.007012047304  -0.169553544560
             nan              nan              nan
             nan              nan              nan
  4.953186732413  -0.273976631876  -0.013435940658
  5.134155000917   0.188208823009  -0.278806346268
             nan              nan              nan
             nan              nan              nan
             nan              nan              nan
             nan              nan              nan
             nan              nan              nan
             nan              nan              nan
             nan              nan              nan
             nan              nan              nan
  4.746051584768  -0.055171304561  -0.185327107240
             nan              nan              nan
             nan              nan              nan
  4.032673571014   0.023319895121   0.025178722809
             nan              nan              nan
             nan              nan              nan
  3.490383477490   0.570264063722   0.214356777549
  3.893787444342   0.172790180863   0.318521355483
             nan              nan              nan
             nan              nan              nan
  5.024117941770  -0.350320366486   0.110254467953
             nan              nan              nan
             nan              nan              nan
             nan              nan              nan
             nan              nan              nan
             nan              nan              nan
             nan              nan              nan
             nan              nan              nan
             nan              nan              nan
             nan              nan              nan
             nan              nan              nan
             nan              nan              nan
             nan              nan              nan
             nan              nan              nan
  4.921458501049  -0.118169843052   0.184191735934
             nan              nan              nan
  4.674979878758   0.332760584664  -0.130587092280
             nan              nan              nan
             nan              nan              nan
  4.779762535531   0.526914328449   0.044848594973
  5.484541187936   0.011731984186   0.000180258229
             nan              nan              nan
  4.880606170822  -0.288743665836  -0.076020097268
  4.484425943298  -0.011757111147   0.030437285088
  4.867755132925   0.192778411384  -0.245805936781
             nan              nan              nan
  5.376620611056   0.010084770937   0.004497416018
             nan              nan              nan
  4.714535410932   0.579516616799  -0.167311599419
             nan              nan              nan
             nan              nan              nan
  5.565472111815   0.077773699827  -0.062753137465
             nan              nan              nan
             nan              nan              nan
             nan              nan              nan
             nan              nan              nan
             nan              nan              nan
  5.256005643897   0.246239934788  -0.494272131359
             nan              nan              nan
  5.642876562307  -0.245549344498  -0.434046347852
             nan              nan              nan
             nan              nan              nan
             nan              nan              nan
             nan              nan              nan
             nan              nan              nan
             nan              nan              nan
             nan              nan              nan
             nan              nan              nan
             nan              nan              nan
             nan              nan              nan
             nan              nan              nan
             nan              nan              nan
  5.100421176355  -0.087745144110  -0.035898586552
             nan              nan              nan
  5.237704042524   0.093047402451   0.238805330439
             nan              nan              nan
             nan              nan              nan
             nan              nan              nan
             nan              nan              nan
  5.106949084384  -0.310954636796  -0.088214455295
             nan              nan              nan
             nan              nan              nan
             nan              nan              nan
  4.735964651780   0.181129853846   0.387119138028
             nan              nan              nan
             nan              nan              nan
             nan              nan              nan
  3.707664175404   0.150803119615   0.298318380740
             nan              nan              nan
  5.222205073112   0.487820916302  -0.332536635923
  5.361155241477   0.312779022834  -0.267235864988
             nan              nan              nan
             nan              nan              nan
             nan              nan              nan
             nan              nan              nan
             nan              nan              nan
             nan              nan              nan
  4.556702375215   0.136240780116   0.379749822025
  5.226812513871   0.414038794411  -0.164795000076
  5.234802102852  -0.409891388204  -0.315499311193
  4.744845233566  -0.443357616222   0.087820388662
  4.384367464544   0.136498069567  -0.004022359075
  4.336938255200  -0.150352823836   0.179424898312
             nan              nan              nan
             nan              nan              nan
             nan              nan              nan
             nan              nan              nan
             nan              nan              nan
             nan              nan              nan
             nan              nan              nan
             nan              nan              nan
  5.254991530464  -0.156366691001   0.065073832879
             nan              nan              nan
             nan              nan              nan
  4.497066292144   0.135407560664   0.190514611353
             nan              nan              nan
             nan              nan              nan
  4.935301137615   0.110565777379  -0.003405655063
             nan              nan              nan
             nan              nan              nan
             nan              nan              nan
             nan              nan              nan
             nan              nan              nan
             nan              nan              nan
  5.146176914802  -0.225580249604   0.130793182025
             nan              nan              nan
  5.207748019326  -0.305680245950   0.162208176752
             nan              nan              nan
  4.911214596842   0.077441376692   0.433225195800
             nan              nan              nan
             nan              nan              nan
             nan              nan              nan
             nan              nan              nan
             nan              nan              nan
  5.507055099151   0.081638790745  -0.249016844533
  5.625863413633   0.214133270902  -0.278781211683
             nan              nan              nan
  4.600808950465   0.035201336815   0.050873910442
  3.913923601217  -0.058147651864   0.108544367463
             nan              nan              nan
  4.578325403327  -0.135562177118   0.091580917265
             nan              nan              nan
  5.091525322777  -0.460703468274   0.082006828575
             nan              nan              nan
             nan              nan              nan
             nan              nan              nan
             nan              nan              nan
             nan              nan              nan
             nan              nan              nan
             nan              nan              nan
  5.313388327097  -0.243682261663   0.367100802351
             nan              nan              nan
             nan              nan              nan
  4.656455075837   0.010886650029   0.105063444983
             nan              nan              nan
             nan              nan              nan
             nan              nan              nan
             nan              nan              nan
             nan              nan              nan
             nan              nan              nan
             nan              nan              nan
             nan              nan              nan
  3.928633306652  -0.241777436802   0.048384488664
             nan              nan              nan
             nan              nan              nan
  4.237395343065  -0.074777446360   0.213715505184
  5.334693554295   0.051924870247   0.337711421688
             nan              nan              nan
             nan              nan              nan
             nan              nan              nan
             nan              nan              nan
             nan              nan              nan
             nan              nan              nan
             nan              nan              nan
             nan              nan              nan
  5.320319250659  -0.364912471642  -0.052291328392
  4.782671016067  -0.099360725218   0.038824991817
             nan              nan              nan
             nan              nan              nan
             nan              nan              nan
             nan              nan              nan
  4.597380788175   0.106586478558   0.379867144178
             nan              nan              nan
             nan              nan              nan
  4.981596205513  -0.085501628821  -0.131294015961
             nan              nan              nan
             nan              nan              nan
             nan              nan              nan
  5.709630978299   0.073996294035   0.317273328728
             nan              nan              nan
             nan              nan              nan
             nan              nan              nan
  5.686860818316   0.466674180873  -0.494381276877
  6.256744295924   0.358582735342  -0.323125659302
  5.048819383434   0.047638347636  -0.113796085194
             nan              nan              nan
             nan              nan              nan
  5.499165187255  -0.426160130013  -0.158731215041
             nan              nan              nan
             nan              nan              nan
             nan              nan              nan
             nan              nan              nan
  4.808964847668   0.151494699327   0.073426458791
             nan              nan              nan
             nan              nan              nan
             nan              nan              nan
  5.376424646362   0.221148055857   0.270671016520
  4.919432567329  -0.350333164904   0.266811248979
             nan              nan              nan
             nan              nan              nan
             nan              nan              nan
             nan              nan              nan
             nan              nan              nan
             nan              nan              nan
             nan              nan              nan
  4.565900808903  -0.488523976421   0.036513302571
             nan              nan              nan
  5.575670681280  -0.046328572215  -0.224863352630
             nan              nan              nan
             nan              nan              nan
  5.636646187368   0.147924326809  -0.017506380860
             nan              nan              nan
             nan              nan              nan
  4.821638566945  -0.146634769260  -0.323642480240
             nan              nan              nan
             nan              nan              nan
             nan              nan              nan
             nan              nan              nan
  4.561208990585  -0.096310085239   0.019948019261
             nan              nan              nan
             nan              nan              nan
             nan              nan              nan
  4.759732708449   0.040225251750   0.069884933164
  4.215831814860  -0.344182947660  -0.383961841180
             nan              nan              nan
             nan              nan              nan
             nan              nan              nan
  4.847901622836   0.320397731472  -0.004868058715
             nan              nan              nan
             nan              nan              nan
  5.217303732537   0.014217684050  -0.277751321407
  4.247650104967  -0.046475656894   0.049884151849
             nan              nan              nan
             nan              nan              nan
             nan              nan              nan
  4.543453001746  -0.311015895301  -0.064097048615
  4.694774143679  -0.508616430567   0.100656772682
  4.109739118364   0.129265616866   0.081881664487
             nan              nan              nan
             nan              nan              nan
  4.301972686103  -0.056844276750  -0.043102403063
  4.069823132058   0.253196611954   0.168243230787
             nan              nan              nan
             nan              nan              nan
  4.218656961104  -0.260401620597   0.356363507118
             nan              nan              nan
             nan              nan              nan
             nan              nan              nan
             nan              nan              nan
  4.444690752782  -0.064696039844   0.372801082151
             nan              nan              nan
             nan              nan              nan
             nan              nan              nan
             nan              nan              nan
  5.550564313326  -0.034180162398  -0.031114431966
             nan              nan              nan
             nan              nan              nan
             nan              nan              nan
             nan              nan              nan
             nan              nan              nan
  5.567414743417   0.047679472868   0.067547739838
             nan              nan              nan
             nan              nan              nan
  5.070282391453  -0.196009702204  -0.186617739747
             nan              nan              nan
             nan              nan              nan
             nan              nan              nan
  5.184272202174   0.241798379578  -0.346856843695
             nan              nan              nan
             nan              nan              nan
             nan              nan              nan
  4.141175372189   0.569502853786  -0.097844333515
  4.268105223568   0.030682396916   0.216781061858
             nan              nan              nan
             nan              nan              nan
             nan              nan              nan
             nan              nan              nan
  5.042729831336  -0.051427926986  -0.069798075796
             nan              nan              nan
  4.446839169294   0.142082683272   0.517666711637
  5.185894080118  -0.046679260643  -0.009612039467
             nan              nan              nan
  5.238804926639  -0.103847296897  -0.180074725862
  4.505446826066   0.148124714447   0.079049610305
             nan              nan              nan
             nan              nan              nan
             nan              nan              nan
             nan              nan              nan
             nan              nan              nan
             nan              nan              nan
             nan              nan              nan
             nan              nan              nan
  5.620594403232  -0.470178191749   0.157919386210
  4.938634507001  -0.220264862310  -0.199920867022
             nan              nan              nan
             nan              nan              nan
             nan              nan              nan
             nan              nan              nan
             nan              nan              nan
             nan              nan              nan
  4.963625329429   0.112385275516   0.111797436386
  5.757761096704  -0.066612686346  -0.025913054202
             nan              nan              nan
             nan              nan              nan
             nan              nan              nan
             nan              nan              nan
             nan              nan              nan
  4.742053410729  -0.132553144926   0.127031490121
             nan              nan              nan
             nan              nan              nan
             nan              nan              nan
  4.776441816360   0.046293860927  -0.277662007997
             nan              nan              nan
             nan              nan              nan
             nan              nan              nan
             nan              nan              nan
             nan              nan              nan
             nan              nan              nan
  5.877720413198   0.009857899242   0.007582753732
             nan              nan              nan
  5.259214635290  -0.005782202354  -0.189860496559
             nan              nan              nan
             nan              nan              nan
             nan              nan              nan
             nan              nan              nan
             nan              nan              nan
             nan              nan              nan
             nan              nan              nan
  4.712312794999   0.235355294506   0.035590157883
  5.115462378226  -0.244954221314  -0.206639684427
             nan              nan              nan
             nan              nan              nan
             nan              nan              nan
  5.270349217133  -0.206138514959  -0.147299969658
             nan              nan              nan
             nan              nan              nan
             nan              nan              nan
             nan              nan              nan
             nan              nan              nan
  5.420781121225   0.047642793739  -0.492062337953
             nan              nan              nan
             nan              nan              nan
             nan              nan              nan
             nan              nan              nan
  3.555856831800   0.059562336530   0.511279953981
             nan              nan              nan
             nan              nan              nan
             nan              nan              nan
             nan              nan              nan
             nan              nan              nan
  4.598955957848   0.233216014894   0.362595823400
             nan              nan              nan
             nan              nan              nan
             nan              nan              nan
             nan              nan              nan
             nan              nan              nan
  5.354098469258  -0.062443999764  -0.444731332433
             nan              nan              nan
             nan              nan              nan
             nan              nan              nan
             nan              nan              nan
  5.301192362169   0.165596431257  -0.308152662665
             nan              nan              nan
             nan              nan              nan
             nan              nan              nan
             nan              nan              nan
  5.832790634557   0.031092511273  -0.185007627655
             nan              nan              nan
  5.582178036784   0.039024581243  -0.328370199498
  5.446681905039  -0.131776542504   0.054303315868
             nan              nan              nan
             nan              nan              nan
  4.755867395622   0.288767743012   0.039158220551
             nan              nan              nan
             nan              nan              nan
  5.776916248165   0.252319421912  -0.236895019669
             nan              nan              nan
  4.907614726048   0.193568650260  -0.344357978424
             nan              nan              nan
             nan              nan              nan
  5.122430259005  -0.103987515848  -0.277007061767
             nan              nan              nan
  5.478422567091   0.180159069844   0.040186232470
             nan              nan              nan
             nan              nan              nan
             nan              nan              nan
  4.921614110652  -0.140826829373   0.228906894646
             nan              nan              nan
             nan              nan              nan
             nan              nan              nan
             nan              nan              nan
             nan              nan              nan
  4.793979172883  -0.226945729922   0.001274692067
             nan              nan              nan
             nan              nan              nan
             nan              nan              nan
  4.991339244286   0.057065669061  -0.137931744230
             nan              nan              nan
  5.498773835390   0.075249281713  -0.032173833679
             nan              nan              nan
             nan              nan              nan
             nan              nan              nan
             nan              nan              nan
  5.921699926982  -0.242505361861   0.237246689166
             nan              nan              nan
             nan              nan              nan
             nan              nan              nan
  4.263341235125  -0.334155222305   0.240132786781
             nan              nan              nan
             nan              nan              nan
  3.835786683647   0.113048810101   0.463308802808
             nan              nan              nan
             nan              nan              nan
             nan              nan              nan
             nan              nan              nan
             nan              nan              nan
             nan              nan              nan
             nan              nan              nan
             nan              nan              nan
  4.856917046114  -0.439833901668  -0.058622440367
             nan              nan              nan
  5.466047195673   0.133541451729   0.268634114628
             nan              nan              nan
             nan              nan              nan
             nan              nan              nan
             nan              nan              nan
             nan              nan              nan
  5.092863959249  -0.161642117381  -0.079663007663
             nan              nan              nan
             nan              nan              nan
  5.319872946661   0.049654863028   0.362943819465
  5.666925625077  -0.198600770186  -0.218616754160
  4.883973486285  -0.096626168974   0.121979172987
             nan              nan              nan
  3.909219079460  -0.495259482397   0.286046561805
  4.261203056186   0.058174925672   0.083933356038
             nan              nan              nan
             nan              nan              nan
  4.671953926651  -0.106660552376   0.621626380152
             nan              nan              nan
             nan              nan              nan
             nan              nan              nan
             nan              nan              nan
             nan              nan              nan
             nan              nan              nan
             nan              nan              nan
             nan              nan              nan
  4.739172960011  -0.374545772563  -0.128391774445
  4.871415234146   0.115323191221   0.209332113732
  4.117555715810   0.397573321252   0.378885294002
  4.716031954810   0.132036509963  -0.465376073061
  4.953225265921  -0.075558273697  -0.056492776002
             nan              nan              nan
             nan              nan              nan
             nan              nan              nan
             nan              nan              nan
  4.400947709922   0.082576735186   0.238656902129
             nan              nan              nan
  5.717999761256  -0.132467165108  -0.277643041448
             nan              nan              nan
  4.904138416331   0.270902801143  -0.058408897844
             nan              nan              nan
             nan              nan              nan
             nan              nan              nan
             nan              nan              nan
             nan              nan              nan
  5.361205539551   0.131987971593   0.038400189403
  6.213694080974   0.104880933063  -0.322373444971
  5.039697689136   0.256199246865   0.251987969742
             nan              nan              nan
  5.714650320452  -0.063085030953  -0.315749558665
             nan              nan              nan
  4.804739837846   0.022251533542   0.046041388861
  4.655437615476   0.020524095668  -0.213736182688
             nan              nan              nan
  4.485097050414  -0.099802816157   0.146599110636
  4.291387566677   0.363706697927   0.337989360197
  4.862729772878   0.221126744601   0.028096201581
             nan              nan              nan
             nan              nan              nan
             nan              nan              nan
  4.487561455494  -0.434497637424   0.275393674163
  5.086268305644  -0.117871575246   0.455729713136
             nan              nan              nan
             nan              nan              nan
             nan              nan              nan
             nan              nan              nan
             nan              nan              nan
  3.835501002250  -0.142790068776   0.134632480289
             nan              nan              nan
             nan              nan              nan
             nan              nan              nan
  4.267710066605  -0.210331613343  -0.112928671372
  4.160064700175   0.139092203892  -0.068554058895
             nan              nan              nan
             nan              nan              nan
  5.335782446666   0.115171533702   0.151122829233
             nan              nan              nan
  5.201588315746  -0.338897427025  -0.015540528311
             nan              nan              nan
  6.311153639174   0.025207074077  -0.865020355713
             nan              nan              nan
  4.308877433349   0.160921977432   0.236746566010
             nan              nan              nan
             nan              nan              nan
  4.697188182427   0.290980344737   0.258070260481
  4.262446699517   0.395762817844   0.226863681542
             nan              nan              nan
             nan              nan              nan
             nan              nan              nan
             nan              nan              nan
  5.617754340145  -0.630884344692  -0.201851760491
             nan              nan              nan
             nan              nan              nan
             nan              nan              nan
  5.760115637076  -0.187315093499   0.199587337094
  4.907458259908   0.170085010215   0.544389105132
  4.883076662903  -0.338416112388  -0.164563499221
             nan              nan              nan
  3.979737032852   0.446412246120   0.113848934319
             nan              nan              nan
             nan              nan              nan
  5.469713934744  -0.112204604146  -0.033087115621
             nan              nan              nan
             nan              nan              nan
  4.743194419794   0.179874201665  -0.410625812154
  5.191583727598  -0.180932494218  -0.009510536750
             nan              nan              nan
             nan              nan              nan
  4.681924260697   0.033769872053   0.213730084855
  4.906112146307  -0.396122001013  -0.331077561842
             nan              nan              nan
             nan              nan              nan
  4.239592583229  -0.120487574411  -0.170863006839
             nan              nan              nan
             nan              nan              nan
             nan              nan              nan
             nan              nan              nan
             nan              nan              nan
             nan              nan              nan
             nan              nan              nan
             nan              nan              nan
  4.999752152885  -0.469076975121   0.239216301404
             nan              nan              nan
  4.742234636158   0.137735425874  -0.207491864805
             nan              nan              nan
             nan              nan              nan
  5.332936776005  -0.087790695943   0.176123084693
             nan              nan              nan
             nan              nan              nan
  4.551388874224  -0.109982422651   0.373858539749
             nan              nan              nan
             nan              nan              nan
             nan              nan              nan
             nan              nan              nan
             nan              nan              nan
             nan              nan              nan
  4.540708665549   0.539490547066   0.154087008276
             nan              nan              nan
             nan              nan              nan
             nan              nan              nan
             nan              nan              nan
             nan              nan              nan
             nan              nan              nan
             nan              nan              nan
             nan              nan              nan
  4.626649163702   0.361485670788  -0.055524517264
  5.095861059149  -0.410558350767   0.082642498766
  5.158275740696  -0.041674595248   0.043900982347
             nan              nan              nan
  5.108685483060   0.333432690226   0.018868494692
  5.338256728441   0.769893687293  -0.066675687778
             nan              nan              nan
             nan              nan              nan
  4.943813751361   0.220484717307   0.044895965964
             nan              nan              nan
             nan              nan              nan
             nan              nan              nan
  5.263707272344  -0.302080320562  -0.261282195598
             nan              nan              nan
  4.881698435179   0.124816053925  -0.099442799952
             nan              nan              nan
             nan              nan              nan
             nan              nan              nan
             nan              nan              nan
             nan              nan              nan
  5.435322949007   0.417515240490   0.017537007026
             nan              nan              nan
             nan              nan              nan
             nan              nan              nan
             nan              nan              nan
             nan              nan              nan
             nan              nan              nan
             nan              nan              nan
             nan              nan              nan
  5.737974672930   0.429473871013  -0.383822845718
             nan              nan              nan
             nan              nan              nan
             nan              nan              nan
             nan              nan              nan
             nan              nan              nan
             nan              nan              nan
             nan              nan              nan
  5.460485481175  -0.035670287835  -0.490947709599
             nan              nan              nan
             nan              nan              nan
             nan              nan              nan
             nan              nan              nan
  4.637673553536  -0.210283458271  -0.137110508987
  4.860304819502  -0.319607515309   0.294076450284
  4.768633612992  -0.539549708238   0.014284194743
             nan              nan              nan
             nan              nan              nan
  4.424019659448   0.302491886254   0.246148007033
  4.547241708521   0.364983546588   0.031179582086
             nan              nan              nan
  4.761803972385  -0.034583356714   0.202095492123
             nan              nan              nan
             nan              nan              nan
             nan              nan              nan
             nan              nan              nan
  4.719749218048   0.009502378968   0.233306492340
             nan              nan              nan
             nan              nan              nan
  4.307382144564  -0.032331103969   0.125600671278
  5.335439673697  -0.303069618661  -0.083812137191
             nan              nan              nan
  4.429177855631  -0.015621526762   0.261288633583
             nan              nan              nan
  4.975657558823  -0.048001878182  -0.236421465701
             nan              nan              nan
             nan              nan              nan
  6.113833988890  -0.166452970968  -0.057224084878
             nan              nan              nan
             nan              nan              nan
  5.770779899167   0.039670358467  -0.145425430925
  5.222169590579  -0.149867039994   0.466882044002
  5.743659172678  -0.137951972525  -0.470168738529
  6.167814762188   0.146302679694   0.053875745886
             nan              nan              nan
             nan              nan              nan
             nan              nan              nan
             nan              nan              nan
  4.261441875008   0.178233625282   0.138805337080
             nan              nan              nan
             nan              nan              nan
  4.342267038567   0.223045484461  -0.024511457206
             nan              nan              nan
             nan              nan              nan
             nan              nan              nan
             nan              nan              nan
             nan              nan              nan
             nan              nan              nan
  5.431757511351  -0.475850115508   0.177250081407
             nan              nan              nan
             nan              nan              nan
             nan              nan              nan
             nan              nan              nan
             nan              nan              nan
             nan              nan              nan
             nan              nan              nan
  4.413560840078  -0.123859149473   0.119071030244
  4.330980230725   0.343879109977   0.650443694609
             nan              nan              nan
  4.576875615858   0.249397066793   0.011397879975
             nan              nan              nan
             nan              nan              nan
             nan              nan              nan
             nan              nan              nan
             nan              nan              nan
  4.849424399648   0.082441958584   0.184224010898
             nan              nan              nan
  5.808157130272   0.085070700199  -0.199799213752
  5.596471481048  -0.041352056747  -0.515751932533
             nan              nan              nan
  5.309743036851   0.436517567990   0.324441035590
             nan              nan              nan
             nan              nan              nan
             nan              nan              nan
  5.083873093101  -0.276077279453  -0.355301059756
  4.405468796367  -0.084900135409  -0.207059838811
  4.950304777907   0.108777432397  -0.233123693666
             nan              nan              nan
             nan              nan              nan
  5.187801340466  -0.041596827192  -0.188159727902
  4.762748990047  -0.344101305345   0.437404604708
             nan              nan              nan
             nan              nan              nan
             nan              nan              nan
             nan              nan              nan
             nan              nan              nan
             nan              nan              nan
  4.889955483602   0.350037017553   0.268607078248
  4.950038908778   0.128766836904   0.174046024097
  4.933382874347   0.373685228639  -0.006393430769
             nan              nan              nan
  5.010576774381   0.244237765633   0.227511074941
             nan              nan              nan
             nan              nan              nan
  4.714875579751  -0.494598759851   0.248254757878
             nan              nan              nan
             nan              nan              nan
             nan              nan              nan
             nan              nan              nan
             nan              nan              nan
             nan              nan              nan
             nan              nan              nan
             nan              nan              nan
             nan              nan              nan
             nan              nan              nan
             nan              nan              nan
             nan              nan              nan
  4.532432459955  -0.003796005130   0.272832835867
  4.456698409426   0.276227576822   0.072963673599
             nan              nan              nan
  4.755952340049  -0.055472367865  -0.215436726645
