  7.254623044097  -3.200568990043  -1.066856330014
  6.250000000000   0.000000000000   0.000000000000
  6.250000000000   0.000000000000   0.000000000000
  7.535321821036  -3.532182103611   1.177394034537
  2.409552917762   0.639704314450   0.426469542967
  5.877648940424   0.000000000001   1.199520191923
  6.618778860954   0.000000000000   1.539250897896
  5.084745762712   3.050847457628   5.084745762711
  6.856084002470   2.779493514516  -0.926497838172
  7.974335472043  -4.124656278644   1.374885426215
  4.972375690606   5.524861878453   0.000000000000
  7.692307692308   0.000000000000   0.000000000000
  7.142857142857   0.000000000000  -0.000000000000
  4.972375690606   5.524861878453  -0.000000000000
  5.734038226922  -1.830012200081   0.610004066694
  4.143162808792  -0.000000000001  -0.583544057576
  3.122966818477   4.391672088484   0.487963565387
  5.555555555555  -0.000000000002   0.000000000001
  7.058823529411   0.000000000000   1.764705882355
  6.250000000000   0.000000000000   0.000000000000
  2.575463860426  -3.738576571587   2.076986984215
  5.882352941176   0.000000000000   0.000000000000
  5.197777051325   1.471068976788   0.490356325597
  4.609349460608  -1.471068976789  -2.451781627984
  5.563480741798   0.000000000000   1.069900142653
  6.250000000000   0.000000000000   0.000000000002
  6.250000000000   0.000000000000   0.000000000000
  5.882352941176   0.000000000000  -0.000000000002
  6.432748538009   2.923976608189   2.923976608186
  4.153094462540   3.664495114007  -2.442996742670
  5.465795806119  -0.000000000002  -1.031282227570
  4.961606615476   1.329001772002   0.443000590667
  3.760071620414   2.014324082361  -4.700089525516
  7.118644067794  -3.050847457629   1.016949152543
  5.555555555557   0.000000000004  -0.000000000001
  4.545454545454  -0.000000000003  -0.000000000001
  6.038426349495  -2.058554437330   0.686184812443
  3.846153846154   0.000000000000  -0.000000000001
  5.545077329314   1.697472651823  -0.565824217281
  4.730983302413  -4.174397031538   1.391465677179
  5.454545454549   1.636363636357   0.545454545455
  5.280000000000   0.000000000000   0.959999999998
  6.483300589391   0.000000000006  -1.473477406679
  6.870229007629  -3.816793893132   3.816793893132
  7.142857142858   0.000000000000   0.000000000000
  3.609022556392   0.676691729321   0.225563909776
  7.142857142856  -0.000000000007   0.000000000002
  6.145783706530  -2.143878037158  -0.714626012386
  4.545454545455   0.000000000003  -0.000000000001
  5.228758169934   1.633986928106  -1.633986928103
  4.380039224232   0.000000000000   0.653737197645
  6.249999999999   0.000000000000  -0.000000000000
  4.719101123597   4.044943820225  -1.348314606742
  4.615384615387  -5.538461538462   1.846153846154
  8.333333333333  -0.000000000010   0.000000000003
  8.333333333333   0.000000000000  -0.000000000000
 10.000000000001  -0.000000000000  -0.000000000000
  4.814609850580  -1.245157719979  -0.415052573326
 11.111111111107   0.000000000000   0.000000000000
  5.832628909551  -1.901944209638  -0.633981403213
  6.856084002467   2.779493514516  -0.926497838177
  3.738469007930   0.728273183364   0.242757727785
  3.139013452915  -3.363228699551   1.121076233184
  4.969485614647   1.961639058410  -3.269398430690
  4.615384615382   0.000000000000  -3.076923076925
  5.038167938932   1.374045801525  -0.458015267175
  4.961606615476  -1.329001772004   0.443000590668
  3.448275862069   0.000000000000  -0.000000000001
  6.182212581350   0.000000000000   3.253796095442
  5.263157894737   0.000000000000  -0.000000000000
  6.106539627546   0.000000000000  -1.299263750540
  5.000000000002  -5.000000000000  -0.000000000002
  7.017543859643  -4.385964912280   4.385964912280
  3.783604381016   0.746764022570  -0.248921340857
  7.924528301890   0.000000000000  -2.264150943393
  3.426791277256   3.115264797509   3.115264797506
  7.142857142856   0.000000000000  -0.000000000000
  4.077669902914  -0.873786407763  -0.291262135924
  3.428042001234   1.389746757258  -0.463248919086
  4.608410979601   1.133215814657  -0.377738604881
  3.426791277258  -3.115264797510  -3.115264797504
  4.185473943373  -0.923266311039   0.307755437010
  6.666666666669   0.000000000000   0.000000000008
  4.508670520232   0.000000000000  -0.693641618494
  5.545077329307  -1.697472651830  -0.565824217277
  6.250000000000   0.000000000000   0.000000000000
  8.123791102511   4.352030947779  -1.450676982593
  5.832628909551  -1.901944209638  -0.633981403213
  6.250000000001  -0.000000000011   0.000000000004
  8.571428571425   5.142857142862  -1.714285714287
  6.666666666665   0.000000000000   0.000000000000
  1.922067009769  -0.945278857262   2.205650666948
  4.389420371410   1.266178953293   2.110298255488
  7.142857142856   0.000000000000   0.000000000000
  6.483300589393  -0.000000000000  -1.473477406683
  5.545077329309   1.697472651831  -0.565824217277
  6.250000000000   0.000000000011  -0.000000000004
  4.942753420832   0.000000000007  -0.837754817089
  3.833865814696   0.798722044729  -0.798722044729
  4.025704025703   0.850500850502   0.283500283501
  5.734038226926  -1.830012200075   0.610004066698
  5.882352941175  -0.000000000010   0.000000000003
  7.254623044094  -3.200568990045  -1.066856330015
  2.189781021899   3.550996251726   0.591832708624
  5.691056910569   2.032520325206   2.032520325206
  5.000000000004   0.000000000000  -5.000000000000
  6.249999999999   0.000000000011   0.000000000004
  6.038426349496  -2.058554437331   0.686184812444
  3.066271018793  -0.494559841741   0.494559841740
  6.250000000002   0.000000000000   0.000000000000
  4.545454545455   0.000000000000   0.000000000000
  5.882352941174  -0.000000000000   0.000000000000
  8.423326133903   4.859611231101   1.619870410367
  6.666666666665   0.000000000000   0.000000000000
  3.200093775642  -0.527487984996  -0.175829328332
  8.123791102532  -4.352030947764  -1.450676982588
  3.740214554945   0.000000000000   3.479269353435
  3.692307692308   0.000000000000  -0.461538461536
  5.563480741797   0.000000000000   1.069900142654
  6.856084002468  -2.779493514517  -0.926497838172
  7.017543859654  -4.385964912289  -4.385964912273
  6.870229007638  -3.816793893136  -3.816793893122
  5.454545454544  -1.636363636365   0.545454545455
  5.882352941176   0.000000000000   0.000000000006
  3.448275862069   0.000000000003  -0.000000000001
  9.090909090905   0.000000000000   0.000000000000
  5.280000000001   0.000000000000   0.960000000001
 10.344827586207  -0.000000000000   4.137931034488
  6.249999999999   0.000000000000  -0.000000000007
  5.280974949222   1.523358158431  -0.507786052810
  2.696258253851   0.825385179751   0.550256786501
  7.010475423042   0.000000000000   4.834810636586
  4.999999999999   0.000000000000  -0.000000000000
  4.494382022469   0.000000000000   2.808988764046
  5.545077329307  -1.697472651830  -0.565824217277
  7.383419689117   0.000000000000  -1.943005181348
  5.263157894738   0.000000000000   0.000000000000
  4.779547980736  -1.667284179329   2.778806965542
  7.535321821031   3.532182103610   1.177394034537
  4.143162808792   0.000000000000  -0.583544057574
  6.106539627544   0.000000000000  -1.299263750543
  5.111402359103  -2.948885976408  -4.914809960679
  4.447439353110  -6.064690026959   2.021563342320
  6.729634002368  -2.656434474607   0.885478158212
  6.145783706524  -2.143878037161  -0.714626012387
  5.734038226921   1.830012200083   0.610004066694
  6.227436823103   0.000000000000   1.353790613719
  9.090909090909   0.000000000000   0.000000000000
  3.947368421060  -4.554655870446   3.036437246968
  6.250000000000  -0.000000000000   0.000000000007
  8.333333333333   0.000000000000   0.000000000000
  4.761904761906   0.000000000000   0.000000000000
  5.263157894735  -0.000000000015  -0.000000000005
  2.819237147594   0.414593698174   0.414593698180
  6.741573033726   0.000000000000   4.213483146061
  6.249999999997   0.000000000000   0.000000000014
  2.368573079145   0.288850375508   0.288850375505
  5.038167938927  -1.374045801535  -0.458015267178
  5.454545454540   1.636363636372   0.545454545445
  1.342841969500  -2.048403004325  -0.910401335254
  7.317073170725   0.000000000000  -5.853658536584
  5.882352941173   0.000000000000   0.000000000000
  3.009339328955   4.669664475962   0.518851608444
  3.374313366467  -0.588543029032   0.196181009677
  6.432748538030  -2.923976608184   2.923976608184
  6.870229007639   3.816793893117   3.816793893145
  3.167316961211  -0.516410374114   0.172136791371
  5.228758169930  -1.633986928114  -1.633986928102
  5.734038226916  -1.830012200093   0.610004066698
 10.000000000012   0.000000000000   0.000000000000
  6.666666666664   0.000000000000  -0.000000000016
  6.666666666667   0.000000000000   0.000000000000
  4.814609850578   1.245157719986  -0.415052573329
  8.121019108284   0.000000000000   2.388535031836
  4.370179948571   2.570694087412   0.000000000000
  6.250000000000  -0.000000000022   0.000000000007
  4.166666666666   0.000000000000   0.000000000000
  9.090909090914   0.000000000000   0.000000000000
  7.058823529407   0.000000000000   1.764705882364
  3.357314148681   0.599520383690  -0.599520383695
  3.066271018795  -0.494559841734  -0.494559841745
  5.454545454539  -1.636363636373   0.545454545458
  4.918032786889   0.000000000000  -4.098360655738
  6.106539627544   0.000000000000  -1.299263750550
  6.432748538014  -2.923976608175  -2.923976608196
  7.142857142856   0.000000000000  -0.000000000000
  3.487883457063  -0.630340383810   0.210113461270
  3.562741450851   0.000000000014  -0.429245957932
  5.555555555557   0.000000000000  -0.000000000000
  7.094594594590   0.000000000000  -5.067567567570
  3.374313366468   0.588543029033   0.196181009678
  3.256936067546   1.206272617617   0.000000000004
  5.832628909559  -1.901944209630  -0.633981403210
  6.666666666687  -3.333333333329  -3.333333333329
  5.877648940418   0.000000000000   1.199520191929
  6.145783706516  -2.143878037170  -0.714626012390
  5.197777051337   1.471068976771   0.490356325601
  5.877648940429   0.000000000000   1.199520191919
  5.545077329310   1.697472651821  -0.565824217274
  3.487883457065   0.630340383811   0.210113461270
  5.038167938934  -1.374045801521  -0.458015267174
  3.947368421052  -2.368421052634   1.578947368418
  6.486486486496  -2.432432432426  -0.810810810809
  3.222793087343  -0.000000000006  -0.350303596451
  5.228758169936  -1.633986928097  -1.633986928109
  3.877052043306   0.785888927711   0.261962975892
  5.734038226913  -1.830012200090   0.610004066697
  5.563480741796   0.000000000000   1.069900142648
  4.609349460611  -1.471068976784  -2.451781627984
  9.090909090908   0.000000000000  -0.000000000031
  5.545077329310   1.697472651821  -0.565824217274
  5.563480741800   0.000000000000   1.069900142649
  5.691056910564  -2.032520325215  -2.032520325200
  4.000000000000  -0.000000000009   0.000000000009
  1.771921853701  -2.044525215812  -1.703771013175
  4.719101123615   4.044943820222  -1.348314606741
  5.563480741804   0.000000000018   1.069900142644
  5.197777051331   1.471068976786   0.490356325595
  2.442771547086   2.765401751420  -0.460900291906
  4.999999999995  -5.000000000002   0.000000000009
  4.185473943371   0.923266311044   0.307755437008
  8.123791102532  -4.352030947764  -1.450676982588
  6.666666666667   0.000000000000   0.000000000000
  4.814609850578  -1.245157719986  -0.415052573329
 10.344827586214   0.000000000000   4.137931034464
  7.142857142852   0.000000000000  -0.000000000019
  6.666666666667   0.000000000000   0.000000000000
  3.934426229515  -1.475409836061  -3.442622950820
  3.783604381018  -0.746764022566  -0.248921340850
  7.017543859654   4.385964912261  -4.385964912294
 11.111111111116  -0.000000000000   0.000000000046
  3.589535591150   0.912593794366   2.129385520180
  9.090909090905   0.000000000000   0.000000000000
  4.347826086956  -0.000000000010   0.000000000003
  8.121019108284   0.000000000000   2.388535031836
  6.249999999998   0.000000000000   0.000000000000
  3.760071620421  -2.014324082359  -4.700089525520
  9.090909090914   0.000000000000   0.000000000000
  3.738632536203   0.000000000000   4.041764904009
  3.374313366468  -0.588543029033   0.196181009678
  5.936073059363   2.283105022822   2.283105022838
  3.153988868277   2.782931354359  -0.927643784786
  8.765315739870   0.000000000000   2.827521206394
  4.779547980738   1.667284179320   2.778806965546
  6.227436823104   0.000000000000   1.353790613711
  4.130808950099   3.872633390701   2.581755593815
  8.123791102532   4.352030947764  -1.450676982588
  6.666666666667   0.000000000000   0.000000000000
  3.937566512945   1.596310748483  -3.724725079818
  5.563480741802   0.000000000000   1.069900142637
  3.581267217634  -0.688705234149   0.688705234159
  6.666666666640   3.333333333346   3.333333333346
  5.877648940427  -0.000000000020   1.199520191926
  5.877648940423   0.000000000020   1.199520191924
  3.925434665712   0.806596164184  -0.268865388061
  7.679603633340   3.715937241962  -1.238645747321
  6.250000000000  -0.000000000022   0.000000000007
  3.411371237459   0.602006688960  -0.200668896320
  3.651209366814   0.693267601299  -0.231089200433
  6.833210874352  -0.000000000000  -4.408523144745
  5.882352941175  -0.000000000019  -0.000000000006
  5.545077329315  -1.697472651823  -0.565824217262
  5.023094688227   0.000000000000   0.866050808302
  3.651209366820   0.693267601284  -0.231089200433
  5.135284373281  -2.484815019318   4.141358365548
  6.250000000002   0.000000000000  -0.000000000000
  4.143162808791   0.000000000000  -0.583544057580
  5.454545454539   1.636363636373   0.545454545458
  3.488372093019   2.906976744185   2.906976744185
  9.090909090914   0.000000000000   0.000000000000
  5.691056910579   2.032520325197  -2.032520325197
  3.614457831335   2.168674698791  -5.060240963861
  6.666666666672   0.000000000000  -0.000000000000
  3.703703703703  -0.000000000008   0.000000000003
  7.383419689125   0.000000000000  -1.943005181340
  4.719101123591  -4.044943820227  -1.348314606742
  5.563480741801  -0.000000000018   1.069900142643
  5.882352941175  -0.000000000019  -0.000000000006
  5.545077329296  -1.697472651856  -0.565824217273
  6.106539627561   0.000000000000  -1.299263750526
  5.882352941176   0.000000000038  -0.000000000038
  5.545077329310   1.697472651843  -0.565824217281
  6.106539627527   0.000000000000  -1.299263750574
 11.111111111093   0.000000000000  -0.000000000000
  7.317073170692   0.000000000000  -5.853658536585
  6.038426349522   2.058554437304   0.686184812404
  4.417855499323   1.035434882638  -0.345144960864
  3.701015965138   0.000000000000   4.354136429608
  5.882352941184   0.000000000000   0.000000000000
  4.725692558359   4.888647474187  -1.629549158062
  6.666666666666   0.000000000000  -0.000000000033
  6.666666666669  -0.000000000049  -0.000000000016
  3.738469007929  -0.728273183368   0.242757727789
  6.666666666662   0.000000000000  -0.000000000000
  4.961606615468  -1.329001772007   0.443000590649
  4.241401139480   0.949567419293  -0.316522473098
  7.142857142856   0.000000000000   0.000000000000
  4.166666666670   0.000000000000   0.000000000000
  2.222222222224   1.111111111094   2.222222222229
  2.842892768077   0.897755610978  -0.299251870326
  4.380039224233   0.000000000022   0.653737197644
  7.142857142859   0.000000000000  -0.000000000038
  6.906232453696   0.000000000000  -1.684446939901
  5.882352941176   0.000000000000   0.000000000000
  6.038426349502  -2.058554437345   0.686184812387
  5.454545454534  -1.636363636369   0.545454545456
  7.094594594673   0.000000000000  -5.067567567551
  6.249999999994   0.000000000000   0.000000000000
  5.882352941169   0.000000000000   0.000000000000
  5.691056910591   2.032520325226   2.032520325166
  6.038426349521  -2.058554437305   0.686184812435
  2.964959568742   1.347708894892  -4.043126684636
  6.666666666669   0.000000000099   0.000000000033
  6.666666666662   0.000000000000  -0.000000000000
  6.250000000005   0.000000000043   0.000000000014
  7.254623044068  -3.200568990042  -1.066856330014
  6.038426349494   2.058554437341   0.686184812417
  7.535321821078  -3.532182103571   1.177394034524
  6.106539627544   0.000000000000  -1.299263750550
  3.124999999998  -0.000000000011  -0.000000000004
  5.279999999997  -0.000000000032   0.959999999994
  8.765315739872   0.000000000000   2.827521206435
  4.245283018857  -2.358490566049   0.000000000000
  2.674591381874  -0.371471025263   0.371471025252
  5.280974949249   1.523358158380  -0.507786052838
  6.432748538038  -2.923976608148  -2.923976608191
  8.123791102491   4.352030947794  -1.450676982598
  5.140758873894   2.753977968177   4.589963280295
  5.882352941174   0.000000000000   0.000000000026
  4.158415841611   3.564356435647   2.376237623752
  7.142857142859   0.000000000057   0.000000000019
  5.263157894735   0.000000000000  -0.000000000021
  2.000000000001   0.000000000000   4.000000000005
  5.555555555556  -0.000000000034   0.000000000011
  6.483300589403   0.000000000049  -1.473477406678
  6.483300589405   0.000000000049  -1.473477406643
  3.877052043311  -0.785888927704   0.261962975901
  6.870229007601  -3.816793893140  -3.816793893140
  8.333333333340   0.000000000000   0.000000000000
  8.765315739856  -0.000000000000   2.827521206424
  6.250000000011   0.000000000000   0.000000000000
  4.185473943373   0.923266311022   0.307755437021
  9.502262443412   0.000000000000   3.393665158377
  6.038426349429   2.058554437411   0.686184812470
  1.994717187353   2.049366973313  -0.136624464891
  5.014749262532  -1.474926253697  -1.474926253697
  2.818791946311   2.416107382568  -3.221476510054
  6.227436823093  -0.000000000045   1.353790613739
  5.454545454534  -1.636363636369   0.545454545456
  3.441835645676   0.000000000000  -0.400213447174
  6.106539627560  -0.000000000043  -1.299263750542
  4.143162808797   0.000000000000  -0.583544057568
  4.814609850594   1.245157719963  -0.415052573321
  7.118644067786   3.050847457646   1.016949152549
  7.017543859655  -4.385964912317  -4.385964912252
  7.010475423023  -0.000000000000   4.834810636612
  6.106539627553   0.000000000000  -1.299263750523
  7.383419689142   0.000000000065  -1.943005181350
  7.142857142852   0.000000000000   0.000000000038
  6.250000000008   0.000000000000   0.000000000029
  5.563480741794   0.000000000000   1.069900142660
  3.877052043324  -0.785888927671   0.261962975890
  6.666666666662   0.000000000000  -0.000000000000
  3.256936067561   1.206272617595   0.000000000009
  9.090909090923   0.000000000000   0.000000000000
  5.877648940417   0.000000000000   1.199520191958
  4.158415841556   3.564356435647   2.376237623764
  4.608410979599   1.133215814663  -0.377738604871
  7.254623044137   3.200568990010  -1.066856330003
  7.142857142852  -0.000000000057  -0.000000000019
  3.487883457067   0.630340383811   0.210113461261
  6.227436823132   0.000000000045   1.353790613691
  3.527387439061  -0.645253799818  -0.215084599949
  6.486486486509   2.432432432400  -0.810810810800
  5.197777051334  -1.471068976771   0.490356325634
  5.882352941184  -0.000000000038   0.000000000038
  4.166666666665   0.000000000019  -0.000000000006
  3.206106870262   4.122137404585   0.458015267183
  6.145783706555   2.143878037136  -0.714626012347
  3.562741450853   0.000000000000  -0.429245957937
  9.999999999979   0.000000000000  -0.000000000000
  5.454545454539  -1.636363636373   0.545454545458
  5.263157894739   0.000000000000   0.000000000000
  4.814609850611  -1.245157719940  -0.415052573313
  6.038426349492  -2.058554437343   0.686184812448
  5.877648940442   0.000000000000   1.199520191911
  4.615384615397   3.076923076917   0.000000000011
  6.618778860957   0.000000000000   1.539250897871
  5.882352941169   0.000000000000   0.000000000000
  6.856084002443  -2.779493514514  -0.926497838171
  5.279999999989   0.000000000000   0.960000000003
  5.000000000002   0.000000000028   0.000000000009
  4.417855499318  -1.035434882636  -0.345144960879
  7.679603633349   3.715937241975  -1.238645747325
 10.051546391725   0.000000000000  -3.865979381452
  8.571428571402   5.142857142882  -1.714285714294
  3.092783505167  -1.288659793798   1.288659793817
  6.666666666666   0.000000000000  -0.000000000033
  3.981348637014   0.000000000000  -0.538020086086
  7.679603633340   3.715937241962  -1.238645747321
 12.499999999987   0.000000000000  -0.000000000000
  5.769230769228  -0.000000000000  -1.153846153853
  7.254623044189   3.200568989966  -1.066856330036
  8.123791102481   4.352030947779  -1.450676982593
  4.545454545448   0.000000000000  -0.000000000000
  3.880190605859   0.000000000017   0.510551395506
  8.423326133894  -4.859611231142   1.619870410381
  6.729634002350   2.656434474631   0.885478158210
  5.197777051323   1.471068976799   0.490356325578
  4.158415841636   3.564356435645   2.376237623790
  5.563480741796  -0.000000000036   1.069900142648
  8.121019108267   0.000000000000   2.388535031857
  5.197777051312   1.471068976794   0.490356325598
  7.692307692292   0.000000000131   0.000000000044
  6.250000000000   0.000000000000   0.000000000029
  2.867019113470  -0.915006100030   0.305002033350
 10.051546391725  -0.000000000000  -3.865979381452
  6.666666666662   0.000000000000  -0.000000000000
  8.540925266921   0.000000000000  -2.669039145868
  5.280974949220  -1.523358158400  -0.507786052800
  3.981348637019  -0.000000000000  -0.538020086075
  7.974335472022  -4.124656278660   1.374885426220
  4.737975592269  -1.615218951923  -2.692031586490
  6.666666666662   0.000000000049   0.000000000049
  6.666666666672   0.000000000000   0.000000000000
 11.111111111093   0.000000000000  -0.000000000000
  4.370179948620  -2.570694087382   0.000000000019
  7.254623044086  -3.200568990063  -1.066856330021
  3.668861712156  -2.116650987797   4.938852304796
  6.729634002350   2.656434474631   0.885478158210
  5.263157894739   0.000000000000   0.000000000000
  3.703703703701   0.000000000000   0.000000000000
  7.118644067786   3.050847457646   1.016949152549
  6.666666666662   0.000000000000   0.000000000000
  4.166666666670   0.000000000000   0.000000000000
  6.666666666682   0.000000000000   0.000000000000
  3.529411764708   2.352941176459   2.352941176476
  5.769230769206   0.000000000000  -1.153846153900
  5.882352941184   0.000000000038   0.000000000038
  5.280974949215  -1.523358158437  -0.507786052812
  8.121019108300   0.000000000000   2.388535031816
  6.486486486476  -2.432432432445  -0.810810810815
  8.765315739898   0.000000000000   2.827521206376
  2.857142857148  -4.285714285712  -1.428571428571
  6.106539627536   0.000000000000  -1.299263750547
  4.096538583656  -2.858050174666  -1.905366783111
  4.961606615468   1.329001772008   0.443000590669
  5.555555555560   0.000000000000   0.000000000000
  6.906232453682   0.000000000000  -1.684446939936
  3.767123287677  -1.712328767118   0.000000000006
  8.991825613037  -6.130790190744  -2.043596730248
  3.416106461789   0.000000000000   0.823158183569
  3.157894736848  -0.557275541775   0.928792569658
  4.508670520233  -0.000000000023  -0.693641618511
  4.609349460630  -1.471068976772  -2.451781627976
  8.540925266906   0.000000000000  -2.669039145930
  6.486486486559   2.432432432370  -0.810810810790
  5.280974949209  -1.523358158434  -0.507786052811
  3.448275862079   1.379310344807  -0.000000000000
  2.598888525663   0.735534488392   0.245178162803
  6.856084002501  -2.779493514482  -0.926497838161
  4.789322166975   0.000000000000   0.785134781477
  5.877648940448   0.000000000000   1.199520191884
  3.589535591168  -0.912593794372   2.129385520174
  5.545077329304  -1.697472651839  -0.565824217280
  3.487883457067  -0.630340383797   0.210113461275
  7.118644067786   3.050847457646   1.016949152549
  4.033892061148   0.000000000000   0.552587953585
  3.155751611794   2.290464879543   0.254496097727
  6.666666666667   3.333333333351   3.333333333302
  8.123791102582   4.352030947750  -1.450676982583
  5.832628909537   1.901944209644  -0.633981403243
  8.333333333325  -0.000000000000   0.000000000000
  5.000000000078   5.000000000001   0.000000000000
  3.703703703712  -0.740740740748   0.740740740726
  6.432748537991   2.923976608201  -2.923976608201
  7.017543859654   4.385964912312   4.385964912247
 12.500000000022   0.000000000000   0.000000000000
  7.142857142856   0.000000000000  -0.000000000000
  6.906232453684   0.000000000056  -1.684446939916
 12.499999999987   0.000000000000  -0.000000000000
  7.142857142859   0.000000000000  -0.000000000038
  6.666666666707  -3.333333333307   3.333333333356
  3.651209366822   0.693267601285  -0.231089200428
  6.666666666672   0.000000000049   0.000000000049
  3.487883457062   0.630340383810   0.210113461270
  7.974335472012   4.124656278646   1.374885426215
  2.023158162620   1.717775798438  -2.099503753669
  5.465795806115   0.000000000000  -1.031282227575
  3.925434665701  -0.806596164189  -0.268865388063
  2.529907825060  -2.647577956461  -2.059227299478
  5.545077329298   1.697472651835  -0.565824217278
  6.250000000002   0.000000000000   0.000000000000
  4.185473943368   0.923266311042   0.307755437014
  5.769230769214   0.000000000000  -1.153846153875
  5.454545454540   1.636363636371   0.545454545433
  3.651209366804   0.693267601311  -0.231089200437
  4.545454545454   0.000000000000  -0.000000000015
  5.734038226956  -1.830012200023   0.610004066729
  6.038426349529   2.058554437309   0.686184812406
  4.977375565630   4.524886877817   0.000000000017
  2.997275204378  -2.043596730243  -0.681198910081
  6.274731486699   0.000000000000  -3.391746749592
  5.545077329323   1.697472651806  -0.565824217269
  3.448275862074  -1.379310344824  -0.000000000005
  2.258592471359  -0.883797054010  -0.098199672671
  5.263157894737  -0.000000000031  -0.000000000010
  7.058823529401   0.000000000059   1.764705882383
  5.882352941169   0.000000000000  -0.000000000000
  5.882352941181   0.000000000000   0.000000000026
  6.250000000000   0.000000000000  -0.000000000058
  7.058823529429   0.000000000000   1.764705882331
  7.142857142856   0.000000000000  -0.000000000000
  8.540925266906   0.000000000000  -2.669039145930
  9.090909090923   0.000000000000   0.000000000000
  6.666666666707   3.333333333307   3.333333333356
  4.961606615463   1.329001772005   0.443000590668
  2.284710017589  -3.514938488584  -0.000000000000
  4.730983302383  -4.174397031539   1.391465677180
  6.856084002501  -2.779493514482  -0.926497838161
  6.666666666669  -0.000000000049  -0.000000000016
  6.486486486476  -2.432432432445  -0.810810810815
  5.545077329320   1.697472651806  -0.565824217294
  5.280974949221  -1.523358158441  -0.507786052814
  5.280974949209   1.523358158434  -0.507786052811
  4.508670520237   0.000000000000  -0.693641618504
  3.833865814700   0.798722044697  -0.798722044733
  6.145783706516  -2.143878037170  -0.714626012390
  6.250000000002   0.000000000000   0.000000000000
  6.249999999994   0.000000000000   0.000000000000
  8.571428571504  -5.142857142820  -1.714285714273
  7.974335472031   4.124656278675   1.374885426225
  6.870229007717   3.816793893120  -3.816793893120
  3.239490937160   2.603162360196   0.289240262235
  7.094594594559   0.000000000000  -5.067567567566
  6.106539627536   0.000000000000  -1.299263750547
  3.783604381015   0.746764022574  -0.248921340858
  4.077669902915  -0.873786407774  -0.291262135899
  7.317073170692   0.000000000000  -5.853658536585
  7.010475423116  -0.000000000000   4.834810636554
  7.556160653518  -0.000000000000   2.042205581999
  9.090909090905   0.000000000000   0.000000000000
  5.734038226916  -1.830012200093   0.610004066698
  7.535321821078  -3.532182103571   1.177394034524
  4.729729729708   0.000000000000  -3.378378378385
  5.280974949237   1.523358158410  -0.507786052803
  3.962264150954   0.000000000000  -1.132075471684
  7.142857142856   0.000000000000  -0.000000000000
  5.454545454553  -1.636363636339   0.545454545471
  4.380039224233  -0.000000000022   0.653737197644
  3.544262825699  -0.728273183350   1.213788638939
  6.666666666667  -3.333333333351   3.333333333302
  2.559867877789   0.412881915775   1.238645747313
  6.432748537991  -2.923976608201   2.923976608201
  5.545077329298  -1.697472651835  -0.565824217278
 11.111111111093   0.000000000000  -0.000000000000
  5.882352941187   0.000000000077  -0.000000000026
  3.256936067529  -1.206272617639  -0.000000000009
  5.832628909560  -1.901944209654  -0.633981403162
  4.096538583655   2.858050174661  -1.905366783107
  5.882352941169   0.000000000000   0.000000000000
  5.545077329298  -1.697472651835  -0.565824217278
  4.130808950142  -3.872633390699   2.581755593828
  4.653937947454  -5.369928400964  -1.789976133655
  9.999999999994   0.000000000222   0.000000000074
  5.832628909540  -1.901944209644  -0.633981403215
  6.038426349485  -2.058554437337   0.686184812446
  2.420783310368   1.771304861264   2.952174768748
  6.486486486559   2.432432432370  -0.810810810790
  5.555555555560   0.000000000000   0.000000000000
  4.545454545452   0.000000000000   0.000000000000
  6.741573033764   0.000000000000   4.213483146032
  5.877648940450  -0.000000000080   1.199520191914
  4.241401139498  -0.949567419255  -0.316522473085
 11.111111111148  -0.000000000000  -0.000000000000
  3.651209366814   0.693267601299  -0.231089200433
  6.249999999994   0.000000000000  -0.000000000000
  5.936073059344   2.283105022840  -2.283105022840
  8.540925266964   0.000000000000  -2.669039145826
  3.738469007925   0.728273183367   0.242757727810
  5.734038226923  -1.830012200097   0.610004066699
  3.472102262901   1.554672655040  -1.036448436693
  6.741573033764   0.000000000000   4.213483146032
  5.197777051312   1.471068976794   0.490356325598
  3.880190605855   0.000000000000   0.510551395511
  3.846153846151   0.000000000033   0.000000000011
  4.276985743367   1.018329938901  -1.018329938901
  5.197777051312  -1.471068976794   0.490356325598
  6.038426349525  -2.058554437255   0.686184812479
  6.666666666662   0.000000000000  -0.000000000000
  5.563480741801   0.000000000000   1.069900142662
  7.692307692310   0.000000000000  -0.000000000000
  4.077669902914  -0.873786407774  -0.291262135925
  1.776976564518  -2.897244398665  -0.193149626571
  3.060258702283   0.000000000000   0.315490587866
  3.102625298305  -1.193317422433   3.579952267299
  4.743083003922   4.446640316195  -1.482213438732
  7.535321821025   3.532182103635   1.177394034545
  4.719101123568   4.044943820232  -1.348314606744
  5.555555555547   0.000000000000   0.000000000000
  5.263157894727   0.000000000000   0.000000000000
  5.734038226910   1.830012200088   0.610004066696
  3.703703703696  -0.740740740743   0.740740740743
  3.448275862069  -0.000000000026   0.000000000009
  7.094594594673   0.000000000000  -5.067567567551
  4.025704025705  -0.850500850507   0.283500283502
  6.432748537991  -2.923976608201  -2.923976608201
  4.653937947454  -5.369928400964  -1.789976133655
  4.077669902895   0.873786407808  -0.291262135910
  4.812834224593  -1.336898395730  -1.336898395730
  4.999999999967   4.999999999989   0.000000000000
  5.280974949264   1.523358158387  -0.507786052796
  7.142857142856   0.000000000000   0.000000000000
  5.454545454534   1.636363636369   0.545454545456
  6.249999999994   0.000000000000   0.000000000000
  5.140758873894  -2.753977968171   4.589963280285
  7.142857142856   0.000000000000  -0.000000000000
  3.925434665712  -0.806596164193  -0.268865388040
  5.197777051312  -1.471068976794   0.490356325598
  5.454545454545  -1.636363636377   0.545454545459
  5.832628909600  -1.901944209580  -0.633981403193
  4.185473943368   0.923266311042   0.307755437014
  5.280974949221  -1.523358158441  -0.507786052814
  5.454545454596  -1.818181818132   1.818181818186
  4.096538583719   2.858050174645  -1.905366783118
  3.947368421090   2.368421052624   1.578947368434
 10.969793322706   0.000000000000  -4.769475357726
  3.195462719595  -1.244985475175   0.829990316784
  4.814609850599   1.245157719935  -0.415052573348
  2.400000000002   0.000000000000  -3.200000000004
  5.454545454534  -1.636363636369   0.545454545456
  7.383419689058   0.000000000000  -1.943005181427
  5.769230769236  -0.000000000000  -1.153846153856
  3.441835645680  -0.000000000027  -0.400213447166
  2.013422818790   0.000000000000   2.876318312564
  3.925434665711  -0.806596164193  -0.268865388064
  3.527387439058  -0.645253799832  -0.215084599944
  7.924528301886   0.000000000000  -2.264150943413
  5.555555555569   0.000000000000   0.000000000046
  5.197777051357  -1.471068976744   0.490356325581
  3.831481174325   0.000000000000  -0.497594957708
  7.556160653503   0.000000000000   2.042205582043
  4.977375565582   0.000000000000  -4.524886877838
  5.454545454534   1.636363636369   0.545454545456
  2.552745075171   1.573609977857  -1.223918871666
  6.250000000000   0.000000000087   0.000000000029
 11.111111111148  -0.000000000000  -0.000000000000
  6.741573033764   0.000000000000   4.213483146032
  7.254623044086  -3.200568990063  -1.066856330021
  5.877648940429   0.000000000000   1.199520191934
  5.454545454534   1.636363636369   0.545454545456
  4.025704025689   0.850500850541   0.283500283489
  6.249999999994   0.000000000000   0.000000000000
  6.250000000005   0.000000000000   0.000000000058
  5.197777051323  -1.471068976801   0.490356325600
  3.333814403208  -1.298888728559  -0.432962909500
  7.142857142848   0.000000000000   0.000000000076
  5.000000000008  -0.000000000056  -0.000000000019
  5.545077329298   1.697472651835  -0.565824217278
  6.249999999994  -0.000000000000  -0.000000000000
  5.910619894267   0.000000000000   2.883229216734
  3.113718411554   0.000000000023   0.676895306857
  4.494382022494  -0.000000000000  -2.808988764038
  6.185567010382  -2.577319587560   2.577319587637
  6.666666666682   0.000000000000  -0.000000000000
  7.142857142848   0.000000000000   0.000000000076
  3.846153846155   0.000000000000   0.000000000000
  6.666666666633  -3.333333333331  -3.333333333331
  5.454545454534   1.636363636369   0.545454545456
  3.135888501725  -2.613240418123   0.871080139374
  6.666666666702   3.333333333371   3.333333333272
  5.882352941169   0.000000000000  -0.000000000000
  5.882352941179   0.000000000077  -0.000000000026
  3.350515463917  -1.288659793825   0.000000000000
  3.374313366464  -0.588543029038   0.196181009679
  4.428754813849  -2.888318356883   0.962772785628
  3.663323157444   0.981247274321   2.289576973386
  5.882352941169   0.000000000000   0.000000000000
  9.999999999979   0.000000000000  -0.000000000000
  6.666666666662   0.000000000000  -0.000000000000
  6.906232453672   0.000000000000  -1.684446939931
  4.166666666670   0.000000000000   0.000000000000
  4.942753420831   0.000000000000  -0.837754817096
  4.725692558357  -4.888647474208  -1.629549158069
  8.123791102481  -4.352030947779  -1.450676982593
  7.383419689151   0.000000000000  -1.943005181281
  5.877648940415   0.000000000000   1.199520191928
  5.882352941179  -0.000000000077  -0.000000000026
             nan              nan              nan
