colname_old,colname_new,unit
#position,position,[]
device_id,device_id,[]
timestamp,delete,
sensortype,delete,
sensortype_serialid,delete,
header_seqnr,delete,
header_originatorid,delete,
header_atime,delete,
payload_sample_valid,delete,
payload_sample_no,delete,
irradiance_shortwave_up,irradiance_shortwave_up,[Wm^-2]
irradiance_shortwave_down,irradiance_shortwave_down,[Wm^-2]
albedo,albedo,[]
net_solar_radiation,net_solar_radiation,[Wm^-2]
irradiance_longwave_up_notemp,irradiance_longwave_up_notemp,[Wm^-2]
irradiance_longwave_down_notemp,irradiance_longwave_down_notemp,[Wm^-2]
net_far_infrared_radiation_notemp,net_far_infrared_radiation_notemp,[Wm^-2]
temperature,temperature,[°C]
irradiance_longwave_up,irradiance_longwave_up,[Wm^-2]
irradiance_longwave_down,irradiance_longwave_down,[Wm^-2]
net_far_infrared_radiation,net_far_infrared_radiation,[Wm^-2]
sky_temperature,sky_temperature,[°C]
ground_temperature,ground_temperature,[°C]
net_radiation,net_radiation,[Wm^-2]
generation_time,time,[UTC]
