colname_old,colname_new,unit
#position,position,[]
device_id,device_id,[]
displacement_dx1,displacement_dx1,[mm]
displacement_dx2,displacement_dx2,[mm]
displacement_dx3,displacement_dx3,[mm]
generation_time,time,[UTC]
