colname_old,colname_new,unit
#position,position,[]
device_id,device_id,[]
temperature_nearsurface_t1,temperature_nearsurface_t1,[°C]
temperature_nearsurface_t2,temperature_nearsurface_t2,[°C]
temperature_5cm,temperature_5cm,[°C]
temperature_10cm,temperature_10cm,[°C]
temperature_20cm,temperature_20cm,[°C]
temperature_30cm,temperature_30cm,[°C]
temperature_35cm,temperature_35cm,[°C]
temperature_50cm,temperature_50cm,[°C]
temperature_60cm,temperature_60cm,[°C]
temperature_85cm,temperature_85cm,[°C]
temperature_100cm,temperature_100cm,[°C]
temperature_ref1,ref1,[°C]
temperature_ref2,ref2,[°C]
temperature_ref3,ref3,[°C]
temperature_ref4,ref4,[°C]
temperature_ref5,ref5,[°C]
temperature_ref6,ref6,[°C]
generation_time,time,[UTC]
