G04*
G04 #@! TF.GenerationSoftware,Altium Limited,Altium NEXUS,1.1.7 (68)*
G04*
G04 Layer_Physical_Order=4*
G04 Layer_Color=16711680*
%FSLAX44Y44*%
%MOMM*%
G71*
G01*
G75*
%ADD10C,0.2500*%
%ADD13C,0.1500*%
%ADD173C,0.2540*%
%ADD176C,0.3810*%
%ADD181C,1.5200*%
%ADD182R,1.5200X1.5200*%
%ADD183R,1.5200X1.5200*%
%ADD184C,5.0000*%
%ADD185C,0.5500*%
%ADD191R,0.8000X0.8000*%
%ADD192R,0.2500X0.7500*%
%ADD193R,1.8000X1.0900*%
%ADD194R,1.0000X0.9000*%
%ADD195R,0.8500X0.7000*%
%ADD196R,0.5500X0.9500*%
%ADD197R,0.3500X0.5000*%
G36*
X446076Y313750D02*
Y208000D01*
X415941D01*
X415564Y208564D01*
X414794Y209079D01*
Y224550D01*
X434622Y244378D01*
X434622Y244378D01*
X435119Y245122D01*
X435294Y246000D01*
Y280000D01*
X435119Y280878D01*
X434622Y281622D01*
X423622Y292622D01*
X422878Y293119D01*
X422000Y293294D01*
X390465D01*
X368387Y315372D01*
X367643Y315869D01*
X366765Y316044D01*
X355167D01*
X355084Y317314D01*
X356048Y317441D01*
X358515Y318463D01*
X360633Y320088D01*
X362258Y322206D01*
X363280Y324673D01*
X363461Y326050D01*
X343341D01*
X343522Y324673D01*
X344544Y322206D01*
X346169Y320088D01*
X348287Y318463D01*
X350754Y317441D01*
X351718Y317314D01*
X351635Y316044D01*
X249750D01*
X249750Y316044D01*
X248872Y315869D01*
X248128Y315372D01*
X248128Y315372D01*
X232377Y299622D01*
X231880Y298877D01*
X231705Y297999D01*
Y290578D01*
X230935Y290063D01*
X229996Y288658D01*
X229666Y286999D01*
X229996Y285341D01*
X230755Y284205D01*
X230413Y283213D01*
X230202Y282921D01*
X229428Y282816D01*
X227095Y285149D01*
X227064Y286656D01*
X228003Y288062D01*
X228333Y289720D01*
X228003Y291378D01*
X227064Y292784D01*
X225658Y293723D01*
X224000Y294053D01*
X222342Y293723D01*
X220936Y292784D01*
X219997Y291378D01*
X219667Y289720D01*
X219997Y288062D01*
X220936Y286656D01*
X221706Y286141D01*
Y285000D01*
X221881Y284122D01*
X222378Y283378D01*
X227058Y278698D01*
X227802Y278201D01*
X228680Y278026D01*
X235285D01*
X235952Y276756D01*
X235667Y275320D01*
X235997Y273662D01*
X236841Y272399D01*
X236377Y271935D01*
X235880Y271191D01*
X235705Y270313D01*
Y263686D01*
X235880Y262808D01*
X236377Y262064D01*
X243063Y255378D01*
X243807Y254881D01*
X244685Y254706D01*
X283050D01*
X289378Y248378D01*
X290122Y247881D01*
X291000Y247706D01*
X306422D01*
X306936Y246936D01*
X308342Y245997D01*
X310000Y245667D01*
X311658Y245997D01*
X313064Y246936D01*
X314003Y248342D01*
X314333Y250000D01*
X314003Y251658D01*
X313064Y253064D01*
X311658Y254003D01*
X310000Y254333D01*
X308342Y254003D01*
X306936Y253064D01*
X306422Y252294D01*
X291950D01*
X285622Y258622D01*
X285447Y260203D01*
X286636Y261392D01*
X291292D01*
X292306Y260377D01*
X293050Y259880D01*
X293368Y259817D01*
X293806Y259378D01*
X293806Y259378D01*
X294551Y258881D01*
X295429Y258706D01*
X307421D01*
X307936Y257936D01*
X309342Y256997D01*
X311000Y256667D01*
X312658Y256997D01*
X314064Y257936D01*
X315003Y259342D01*
X315333Y261000D01*
X315003Y262658D01*
X314064Y264064D01*
X312658Y265003D01*
X311000Y265333D01*
X309342Y265003D01*
X307936Y264064D01*
X307421Y263294D01*
X300162D01*
X299484Y264564D01*
X300003Y265341D01*
X300333Y266999D01*
X300281Y267257D01*
X301087Y268239D01*
X313384D01*
X319206Y262418D01*
Y246021D01*
X304479Y231294D01*
X290020D01*
X289421Y232414D01*
X289553Y232612D01*
X289883Y234270D01*
X289553Y235928D01*
X288614Y237334D01*
X287208Y238273D01*
X285550Y238603D01*
X283892Y238273D01*
X282486Y237334D01*
X281547Y235928D01*
X281217Y234270D01*
X281547Y232612D01*
X281679Y232414D01*
X281080Y231294D01*
X258435D01*
X257874Y232134D01*
X256468Y233073D01*
X254810Y233403D01*
X253152Y233073D01*
X251746Y232134D01*
X251231Y231364D01*
X226880D01*
X221622Y236622D01*
X220878Y237119D01*
X220000Y237294D01*
X163950D01*
X147622Y253622D01*
X146878Y254119D01*
X146000Y254294D01*
X74591D01*
X74320Y254706D01*
X75005Y255976D01*
X131916D01*
X131916Y255976D01*
X132997Y256191D01*
X133913Y256803D01*
X141819Y264709D01*
X175776D01*
X175936Y264469D01*
X177342Y263530D01*
X179000Y263200D01*
X180658Y263530D01*
X182064Y264469D01*
X183003Y265875D01*
X183333Y267533D01*
X183003Y269191D01*
X182064Y270597D01*
X180658Y271537D01*
X179000Y271866D01*
X177342Y271537D01*
X175936Y270597D01*
X175776Y270357D01*
X140649D01*
X140649Y270357D01*
X139568Y270142D01*
X138652Y269530D01*
X138652Y269530D01*
X130746Y261624D01*
X69760D01*
X69216Y261987D01*
X68136Y262202D01*
X68135Y262202D01*
X33378D01*
X32297Y261987D01*
X31381Y261375D01*
X31381Y261375D01*
X15283Y245277D01*
X15000Y245333D01*
X13342Y245003D01*
X11936Y244064D01*
X10997Y242658D01*
X10667Y241000D01*
X10997Y239342D01*
X11936Y237936D01*
X13342Y236997D01*
X15000Y236667D01*
X15461Y236289D01*
Y231639D01*
X21731D01*
Y237409D01*
X19239D01*
X18561Y238679D01*
X19003Y239342D01*
X19333Y241000D01*
X19277Y241283D01*
X34548Y256554D01*
X65938D01*
X66281Y256168D01*
X66986Y255112D01*
X66047Y253706D01*
X65844Y252686D01*
X64496Y252418D01*
X64064Y253064D01*
X62658Y254003D01*
X61000Y254333D01*
X59342Y254003D01*
X57936Y253064D01*
X56997Y251658D01*
X56667Y250000D01*
X56997Y248342D01*
X57936Y246936D01*
X59342Y245997D01*
X61000Y245667D01*
X62658Y245997D01*
X64064Y246936D01*
X65003Y248342D01*
X65206Y249361D01*
X66554Y249630D01*
X66986Y248984D01*
X68392Y248044D01*
X70050Y247715D01*
X71708Y248044D01*
X73114Y248984D01*
X73597Y249706D01*
X145050D01*
X161378Y233378D01*
X161378Y233378D01*
X162122Y232881D01*
X163000Y232706D01*
X219050D01*
X224192Y227564D01*
X224129Y227078D01*
X223749Y226294D01*
X162950D01*
X141622Y247622D01*
X140878Y248119D01*
X140000Y248294D01*
X103000D01*
X102122Y248119D01*
X101378Y247622D01*
X78050Y224294D01*
X66790D01*
X66419Y224665D01*
Y226421D01*
X67189Y226936D01*
X68128Y228342D01*
X68458Y230000D01*
X68128Y231658D01*
X67189Y233064D01*
X65783Y234003D01*
X64125Y234333D01*
X62467Y234003D01*
X61061Y233064D01*
X60122Y231658D01*
X59792Y230000D01*
X60122Y228342D01*
X61061Y226936D01*
X61831Y226421D01*
Y223715D01*
X62006Y222837D01*
X62503Y222093D01*
X64218Y220378D01*
X64962Y219881D01*
X65840Y219706D01*
X79000D01*
X79878Y219881D01*
X80622Y220378D01*
X103950Y243706D01*
X108627D01*
X109012Y242436D01*
X108336Y241984D01*
X107397Y240578D01*
X107067Y238920D01*
X107397Y237262D01*
X108336Y235856D01*
X109742Y234917D01*
X111400Y234587D01*
X112308Y234767D01*
X119120Y227955D01*
X119686Y227337D01*
X119302Y226115D01*
X118996Y225658D01*
X118666Y224000D01*
X118996Y222341D01*
X119936Y220935D01*
X121341Y219996D01*
X123000Y219666D01*
X123908Y219847D01*
X132706Y211049D01*
Y204929D01*
X131436Y204652D01*
X131122Y205121D01*
X116152Y220091D01*
X116333Y221000D01*
X116003Y222658D01*
X115064Y224064D01*
X113658Y225003D01*
X112000Y225333D01*
X110342Y225003D01*
X108936Y224064D01*
X107996Y222658D01*
X107667Y221000D01*
X107996Y219341D01*
X108936Y217936D01*
X110342Y216996D01*
X112000Y216666D01*
X112908Y216847D01*
X127206Y202549D01*
Y189450D01*
X113742Y175986D01*
X112472Y176501D01*
Y185562D01*
X116720Y189810D01*
X117658Y189997D01*
X119064Y190936D01*
X120003Y192342D01*
X120333Y194000D01*
X120003Y195658D01*
X119064Y197064D01*
X117658Y198003D01*
X116000Y198333D01*
X114342Y198003D01*
X112936Y197064D01*
X111997Y195658D01*
X111810Y194720D01*
X106545Y189455D01*
X105793Y188329D01*
X105528Y187000D01*
Y167125D01*
X104258Y166739D01*
X103988Y167144D01*
X102582Y168083D01*
X100924Y168413D01*
X99266Y168083D01*
X97860Y167144D01*
X96920Y165738D01*
X96591Y164080D01*
X96920Y162422D01*
X97860Y161016D01*
X99266Y160077D01*
X100924Y159747D01*
X102582Y160077D01*
X103988Y161016D01*
X104258Y161421D01*
X105528Y161035D01*
Y139400D01*
X105793Y138071D01*
X106545Y136945D01*
X121625Y121865D01*
X122752Y121113D01*
X124080Y120848D01*
X176546D01*
X177342Y120317D01*
X179000Y119987D01*
X180658Y120317D01*
X182064Y121256D01*
X183003Y122662D01*
X183333Y124320D01*
X183003Y125978D01*
X182064Y127384D01*
X181986Y127436D01*
X182372Y128706D01*
X207485D01*
X208363Y128881D01*
X209107Y129378D01*
X228755Y149026D01*
X235563D01*
X236162Y147906D01*
X235997Y147658D01*
X235667Y146000D01*
X235997Y144342D01*
X236936Y142936D01*
X238342Y141997D01*
X240000Y141667D01*
X240283Y141723D01*
X245003Y137003D01*
X245919Y136391D01*
X247000Y136176D01*
X253735D01*
X253860Y134906D01*
X253342Y134803D01*
X251936Y133863D01*
X251421Y133093D01*
X241799D01*
X240921Y132919D01*
X240177Y132421D01*
X196541Y88786D01*
X195244Y89148D01*
X194946Y89272D01*
X194718Y89500D01*
X194395D01*
X194096Y89624D01*
X96672D01*
X90624Y95673D01*
Y105000D01*
X90148Y106148D01*
X85148Y111148D01*
X84000Y111624D01*
X79000D01*
X77852Y111148D01*
X73150Y106446D01*
X71622Y106447D01*
X66153Y111917D01*
X66333Y112825D01*
X66003Y114483D01*
X65064Y115889D01*
X63658Y116828D01*
X62000Y117158D01*
X60342Y116828D01*
X58936Y115889D01*
X57997Y114483D01*
X57667Y112825D01*
X57997Y111167D01*
X58936Y109761D01*
X60342Y108822D01*
X62000Y108492D01*
X62908Y108672D01*
X67706Y103875D01*
Y81000D01*
X67881Y80122D01*
X68378Y79378D01*
X70214Y77541D01*
X69852Y76244D01*
X69728Y75946D01*
X69500Y75718D01*
Y75395D01*
X69376Y75096D01*
Y4078D01*
X42112D01*
X41754Y5348D01*
X43625Y6495D01*
X46796Y9204D01*
X49505Y12376D01*
X51685Y15932D01*
X53281Y19786D01*
X54255Y23842D01*
X54582Y28000D01*
X54255Y32158D01*
X53281Y36214D01*
X51685Y40068D01*
X49505Y43625D01*
X46796Y46796D01*
X43625Y49505D01*
X40068Y51685D01*
X36214Y53281D01*
X32158Y54255D01*
X28000Y54582D01*
X23842Y54255D01*
X19786Y53281D01*
X15932Y51685D01*
X12376Y49505D01*
X9204Y46796D01*
X6495Y43625D01*
X5348Y41754D01*
X4078Y42112D01*
Y307888D01*
X5348Y308246D01*
X6495Y306376D01*
X9204Y303204D01*
X12376Y300495D01*
X15932Y298315D01*
X19786Y296719D01*
X23842Y295745D01*
X28000Y295418D01*
X32158Y295745D01*
X36214Y296719D01*
X40068Y298315D01*
X43625Y300495D01*
X46796Y303204D01*
X49505Y306376D01*
X51685Y309932D01*
X53281Y313786D01*
X54255Y317842D01*
X54582Y322000D01*
X54255Y326158D01*
X53281Y330214D01*
X51685Y334068D01*
X49505Y337625D01*
X46796Y340796D01*
X43625Y343505D01*
X41754Y344652D01*
X42112Y345922D01*
X388888D01*
X389246Y344652D01*
X387375Y343505D01*
X384204Y340796D01*
X381495Y337625D01*
X379315Y334068D01*
X377719Y330214D01*
X376745Y326158D01*
X376418Y322000D01*
X376745Y317842D01*
X377719Y313786D01*
X379315Y309932D01*
X381495Y306376D01*
X384204Y303204D01*
X387375Y300495D01*
X390932Y298315D01*
X394786Y296719D01*
X398842Y295745D01*
X403000Y295418D01*
X407158Y295745D01*
X411214Y296719D01*
X415068Y298315D01*
X418624Y300495D01*
X421796Y303204D01*
X424505Y306376D01*
X426685Y309932D01*
X428281Y313786D01*
X429255Y317842D01*
X429582Y322000D01*
X429255Y326158D01*
X428281Y330214D01*
X426685Y334068D01*
X424505Y337625D01*
X421796Y340796D01*
X418624Y343505D01*
X416754Y344652D01*
X417112Y345922D01*
X446076D01*
Y313750D01*
D02*
G37*
G36*
X385407Y283378D02*
X385407Y283378D01*
X386152Y282881D01*
X387030Y282706D01*
X387030Y282706D01*
X389131D01*
X395128Y276708D01*
X394394Y274936D01*
X394081Y272560D01*
X394394Y270185D01*
X395311Y267971D01*
X396770Y266070D01*
X398671Y264612D01*
X400884Y263695D01*
X403260Y263382D01*
X405636Y263695D01*
X407849Y264612D01*
X409750Y266070D01*
X411209Y267971D01*
X412126Y270185D01*
X412439Y272560D01*
X412126Y274936D01*
X411209Y277150D01*
X409750Y279051D01*
X407849Y280509D01*
X405636Y281426D01*
X403260Y281739D01*
X400884Y281426D01*
X398671Y280509D01*
X398187Y280138D01*
X393792Y284533D01*
X394279Y285706D01*
X412050D01*
X414706Y283050D01*
Y262271D01*
X408695Y256260D01*
X394160D01*
Y238060D01*
X394160D01*
X394128Y236804D01*
X345037D01*
X344147Y237693D01*
X344208Y238000D01*
X343879Y239658D01*
X342939Y241064D01*
X341533Y242003D01*
X339875Y242333D01*
X338217Y242003D01*
X336811Y241064D01*
X335872Y239658D01*
X335542Y238000D01*
X335872Y236342D01*
X336811Y234936D01*
X338217Y233997D01*
X339875Y233667D01*
X340182Y233728D01*
X341893Y232017D01*
X342802Y231410D01*
X343875Y231196D01*
X411000D01*
X412073Y231410D01*
X412983Y232017D01*
X425983Y245017D01*
X426590Y245927D01*
X426804Y247000D01*
Y271762D01*
X427064Y271936D01*
X428003Y273342D01*
X428333Y275000D01*
X428003Y276658D01*
X427064Y278064D01*
X425658Y279003D01*
X424000Y279333D01*
X422342Y279003D01*
X420936Y278064D01*
X420564Y277507D01*
X419294Y277893D01*
Y284000D01*
X419294Y284000D01*
X419119Y284878D01*
X418622Y285622D01*
X416712Y287533D01*
X417198Y288706D01*
X421050D01*
X430706Y279050D01*
Y246950D01*
X410878Y227122D01*
X410381Y226378D01*
X410206Y225500D01*
Y209590D01*
X408946Y209054D01*
X401000Y217000D01*
X368000D01*
X359000Y208000D01*
X274000D01*
X267000Y215000D01*
X214000D01*
Y211000D01*
X266000D01*
X273000Y204000D01*
X361000D01*
X370000Y213000D01*
X399000D01*
X408000Y204000D01*
X408465D01*
X408497Y203842D01*
X409436Y202436D01*
X410842Y201497D01*
X412500Y201167D01*
X414158Y201497D01*
X415564Y202436D01*
X416503Y203842D01*
X416535Y204000D01*
X446076D01*
Y37874D01*
X444280D01*
X443132Y37398D01*
X442656Y36250D01*
Y4078D01*
X417112D01*
X416754Y5348D01*
X418624Y6495D01*
X421796Y9204D01*
X424505Y12376D01*
X426685Y15932D01*
X428281Y19786D01*
X429255Y23842D01*
X429582Y28000D01*
X429255Y32158D01*
X428281Y36214D01*
X426685Y40068D01*
X424505Y43625D01*
X421796Y46796D01*
X418624Y49505D01*
X415068Y51685D01*
X411214Y53281D01*
X407158Y54255D01*
X403000Y54582D01*
X398842Y54255D01*
X394786Y53281D01*
X390932Y51685D01*
X387375Y49505D01*
X386777Y48994D01*
X385914Y49927D01*
X419622Y83635D01*
X420119Y84380D01*
X420294Y85257D01*
Y101298D01*
X432622Y113626D01*
X433119Y114370D01*
X433294Y115248D01*
Y161873D01*
X433119Y162751D01*
X432622Y163495D01*
X424308Y171809D01*
X424794Y172983D01*
X426590D01*
Y176747D01*
X419370D01*
X412905Y183212D01*
X412160Y183709D01*
X411283Y183884D01*
X371454D01*
X370939Y184654D01*
X369533Y185593D01*
X367875Y185923D01*
X366217Y185593D01*
X364811Y184654D01*
X364296Y183884D01*
X312490D01*
X312490Y183884D01*
X311612Y183709D01*
X310868Y183212D01*
X310868Y183212D01*
X309748Y182092D01*
X295337D01*
X284983Y171738D01*
X283989Y171327D01*
X270693Y184622D01*
X269949Y185119D01*
X269071Y185294D01*
X225559D01*
X216426Y194426D01*
X216000Y194000D01*
X215000D01*
X213000Y192000D01*
X218533Y186467D01*
X218047Y185294D01*
X156998D01*
X156625Y185671D01*
X156148Y186410D01*
X156294Y187143D01*
X156294Y187143D01*
Y221999D01*
X156294Y221999D01*
X156119Y222877D01*
X155622Y223621D01*
X150152Y229091D01*
X150333Y230000D01*
X150177Y230782D01*
X151348Y231408D01*
X160378Y222378D01*
X161122Y221881D01*
X162000Y221706D01*
X234205D01*
X235083Y221881D01*
X235196Y221956D01*
X251853D01*
X251861Y221951D01*
X252739Y221776D01*
X256881D01*
X257759Y221951D01*
X258503Y222448D01*
X258761Y222706D01*
X283273D01*
X283952Y221436D01*
X283767Y221158D01*
X283437Y219500D01*
X283767Y217842D01*
X284706Y216436D01*
X286112Y215497D01*
X287770Y215167D01*
X289428Y215497D01*
X290834Y216436D01*
X291773Y217842D01*
X292103Y219500D01*
X291773Y221158D01*
X291588Y221436D01*
X292267Y222706D01*
X305672D01*
X306549Y222881D01*
X307294Y223378D01*
X326122Y242206D01*
X326122Y242206D01*
X326619Y242950D01*
X326794Y243828D01*
X326794Y243829D01*
Y264610D01*
X326619Y265488D01*
X326122Y266233D01*
X317199Y275155D01*
X316455Y275653D01*
X315577Y275827D01*
X303424D01*
X294004Y285247D01*
X293260Y285744D01*
X292382Y285919D01*
X287846D01*
X285599Y288165D01*
X285649Y288231D01*
X286566Y290444D01*
X286879Y292820D01*
X286566Y295196D01*
X285649Y297409D01*
X284190Y299310D01*
X282723Y300436D01*
X283154Y301706D01*
X367079D01*
X385407Y283378D01*
D02*
G37*
G36*
X281636Y167191D02*
X281150Y166017D01*
X271470D01*
X260865Y176622D01*
X260121Y177119D01*
X259243Y177294D01*
X233559D01*
X231320Y179533D01*
X231806Y180706D01*
X268121D01*
X281636Y167191D01*
D02*
G37*
G36*
X242000Y163000D02*
X263756D01*
X264898Y161857D01*
X264412Y160684D01*
X226390D01*
X226390Y160684D01*
X225512Y160509D01*
X224768Y160012D01*
X224768Y160012D01*
X207870Y143114D01*
X174880D01*
X154558Y163436D01*
X155084Y164706D01*
X240294D01*
X242000Y163000D01*
D02*
G37*
G36*
X365253Y170747D02*
X365186Y170064D01*
X364247Y168658D01*
X363917Y167000D01*
X364057Y166294D01*
X357377Y159614D01*
X335720D01*
X334658Y160323D01*
X333000Y160653D01*
X331342Y160323D01*
X329936Y159384D01*
X328997Y157978D01*
X328667Y156320D01*
X328952Y154884D01*
X328285Y153614D01*
X313876D01*
X313198Y154884D01*
X313503Y155342D01*
X313833Y157000D01*
X313503Y158658D01*
X312564Y160064D01*
X311794Y160578D01*
Y177650D01*
X312144Y178000D01*
X358000D01*
X365253Y170747D01*
D02*
G37*
G36*
X139706Y178769D02*
Y172750D01*
X139881Y171872D01*
X140378Y171128D01*
X170218Y141287D01*
X169732Y140114D01*
X130130D01*
X121294Y148950D01*
Y152824D01*
X122564Y153503D01*
X122842Y153317D01*
X124500Y152988D01*
X126158Y153317D01*
X127564Y154257D01*
X128503Y155663D01*
X128833Y157321D01*
X128653Y158229D01*
X137372Y166949D01*
X137372Y166949D01*
X137869Y167693D01*
X138044Y168571D01*
X138044Y168571D01*
Y179170D01*
X138467Y179460D01*
X139706Y178769D01*
D02*
G37*
G36*
X362543Y147756D02*
X350977Y136191D01*
X349556Y136473D01*
X347898Y136143D01*
X346492Y135204D01*
X345553Y133798D01*
X345223Y132140D01*
X345553Y130482D01*
X346492Y129076D01*
X347898Y128137D01*
X348836Y127950D01*
X375551Y101235D01*
X376677Y100483D01*
X378006Y100218D01*
X391906D01*
X393107Y99750D01*
X393437Y98092D01*
X394376Y96686D01*
X395146Y96171D01*
Y87633D01*
X371953Y64440D01*
X344142D01*
X343656Y65613D01*
X352372Y74329D01*
X352869Y75073D01*
X353044Y75951D01*
Y98277D01*
X352869Y99155D01*
X352372Y99899D01*
X348294Y103977D01*
Y111671D01*
X349064Y112186D01*
X350003Y113592D01*
X350333Y115250D01*
X350003Y116908D01*
X349064Y118314D01*
X347658Y119253D01*
X346000Y119583D01*
X344342Y119253D01*
X342936Y118314D01*
X342122Y117096D01*
X342087Y117082D01*
X341269Y116998D01*
X340733Y117064D01*
X340064Y118064D01*
X338658Y119003D01*
X337000Y119333D01*
X335342Y119003D01*
X333936Y118064D01*
X332997Y116658D01*
X332667Y115000D01*
X332997Y113342D01*
X333936Y111936D01*
X334743Y111397D01*
Y109919D01*
X333936Y109380D01*
X332997Y107975D01*
X332667Y106316D01*
X332997Y104658D01*
X333936Y103252D01*
X334933Y102586D01*
X335378Y101920D01*
X342456Y94842D01*
Y79387D01*
X331363Y68294D01*
X326206D01*
X325720Y69467D01*
X334709Y78456D01*
X335617Y78276D01*
X337276Y78605D01*
X338681Y79545D01*
X339621Y80951D01*
X339951Y82609D01*
X339621Y84267D01*
X338681Y85673D01*
X337276Y86612D01*
X335617Y86942D01*
X333959Y86612D01*
X332553Y85673D01*
X331614Y84267D01*
X331284Y82609D01*
X331465Y81701D01*
X321058Y71294D01*
X283320D01*
X278294Y76320D01*
Y81014D01*
X278823Y81338D01*
X279564Y81492D01*
X281882Y79174D01*
X282626Y78677D01*
X283504Y78502D01*
X317211D01*
X318089Y78677D01*
X318833Y79174D01*
X327622Y87963D01*
X328119Y88707D01*
X328294Y89585D01*
Y123572D01*
X344092Y139369D01*
X345000Y139189D01*
X346658Y139519D01*
X348064Y140458D01*
X349003Y141864D01*
X349333Y143522D01*
X349003Y145180D01*
X348064Y146586D01*
X346658Y147526D01*
X345500Y147756D01*
X345625Y149026D01*
X362017D01*
X362543Y147756D01*
D02*
G37*
G36*
X387528Y137471D02*
X387792Y136142D01*
X388544Y135016D01*
X400093Y123467D01*
X399607Y122294D01*
X388000D01*
X387122Y122119D01*
X386378Y121622D01*
X382378Y117622D01*
X381881Y116878D01*
X381706Y116000D01*
Y110000D01*
X381881Y109122D01*
X382342Y108432D01*
X382229Y107873D01*
X381935Y107162D01*
X379444D01*
X355606Y131000D01*
X367134Y142528D01*
X387528D01*
Y137471D01*
D02*
G37*
G36*
X276606Y110702D02*
Y103629D01*
X269528Y96551D01*
X269031Y95807D01*
X268856Y94929D01*
Y87135D01*
X267586Y86468D01*
X266150Y86754D01*
X264492Y86424D01*
X263086Y85485D01*
X262147Y84079D01*
X261817Y82421D01*
X262147Y80762D01*
X263086Y79356D01*
X264492Y78417D01*
X266150Y78087D01*
X267586Y78373D01*
X268856Y77706D01*
Y72182D01*
X268350Y71821D01*
X267633Y71609D01*
X259294Y79948D01*
Y95050D01*
X275433Y111188D01*
X276606Y110702D01*
D02*
G37*
G36*
X274511Y116756D02*
X255378Y97622D01*
X254881Y96878D01*
X254706Y96000D01*
Y83370D01*
X253436Y82691D01*
X253334Y82759D01*
Y108090D01*
X263269Y118026D01*
X273985D01*
X274511Y116756D01*
D02*
G37*
G36*
X89000Y105000D02*
Y95000D01*
X96000Y88000D01*
X194096D01*
X194582Y86827D01*
X178050Y70294D01*
X147578D01*
X147064Y71064D01*
X145658Y72003D01*
X144000Y72333D01*
X142342Y72003D01*
X140936Y71064D01*
X140421Y70294D01*
X83950D01*
X72294Y81950D01*
Y103294D01*
X79000Y110000D01*
X84000D01*
X89000Y105000D01*
D02*
G37*
G36*
X257806Y64977D02*
Y48235D01*
X257429Y47942D01*
X256595Y47649D01*
X244294Y59951D01*
Y76814D01*
X245389Y77211D01*
X245564Y77219D01*
X257806Y64977D01*
D02*
G37*
G36*
X238936Y103936D02*
X239386Y103635D01*
Y102365D01*
X238936Y102064D01*
X237996Y100658D01*
X237666Y99000D01*
X237996Y97341D01*
X238936Y95936D01*
X239706Y95421D01*
Y59001D01*
X239880Y58123D01*
X240377Y57378D01*
X261998Y35758D01*
X262742Y35261D01*
X263620Y35086D01*
X278880D01*
X279758Y35261D01*
X280502Y35758D01*
X299450Y54706D01*
X336041D01*
X336919Y54881D01*
X337664Y55378D01*
X342138Y59852D01*
X372903D01*
X373781Y60026D01*
X374525Y60524D01*
X399063Y85061D01*
X399560Y85805D01*
X399734Y86683D01*
X399734Y86683D01*
Y96171D01*
X400504Y96686D01*
X401444Y98092D01*
X401691Y99335D01*
X402911Y100048D01*
X403683Y99672D01*
Y87717D01*
X365677Y49710D01*
X364862Y49500D01*
X363997Y49626D01*
X362968Y50313D01*
X361310Y50643D01*
X359652Y50313D01*
X358246Y49374D01*
X357307Y47968D01*
X356977Y46310D01*
X357307Y44652D01*
X358246Y43246D01*
X359444Y42445D01*
X359863Y41068D01*
X355951Y37157D01*
X344390D01*
X343062Y36892D01*
X341936Y36140D01*
X339941Y34145D01*
X339188Y33019D01*
X338924Y31690D01*
Y22828D01*
X338431Y22457D01*
X338038Y22527D01*
X337128Y23066D01*
X336867Y25056D01*
X335950Y27269D01*
X334491Y29170D01*
X332590Y30629D01*
X330376Y31546D01*
X328001Y31858D01*
X325625Y31546D01*
X323412Y30629D01*
X321511Y29170D01*
X320052Y27269D01*
X319135Y25056D01*
X318822Y22680D01*
X319135Y20304D01*
X320052Y18091D01*
X321511Y16190D01*
X323412Y14731D01*
X325625Y13814D01*
X326176Y13742D01*
X326093Y12472D01*
X304509D01*
X304425Y13742D01*
X304976Y13814D01*
X307190Y14731D01*
X309091Y16190D01*
X310550Y18091D01*
X311467Y20304D01*
X311779Y22680D01*
X311467Y25056D01*
X310550Y27269D01*
X309091Y29170D01*
X307190Y30629D01*
X304976Y31546D01*
X302601Y31858D01*
X300225Y31546D01*
X298012Y30629D01*
X296111Y29170D01*
X294652Y27269D01*
X293735Y25056D01*
X293422Y22680D01*
X293735Y20304D01*
X294652Y18091D01*
X296111Y16190D01*
X298012Y14731D01*
X300225Y13814D01*
X300776Y13742D01*
X300693Y12472D01*
X282372D01*
X282119Y13742D01*
X282315Y13823D01*
X284433Y15448D01*
X286058Y17566D01*
X287080Y20033D01*
X287261Y21410D01*
X277201D01*
X267141D01*
X267322Y20033D01*
X268344Y17566D01*
X269969Y15448D01*
X272087Y13823D01*
X272283Y13742D01*
X272030Y12472D01*
X244508D01*
X244425Y13742D01*
X244976Y13814D01*
X247189Y14731D01*
X249090Y16190D01*
X250549Y18091D01*
X251466Y20304D01*
X251779Y22680D01*
X251466Y25056D01*
X250549Y27269D01*
X249090Y29170D01*
X247189Y30629D01*
X244976Y31546D01*
X242600Y31858D01*
X240224Y31546D01*
X238011Y30629D01*
X236110Y29170D01*
X234651Y27269D01*
X233734Y25056D01*
X233421Y22680D01*
X233734Y20304D01*
X234651Y18091D01*
X236110Y16190D01*
X238011Y14731D01*
X240224Y13814D01*
X240776Y13742D01*
X240692Y12472D01*
X228582D01*
X227340Y12540D01*
X227340Y13742D01*
Y21410D01*
X207060D01*
X207060Y12540D01*
X205818Y12472D01*
X195517D01*
X188802Y19187D01*
X189265Y20304D01*
X189578Y22680D01*
X189265Y25056D01*
X188348Y27269D01*
X186889Y29170D01*
X184988Y30629D01*
X182775Y31546D01*
X180399Y31858D01*
X178024Y31546D01*
X175810Y30629D01*
X173909Y29170D01*
X172450Y27269D01*
X171533Y25056D01*
X171221Y22680D01*
X171533Y20304D01*
X172450Y18091D01*
X173909Y16190D01*
X175810Y14731D01*
X178024Y13814D01*
X180399Y13501D01*
X182775Y13814D01*
X183892Y14277D01*
X191624Y6545D01*
X192751Y5793D01*
X194079Y5528D01*
X330396D01*
X331724Y5793D01*
X332851Y6545D01*
X343128Y16822D01*
X344301Y16336D01*
Y13580D01*
X362501D01*
Y31780D01*
X362053D01*
X361567Y32953D01*
X365658Y37043D01*
X366831Y36558D01*
Y24989D01*
X366061Y24474D01*
X365122Y23068D01*
X364792Y21410D01*
X365122Y19752D01*
X366061Y18346D01*
X367467Y17407D01*
X369125Y17077D01*
X370783Y17407D01*
X371475Y17869D01*
X372829Y17298D01*
X371999Y16333D01*
X370341Y16003D01*
X368935Y15064D01*
X367996Y13658D01*
X367666Y12000D01*
X367996Y10342D01*
X368935Y8936D01*
X370341Y7997D01*
X371999Y7667D01*
X373657Y7997D01*
X375063Y8936D01*
X376003Y10342D01*
X376333Y12000D01*
X376152Y12908D01*
X377372Y14129D01*
X377869Y14873D01*
X378035Y15705D01*
X378124Y15766D01*
X379289Y15995D01*
X379315Y15932D01*
X381495Y12376D01*
X384204Y9204D01*
X387375Y6495D01*
X389246Y5348D01*
X388888Y4078D01*
X71000D01*
Y75096D01*
X72173Y75582D01*
X81378Y66378D01*
X82122Y65881D01*
X83000Y65706D01*
X140421D01*
X140936Y64936D01*
X142342Y63997D01*
X144000Y63667D01*
X145658Y63997D01*
X147064Y64936D01*
X147578Y65706D01*
X176802D01*
X177288Y64533D01*
X174908Y62153D01*
X174000Y62333D01*
X172342Y62003D01*
X170936Y61064D01*
X169997Y59658D01*
X169667Y58000D01*
X169997Y56342D01*
X170936Y54936D01*
X172342Y53997D01*
X174000Y53667D01*
X175658Y53997D01*
X177064Y54936D01*
X178003Y56342D01*
X178333Y58000D01*
X178153Y58908D01*
X187533Y68288D01*
X188706Y67802D01*
Y62579D01*
X187936Y62064D01*
X186997Y60658D01*
X186667Y59000D01*
X186997Y57342D01*
X187936Y55936D01*
X189342Y54997D01*
X191000Y54667D01*
X191536Y54773D01*
X192892Y53846D01*
X192985Y53229D01*
X190050Y50294D01*
X179000D01*
X178122Y50119D01*
X177378Y49622D01*
X173908Y46153D01*
X173000Y46333D01*
X171342Y46003D01*
X169936Y45064D01*
X168997Y43658D01*
X168667Y42000D01*
X168997Y40342D01*
X169936Y38936D01*
X171342Y37997D01*
X173000Y37667D01*
X174658Y37997D01*
X176064Y38936D01*
X177003Y40342D01*
X177333Y42000D01*
X177153Y42908D01*
X179950Y45706D01*
X191000D01*
X191878Y45881D01*
X192622Y46378D01*
X197622Y51378D01*
X198119Y52122D01*
X198294Y53000D01*
Y69050D01*
X233950Y104706D01*
X238421D01*
X238936Y103936D01*
D02*
G37*
%LPC*%
G36*
X354671Y337380D02*
Y328590D01*
X363461D01*
X363280Y329967D01*
X362258Y332434D01*
X360633Y334552D01*
X358515Y336177D01*
X356048Y337199D01*
X354671Y337380D01*
D02*
G37*
G36*
X352131D02*
X350754Y337199D01*
X348287Y336177D01*
X346169Y334552D01*
X344544Y332434D01*
X343522Y329967D01*
X343341Y328590D01*
X352131D01*
Y337380D01*
D02*
G37*
G36*
X82040Y337460D02*
X73170D01*
Y328590D01*
X82040D01*
Y337460D01*
D02*
G37*
G36*
X70630D02*
X61760D01*
Y328590D01*
X70630D01*
Y337460D01*
D02*
G37*
G36*
X337101Y336420D02*
X318901D01*
Y318220D01*
X337101D01*
Y336420D01*
D02*
G37*
G36*
X277100D02*
X258900D01*
Y318220D01*
X277100D01*
Y336420D01*
D02*
G37*
G36*
X242499D02*
X224299D01*
Y318220D01*
X242499D01*
Y336420D01*
D02*
G37*
G36*
X182600Y336499D02*
X180224Y336187D01*
X178011Y335270D01*
X176110Y333811D01*
X174651Y331910D01*
X173734Y329696D01*
X173421Y327321D01*
X173734Y324945D01*
X174651Y322732D01*
X176110Y320831D01*
X178011Y319372D01*
X180224Y318455D01*
X182600Y318142D01*
X184976Y318455D01*
X187189Y319372D01*
X189090Y320831D01*
X190549Y322732D01*
X191466Y324945D01*
X191779Y327321D01*
X191466Y329696D01*
X190549Y331910D01*
X189090Y333811D01*
X187189Y335270D01*
X184976Y336187D01*
X182600Y336499D01*
D02*
G37*
G36*
X293400Y336498D02*
X291024Y336186D01*
X288811Y335269D01*
X286910Y333810D01*
X285451Y331909D01*
X284534Y329696D01*
X284221Y327320D01*
X284534Y324944D01*
X285451Y322731D01*
X286910Y320830D01*
X288811Y319371D01*
X291024Y318454D01*
X293400Y318141D01*
X295776Y318454D01*
X297989Y319371D01*
X299890Y320830D01*
X301349Y322731D01*
X302266Y324944D01*
X302579Y327320D01*
X302266Y329696D01*
X301349Y331909D01*
X299890Y333810D01*
X297989Y335269D01*
X295776Y336186D01*
X293400Y336498D01*
D02*
G37*
G36*
X207999D02*
X205624Y336186D01*
X203410Y335269D01*
X201509Y333810D01*
X200050Y331909D01*
X199133Y329696D01*
X198821Y327320D01*
X199133Y324944D01*
X200050Y322731D01*
X201509Y320830D01*
X203410Y319371D01*
X205624Y318454D01*
X207999Y318141D01*
X210375Y318454D01*
X212588Y319371D01*
X214489Y320830D01*
X215948Y322731D01*
X216865Y324944D01*
X217178Y327320D01*
X216865Y329696D01*
X215948Y331909D01*
X214489Y333810D01*
X212588Y335269D01*
X210375Y336186D01*
X207999Y336498D01*
D02*
G37*
G36*
X148100D02*
X145724Y336186D01*
X143511Y335269D01*
X141610Y333810D01*
X140151Y331909D01*
X139234Y329696D01*
X138921Y327320D01*
X139234Y324944D01*
X140151Y322731D01*
X141610Y320830D01*
X143511Y319371D01*
X145724Y318454D01*
X148100Y318141D01*
X150476Y318454D01*
X152689Y319371D01*
X154590Y320830D01*
X156049Y322731D01*
X156966Y324944D01*
X157278Y327320D01*
X156966Y329696D01*
X156049Y331909D01*
X154590Y333810D01*
X152689Y335269D01*
X150476Y336186D01*
X148100Y336498D01*
D02*
G37*
G36*
X122700D02*
X120324Y336186D01*
X118111Y335269D01*
X116210Y333810D01*
X114751Y331909D01*
X113834Y329696D01*
X113521Y327320D01*
X113834Y324944D01*
X114751Y322731D01*
X116210Y320830D01*
X118111Y319371D01*
X120324Y318454D01*
X122700Y318141D01*
X125076Y318454D01*
X127289Y319371D01*
X129190Y320830D01*
X130649Y322731D01*
X131566Y324944D01*
X131878Y327320D01*
X131566Y329696D01*
X130649Y331909D01*
X129190Y333810D01*
X127289Y335269D01*
X125076Y336186D01*
X122700Y336498D01*
D02*
G37*
G36*
X97300D02*
X94924Y336186D01*
X92711Y335269D01*
X90810Y333810D01*
X89351Y331909D01*
X88434Y329696D01*
X88122Y327320D01*
X88434Y324944D01*
X89351Y322731D01*
X90810Y320830D01*
X92711Y319371D01*
X94924Y318454D01*
X97300Y318141D01*
X99676Y318454D01*
X101889Y319371D01*
X103790Y320830D01*
X105249Y322731D01*
X106166Y324944D01*
X106479Y327320D01*
X106166Y329696D01*
X105249Y331909D01*
X103790Y333810D01*
X101889Y335269D01*
X99676Y336186D01*
X97300Y336498D01*
D02*
G37*
G36*
X82040Y326050D02*
X73170D01*
Y317180D01*
X82040D01*
Y326050D01*
D02*
G37*
G36*
X70630D02*
X61760D01*
Y317180D01*
X70630D01*
Y326050D01*
D02*
G37*
G36*
X28500Y291500D02*
X17500D01*
Y288824D01*
X16224D01*
X16064Y289064D01*
X14658Y290003D01*
X13000Y290333D01*
X11342Y290003D01*
X9936Y289064D01*
X8997Y287658D01*
X8667Y286000D01*
X8997Y284342D01*
X9936Y282936D01*
X11342Y281997D01*
X13000Y281667D01*
X14658Y281997D01*
X16064Y282936D01*
X16224Y283176D01*
X17500D01*
Y280500D01*
X28500D01*
Y291500D01*
D02*
G37*
G36*
X45540Y292540D02*
X40270D01*
Y287270D01*
X45540D01*
Y292540D01*
D02*
G37*
G36*
X37730D02*
X32460D01*
Y287270D01*
X37730D01*
Y292540D01*
D02*
G37*
G36*
X89650Y303553D02*
X87992Y303223D01*
X86586Y302284D01*
X85647Y300878D01*
X85317Y299220D01*
X85447Y298564D01*
X84414Y297294D01*
X72631D01*
X71753Y297119D01*
X71009Y296622D01*
X49908Y275522D01*
X49000Y275702D01*
X47342Y275372D01*
X46771Y274991D01*
X45501Y275670D01*
Y277369D01*
X32501D01*
Y265369D01*
X45501D01*
Y267068D01*
X46771Y267747D01*
X47342Y267365D01*
X49000Y267036D01*
X50658Y267365D01*
X52064Y268305D01*
X53003Y269711D01*
X53333Y271369D01*
X53153Y272277D01*
X73581Y292706D01*
X85849D01*
X85957Y292598D01*
X86701Y292101D01*
X87579Y291926D01*
X91721D01*
X92599Y292101D01*
X93343Y292598D01*
X93451Y292706D01*
X207440D01*
X208417Y291728D01*
X208237Y290820D01*
X208567Y289162D01*
X209506Y287756D01*
X210912Y286817D01*
X212570Y286487D01*
X214228Y286817D01*
X215634Y287756D01*
X216573Y289162D01*
X216903Y290820D01*
X216573Y292478D01*
X215634Y293884D01*
X214228Y294823D01*
X212570Y295153D01*
X211662Y294973D01*
X210012Y296622D01*
X209268Y297119D01*
X208390Y297294D01*
X94886D01*
X93853Y298564D01*
X93983Y299220D01*
X93653Y300878D01*
X92714Y302284D01*
X91308Y303223D01*
X89650Y303553D01*
D02*
G37*
G36*
X45540Y284730D02*
X40270D01*
Y279460D01*
X45540D01*
Y284730D01*
D02*
G37*
G36*
X37730D02*
X32460D01*
Y279460D01*
X37730D01*
Y284730D01*
D02*
G37*
G36*
X29501Y277369D02*
X16501D01*
Y265369D01*
X29501D01*
Y277369D01*
D02*
G37*
G36*
X227000Y266333D02*
X225342Y266003D01*
X223936Y265064D01*
X222997Y263658D01*
X222667Y262000D01*
X222997Y260342D01*
X223936Y258936D01*
X225342Y257997D01*
X227000Y257667D01*
X228658Y257997D01*
X230064Y258936D01*
X231003Y260342D01*
X231333Y262000D01*
X231003Y263658D01*
X230064Y265064D01*
X228658Y266003D01*
X227000Y266333D01*
D02*
G37*
G36*
X30541Y237409D02*
X24271D01*
Y231639D01*
X30541D01*
Y237409D01*
D02*
G37*
G36*
X45501Y236369D02*
X32501D01*
Y224369D01*
X45501D01*
Y236369D01*
D02*
G37*
G36*
X30541Y229099D02*
X24271D01*
Y223329D01*
X30541D01*
Y229099D01*
D02*
G37*
G36*
X21731D02*
X15461D01*
Y223329D01*
X21731D01*
Y229099D01*
D02*
G37*
G36*
X60000Y207063D02*
X58342Y206733D01*
X56936Y205794D01*
X55997Y204388D01*
X55667Y202730D01*
X55997Y201072D01*
X56936Y199666D01*
X58342Y198727D01*
X60000Y198397D01*
X61658Y198727D01*
X63064Y199666D01*
X64003Y201072D01*
X64333Y202730D01*
X64003Y204388D01*
X63064Y205794D01*
X61658Y206733D01*
X60000Y207063D01*
D02*
G37*
G36*
X23730Y192111D02*
X18210D01*
Y187341D01*
X23730D01*
Y192111D01*
D02*
G37*
G36*
Y184801D02*
X18210D01*
Y180031D01*
X23730D01*
Y184801D01*
D02*
G37*
G36*
X22000Y215333D02*
X20342Y215003D01*
X18936Y214064D01*
X17997Y212658D01*
X17667Y211000D01*
X17997Y209342D01*
X18936Y207936D01*
X20342Y206997D01*
X22000Y206667D01*
X22706Y206087D01*
Y204571D01*
X19250D01*
Y194571D01*
X30750D01*
Y194571D01*
X31250D01*
X32356Y194175D01*
X32750Y193571D01*
X32750Y193301D01*
Y192859D01*
X31790Y192111D01*
X26270D01*
Y186071D01*
Y180031D01*
X31790D01*
Y180323D01*
X32750Y181071D01*
X38035D01*
X38905Y180200D01*
X38667Y179000D01*
X38997Y177341D01*
X39936Y175936D01*
X41342Y174996D01*
X43000Y174666D01*
X44658Y174996D01*
X46064Y175936D01*
X47003Y177341D01*
X47333Y179000D01*
X47003Y180658D01*
X46064Y182064D01*
X44658Y183003D01*
X43878Y183158D01*
X42750Y184286D01*
Y191071D01*
X41250D01*
Y193301D01*
X41250Y193571D01*
X41902Y194571D01*
X42750D01*
Y204571D01*
X37900D01*
X37103Y205841D01*
X37333Y207000D01*
X37003Y208658D01*
X36064Y210064D01*
X34658Y211003D01*
X33000Y211333D01*
X31342Y211003D01*
X29936Y210064D01*
X28997Y208658D01*
X28667Y207000D01*
X28751Y206578D01*
X27668Y205568D01*
X27294Y205676D01*
Y208000D01*
X27294Y208000D01*
X27119Y208878D01*
X26622Y209622D01*
X26153Y210092D01*
X26333Y211000D01*
X26003Y212658D01*
X25064Y214064D01*
X23658Y215003D01*
X22000Y215333D01*
D02*
G37*
G36*
X84000Y178653D02*
X82342Y178323D01*
X80936Y177384D01*
X79997Y175978D01*
X79667Y174320D01*
X79997Y172662D01*
X80936Y171256D01*
X82342Y170317D01*
X84000Y169987D01*
X85658Y170317D01*
X87064Y171256D01*
X88003Y172662D01*
X88333Y174320D01*
X88003Y175978D01*
X87064Y177384D01*
X85658Y178323D01*
X84000Y178653D01*
D02*
G37*
G36*
X39480Y157111D02*
X36460D01*
Y156071D01*
X31000D01*
Y156071D01*
X31000D01*
Y156071D01*
X24500Y156071D01*
X23230Y156071D01*
X18000D01*
Y156071D01*
X17257Y155674D01*
X16658Y156074D01*
X15000Y156404D01*
X13342Y156074D01*
X11936Y155135D01*
X10997Y153729D01*
X10667Y152071D01*
X10997Y150413D01*
X11936Y149007D01*
X13342Y148068D01*
X15000Y147738D01*
X16658Y148068D01*
X17257Y148468D01*
X18000Y148071D01*
Y148071D01*
X23451D01*
X24129Y146801D01*
X23747Y146228D01*
X23417Y144570D01*
X23747Y142912D01*
X24686Y141506D01*
X25903Y140693D01*
X26330Y139323D01*
X26128Y139121D01*
X25631Y138377D01*
X25456Y137499D01*
Y136611D01*
X22520D01*
Y131571D01*
Y126531D01*
X25464D01*
X25631Y125692D01*
X26128Y124948D01*
X28698Y122378D01*
X28698Y122378D01*
X29442Y121881D01*
X30320Y121706D01*
X30320Y121706D01*
X37171D01*
X37686Y120936D01*
X39092Y119997D01*
X40750Y119667D01*
X42408Y119997D01*
X43814Y120936D01*
X44753Y122342D01*
X45083Y124000D01*
X44753Y125658D01*
X44254Y126406D01*
X44000Y127571D01*
X44000Y127571D01*
X44000Y127571D01*
Y135571D01*
X38540D01*
Y136611D01*
X35520D01*
Y131571D01*
X32980D01*
Y136611D01*
X31766D01*
X31280Y137784D01*
X35872Y142377D01*
X36369Y143121D01*
X36544Y143999D01*
Y147031D01*
X39480D01*
Y152071D01*
Y157111D01*
D02*
G37*
G36*
X45040D02*
X42020D01*
Y153341D01*
X45040D01*
Y157111D01*
D02*
G37*
G36*
Y150801D02*
X42020D01*
Y147031D01*
X45040D01*
Y150801D01*
D02*
G37*
G36*
X60000Y155333D02*
X58342Y155003D01*
X56936Y154064D01*
X55997Y152658D01*
X55667Y151000D01*
X55997Y149342D01*
X56936Y147936D01*
X58342Y146997D01*
X60000Y146667D01*
X61658Y146997D01*
X63064Y147936D01*
X64003Y149342D01*
X64333Y151000D01*
X64003Y152658D01*
X63064Y154064D01*
X61658Y155003D01*
X60000Y155333D01*
D02*
G37*
G36*
X19980Y136611D02*
X16960D01*
Y132841D01*
X19980D01*
Y136611D01*
D02*
G37*
G36*
Y130301D02*
X16960D01*
Y126531D01*
X19980D01*
Y130301D01*
D02*
G37*
G36*
X94000Y125333D02*
X92342Y125003D01*
X90936Y124064D01*
X89997Y122658D01*
X89667Y121000D01*
X89997Y119342D01*
X90936Y117936D01*
X92342Y116997D01*
X94000Y116667D01*
X95658Y116997D01*
X97064Y117936D01*
X98003Y119342D01*
X98333Y121000D01*
X98003Y122658D01*
X97064Y124064D01*
X95658Y125003D01*
X94000Y125333D01*
D02*
G37*
G36*
X195000Y107719D02*
X193342Y107390D01*
X191936Y106450D01*
X190997Y105044D01*
X190667Y103386D01*
X190997Y101728D01*
X191936Y100322D01*
X193342Y99383D01*
X195000Y99053D01*
X196658Y99383D01*
X198064Y100322D01*
X199003Y101728D01*
X199333Y103386D01*
X199003Y105044D01*
X198064Y106450D01*
X196658Y107390D01*
X195000Y107719D01*
D02*
G37*
G36*
X42290Y96490D02*
X39770D01*
Y91470D01*
X42290D01*
Y96490D01*
D02*
G37*
G36*
X37230D02*
X34770D01*
Y90200D01*
X32230D01*
Y96490D01*
X29710D01*
Y95450D01*
X20750D01*
Y92494D01*
X17379D01*
X16864Y93264D01*
X15458Y94203D01*
X13800Y94533D01*
X12142Y94203D01*
X10736Y93264D01*
X9797Y91858D01*
X9467Y90200D01*
X9797Y88542D01*
X10736Y87136D01*
X12142Y86197D01*
X13800Y85867D01*
X15458Y86197D01*
X16864Y87136D01*
X17379Y87906D01*
X18605D01*
X19460Y86990D01*
Y80270D01*
X42540D01*
Y86990D01*
X42290D01*
Y88930D01*
X38500D01*
Y90200D01*
X37230D01*
Y96490D01*
D02*
G37*
G36*
X60000Y92283D02*
X58342Y91953D01*
X56936Y91014D01*
X55997Y89608D01*
X55667Y87950D01*
X55997Y86292D01*
X56936Y84886D01*
X58342Y83947D01*
X60000Y83617D01*
X61658Y83947D01*
X63064Y84886D01*
X64003Y86292D01*
X64333Y87950D01*
X64003Y89608D01*
X63064Y91014D01*
X61658Y91953D01*
X60000Y92283D01*
D02*
G37*
G36*
X42540Y77730D02*
X19460D01*
Y71010D01*
X20750D01*
Y65994D01*
X19719Y64963D01*
X19658Y65003D01*
X18000Y65333D01*
X16342Y65003D01*
X14936Y64064D01*
X13997Y62658D01*
X13667Y61000D01*
X13997Y59342D01*
X14936Y57936D01*
X16342Y56997D01*
X18000Y56667D01*
X19658Y56997D01*
X21064Y57936D01*
X22003Y59342D01*
X22333Y61000D01*
X22318Y61074D01*
X23794Y62550D01*
X29710D01*
Y61510D01*
X32230D01*
Y67800D01*
X34770D01*
Y61510D01*
X37290D01*
Y62550D01*
X41250D01*
Y62673D01*
X42520Y63059D01*
X42936Y62436D01*
X44342Y61497D01*
X46000Y61167D01*
X47658Y61497D01*
X49064Y62436D01*
X50003Y63842D01*
X50333Y65500D01*
X50003Y67158D01*
X49064Y68564D01*
X47658Y69503D01*
X46000Y69833D01*
X44342Y69503D01*
X43382Y68862D01*
X42822Y69422D01*
X42346Y69740D01*
X42540Y71010D01*
X42540D01*
Y77730D01*
D02*
G37*
G36*
X373000Y286403D02*
X371342Y286073D01*
X369936Y285134D01*
X368997Y283728D01*
X368667Y282070D01*
X368997Y280412D01*
X369936Y279006D01*
X371342Y278067D01*
X373000Y277737D01*
X374658Y278067D01*
X376064Y279006D01*
X377003Y280412D01*
X377333Y282070D01*
X377003Y283728D01*
X376064Y285134D01*
X374658Y286073D01*
X373000Y286403D01*
D02*
G37*
G36*
X336000Y265333D02*
X334342Y265003D01*
X332936Y264064D01*
X331996Y262658D01*
X331667Y261000D01*
X331996Y259342D01*
X332936Y257936D01*
X334342Y256997D01*
X336000Y256667D01*
X337658Y256997D01*
X339064Y257936D01*
X340003Y259342D01*
X340333Y261000D01*
X340003Y262658D01*
X339064Y264064D01*
X337658Y265003D01*
X336000Y265333D01*
D02*
G37*
G36*
X175000Y158333D02*
X173342Y158004D01*
X171936Y157064D01*
X170997Y155658D01*
X170667Y154000D01*
X170997Y152342D01*
X171936Y150936D01*
X173342Y149997D01*
X175000Y149667D01*
X176658Y149997D01*
X178064Y150936D01*
X179003Y152342D01*
X179333Y154000D01*
X179003Y155658D01*
X178064Y157064D01*
X176658Y158004D01*
X175000Y158333D01*
D02*
G37*
G36*
X142400Y157808D02*
X140742Y157479D01*
X139336Y156539D01*
X138397Y155133D01*
X138067Y153475D01*
X138397Y151817D01*
X139336Y150411D01*
X140742Y149472D01*
X142400Y149142D01*
X144058Y149472D01*
X145464Y150411D01*
X146403Y151817D01*
X146733Y153475D01*
X146403Y155133D01*
X145464Y156539D01*
X144058Y157479D01*
X142400Y157808D01*
D02*
G37*
G36*
X223730Y77458D02*
X222072Y77128D01*
X220666Y76189D01*
X219727Y74783D01*
X219397Y73125D01*
X219727Y71467D01*
X220666Y70061D01*
X222072Y69122D01*
X223730Y68792D01*
X225388Y69122D01*
X226794Y70061D01*
X227733Y71467D01*
X228063Y73125D01*
X227733Y74783D01*
X226794Y76189D01*
X225388Y77128D01*
X223730Y77458D01*
D02*
G37*
G36*
X278471Y32740D02*
Y23950D01*
X287261D01*
X287080Y25327D01*
X286058Y27794D01*
X284433Y29912D01*
X282315Y31537D01*
X279848Y32559D01*
X278471Y32740D01*
D02*
G37*
G36*
X227340Y32820D02*
X218470D01*
Y23950D01*
X227340D01*
Y32820D01*
D02*
G37*
G36*
X215930D02*
X207060D01*
Y23950D01*
X215930D01*
Y32820D01*
D02*
G37*
G36*
X275931Y32740D02*
X274554Y32559D01*
X272087Y31537D01*
X269969Y29912D01*
X268344Y27794D01*
X267322Y25327D01*
X267141Y23950D01*
X275931D01*
Y32740D01*
D02*
G37*
G36*
X164099Y31780D02*
X145899D01*
Y13580D01*
X164099D01*
Y31780D01*
D02*
G37*
%LPD*%
D10*
X343875Y234000D02*
X411000D01*
X339875Y238000D02*
X343875Y234000D01*
X411000D02*
X424000Y247000D01*
Y275000D01*
X43000Y179000D02*
Y180071D01*
X37000Y186071D02*
X43000Y180071D01*
X25935Y179000D02*
Y185136D01*
X25000Y186071D02*
X25935Y185136D01*
X25000Y122000D02*
Y122000D01*
X21250Y125750D02*
X25000Y122000D01*
X34250Y136250D02*
X44000Y146000D01*
X34250Y131571D02*
Y136250D01*
X44000Y146000D02*
X48000D01*
Y150000D01*
X45929Y152071D02*
X48000Y150000D01*
X40750Y152071D02*
X45929D01*
X21250Y125750D02*
Y131571D01*
X33500Y90200D02*
X38500D01*
X41950D02*
X44750Y93000D01*
X38500Y90200D02*
X41950D01*
X31000Y79000D02*
X33500Y81500D01*
Y90200D01*
X31000Y79000D02*
X33500Y76500D01*
Y67800D02*
Y76500D01*
Y60500D02*
Y67800D01*
X13000Y230369D02*
X23001D01*
X39000Y286000D02*
X49000D01*
D13*
X279000Y113757D02*
X286190Y120947D01*
X279000Y113472D02*
Y113757D01*
X283190Y122190D02*
Y137810D01*
X257000Y96000D02*
X283190Y122190D01*
X274750Y120320D02*
X280190Y125760D01*
X262319Y120320D02*
X274750D01*
X280190Y125760D02*
Y135810D01*
X278900Y113372D02*
X279000Y113472D01*
X286190Y120947D02*
Y139567D01*
X146000Y230000D02*
X154000Y221999D01*
Y187143D02*
Y221999D01*
X145000Y178143D02*
X154000Y187143D01*
X145000Y176000D02*
Y178143D01*
X142000Y172750D02*
Y179385D01*
X146000Y183385D01*
Y213999D01*
X145000Y176000D02*
X154000Y167000D01*
X142000Y172750D02*
X173930Y140820D01*
X154000Y167000D02*
X263000D01*
X289190Y140810D01*
X267367Y158390D02*
X286190Y139567D01*
X226390Y158390D02*
X267367D01*
X289190Y119420D02*
Y140810D01*
X292190Y118177D02*
Y142053D01*
X159000Y175000D02*
X259243D01*
X292190Y142053D01*
X266000Y155000D02*
X283190Y137810D01*
X264680Y151320D02*
X280190Y135810D01*
X284900Y110887D02*
X292190Y118177D01*
X281900Y112130D02*
X289190Y119420D01*
X281900Y101436D02*
Y112130D01*
X278900Y102679D02*
Y113372D01*
X284900Y100194D02*
Y110887D01*
X271150Y94929D02*
X278900Y102679D01*
X257000Y78997D02*
Y96000D01*
X276000Y95536D02*
X281900Y101436D01*
X281000Y96294D02*
X284900Y100194D01*
X276000Y75370D02*
Y95536D01*
X271150Y71970D02*
Y94929D01*
X281000Y83300D02*
Y96294D01*
X276000Y75370D02*
X282370Y69000D01*
X281000Y83300D02*
X283504Y80796D01*
X282370Y69000D02*
X322009D01*
X283504Y80796D02*
X317211D01*
X271150Y71970D02*
X277120Y66000D01*
X332314D01*
X322009Y69000D02*
X335617Y82609D01*
X272997Y63000D02*
X333556D01*
X271755Y60000D02*
X334799D01*
X298500Y57000D02*
X336041D01*
X332314Y66000D02*
X344750Y78436D01*
X333556Y63000D02*
X347750Y77194D01*
X334799Y60000D02*
X350750Y75951D01*
X336041Y57000D02*
X341187Y62146D01*
X278880Y37380D02*
X298500Y57000D01*
X257000Y78997D02*
X272997Y63000D01*
X251040Y80715D02*
X271755Y60000D01*
X263620Y37380D02*
X278880D01*
X251040Y109040D02*
X262319Y120320D01*
X251040Y80715D02*
Y109040D01*
X257071Y125799D02*
X260972Y129700D01*
X256979Y125799D02*
X257071D01*
X244000Y112821D02*
X256979Y125799D01*
X234000Y118000D02*
X241999D01*
X241799Y130799D02*
X255000D01*
X244000Y112728D02*
Y112821D01*
X260972Y129700D02*
X271115D01*
X179000Y68000D02*
X241799Y130799D01*
X243272Y112000D02*
X244000Y112728D01*
X233000Y112000D02*
X243272D01*
X191000Y70000D02*
X233000Y112000D01*
X241999Y59001D02*
Y99000D01*
Y59001D02*
X263620Y37380D01*
X133000Y226999D02*
X146000Y213999D01*
X140000Y246000D02*
X162000Y224000D01*
X103000Y246000D02*
X140000D01*
X173930Y140820D02*
X208820D01*
X129180Y137820D02*
X210063D01*
X119000Y148000D02*
X129180Y137820D01*
X210063D02*
X227243Y155000D01*
X208820Y140820D02*
X226390Y158390D01*
X207485Y131000D02*
X227805Y151320D01*
X126570Y131000D02*
X207485D01*
X227805Y151320D02*
X264680D01*
X227243Y155000D02*
X266000D01*
X344750Y78436D02*
Y95792D01*
X350750Y75951D02*
Y98277D01*
X347750Y77194D02*
Y97035D01*
X341187Y62146D02*
X372903D01*
X337000Y103542D02*
X344750Y95792D01*
X346000Y103027D02*
X350750Y98277D01*
X343000Y101785D02*
X347750Y97035D01*
X337000Y103542D02*
Y106316D01*
X346000Y103027D02*
Y115250D01*
X343000Y101785D02*
Y109000D01*
X337000Y115000D02*
X343000Y109000D01*
X123000Y224000D02*
X135000Y211999D01*
Y185000D02*
Y211999D01*
X140929Y185892D02*
Y210313D01*
X128000Y223242D02*
X140929Y210313D01*
X128000Y223242D02*
Y226071D01*
X119000Y169000D02*
X135000Y185000D01*
X115000Y174000D02*
X129500Y188500D01*
Y203499D01*
X115000Y142570D02*
Y174000D01*
X119000Y148000D02*
Y169000D01*
X271115Y129700D02*
X271150Y129665D01*
X112000Y221000D02*
X129500Y203499D01*
X115000Y142570D02*
X126570Y131000D01*
X317211Y80796D02*
X326000Y89585D01*
Y124522D01*
X345000Y143522D01*
X124500Y157321D02*
X135750Y168571D01*
Y180714D02*
X140929Y185892D01*
X135750Y168571D02*
Y180714D01*
X358327Y157320D02*
X368007Y167000D01*
X334000Y157320D02*
X358327D01*
X368007Y167000D02*
X368250D01*
X338071Y154320D02*
X362641D01*
X152607Y178679D02*
X156929Y183000D01*
X269071D01*
X303751Y148320D01*
X336314D01*
X306679Y151320D02*
X335071D01*
X338071Y154320D01*
X336314Y148320D02*
X339314Y151320D01*
X363884D01*
X333000Y156320D02*
X334000Y157320D01*
X375275Y155640D02*
X388430D01*
X399920Y144150D01*
X362641Y154320D02*
X379321Y171000D01*
X363884Y151320D02*
X375829Y163265D01*
X385250D01*
X379321Y171000D02*
X417630D01*
X385250Y163265D02*
X389515Y159000D01*
X397999D01*
X403999Y153000D01*
X417630Y171000D02*
X428000Y160630D01*
X411283Y181590D02*
X431000Y161873D01*
X367875Y181590D02*
X411283D01*
X431000Y115248D02*
Y161873D01*
X399920Y144150D02*
X423532D01*
X424850Y142832D01*
Y125768D02*
Y142832D01*
X428000Y116930D02*
Y160630D01*
X423532Y124450D02*
X424850Y125768D01*
X420450Y124450D02*
X423532D01*
X417000Y121000D02*
X420450Y124450D01*
X417000Y116250D02*
Y121000D01*
X414750Y114000D02*
X417000Y116250D01*
X408450Y114000D02*
X414750D01*
X402450Y120000D02*
X408450Y114000D01*
X422071Y111000D02*
X428000Y116930D01*
X407000Y111000D02*
X422071D01*
X401494Y116506D02*
X407000Y111000D01*
X401757Y112000D02*
X405757Y108000D01*
X395110Y112000D02*
X401757D01*
X388000Y120000D02*
X402450D01*
X393228Y116506D02*
X401494D01*
X418000Y102248D02*
X431000Y115248D01*
X408859Y108000D02*
X411310Y105549D01*
X405757Y108000D02*
X408859D01*
X384000Y116000D02*
X388000Y120000D01*
X390228Y113506D02*
X393228Y116506D01*
X384000Y110000D02*
Y116000D01*
Y110000D02*
X386155Y107845D01*
X390955D01*
X395110Y112000D01*
X372903Y62146D02*
X397440Y86683D01*
Y99750D01*
X389263Y113506D02*
X390228D01*
X371620Y43120D02*
X411310Y82810D01*
X371620Y42039D02*
Y43120D01*
X369125Y39544D02*
X371620Y42039D01*
X369125Y21410D02*
Y39544D01*
X411310Y82810D02*
Y105549D01*
X418000Y85257D02*
Y102248D01*
X375750Y43007D02*
X418000Y85257D01*
X375750Y15751D02*
Y43007D01*
X371999Y12000D02*
X375750Y15751D01*
X301275Y170486D02*
Y176000D01*
X298180Y167391D02*
X301275Y170486D01*
X298180Y159819D02*
X306679Y151320D01*
X298180Y159819D02*
Y167391D01*
X309500Y157000D02*
Y178600D01*
X312490Y181590D01*
X367875D01*
X257811Y225000D02*
X305672D01*
X256881Y224070D02*
X257811Y225000D01*
X252739Y224070D02*
X256881D01*
X252559Y224250D02*
X252739Y224070D01*
X234455Y224250D02*
X252559D01*
X234205Y224000D02*
X234455Y224250D01*
X162000Y224000D02*
X234205D01*
X305672Y225000D02*
X324500Y243828D01*
X254880Y229000D02*
X305429D01*
X70098Y252000D02*
X146000D01*
X70050Y252048D02*
X70098Y252000D01*
X111400Y238920D02*
X121320Y229000D01*
X125071D01*
X128000Y226071D01*
X233000Y107000D02*
X242000D01*
X234000Y118000D02*
X234000Y118000D01*
X196000Y70000D02*
X233000Y107000D01*
X196000Y53000D02*
Y70000D01*
X191000Y59000D02*
Y70000D01*
X174000Y58000D02*
X234000Y118000D01*
X173000Y42000D02*
X179000Y48000D01*
X191000D01*
X196000Y53000D01*
X144000Y68000D02*
X179000D01*
X234000Y286999D02*
Y297999D01*
X249750Y313750D01*
X366765D01*
X389515Y291000D01*
X422000D01*
X388272Y288000D02*
X413000D01*
X390081Y285000D02*
X402680Y272401D01*
X387030Y285000D02*
X390081D01*
X368030Y304000D02*
X387030Y285000D01*
X273000Y304000D02*
X368030D01*
X367272Y309000D02*
X388272Y288000D01*
X273000Y309000D02*
X367272D01*
X422000Y291000D02*
X433000Y280000D01*
X413000Y288000D02*
X417000Y284000D01*
X433000Y246000D02*
Y280000D01*
X412500Y225500D02*
X433000Y246000D01*
X402680Y247001D02*
X417000Y261321D01*
Y284000D01*
X412500Y205500D02*
Y225500D01*
X245027Y273099D02*
Y277000D01*
X245000Y277027D02*
X245027Y277000D01*
X245000Y277027D02*
Y277391D01*
X242071Y280320D02*
X245000Y277391D01*
X228680Y280320D02*
X242071D01*
X224000Y285000D02*
X228680Y280320D01*
X224000Y285000D02*
Y289720D01*
X294429Y261999D02*
X295429Y261000D01*
X293928Y261999D02*
X294429D01*
X292242Y263686D02*
X293928Y261999D01*
X285686Y263686D02*
X292242D01*
X282000Y260000D02*
X285686Y263686D01*
X284000Y266999D02*
X295999D01*
X280000Y263000D02*
X284000Y266999D01*
X245928Y260000D02*
X282000D01*
X244685Y257000D02*
X284000D01*
X291000Y250000D02*
X310000D01*
X284000Y257000D02*
X291000Y250000D01*
X246000Y266999D02*
X250000D01*
X243000Y271071D02*
X245027Y273099D01*
X243000Y271071D02*
Y271071D01*
X241000Y269070D02*
X243000Y271071D01*
X241000Y264928D02*
Y269070D01*
X240000Y272314D02*
Y275320D01*
X257870Y282970D02*
X260832D01*
X254000Y279100D02*
X257870Y282970D01*
X254000Y276999D02*
Y279100D01*
X249000Y273929D02*
Y289519D01*
X241000Y264928D02*
X245928Y260000D01*
X249000Y289519D02*
X252300Y292820D01*
X237999Y263686D02*
Y270313D01*
Y263686D02*
X244685Y257000D01*
X249000Y273929D02*
X256929Y266000D01*
X237999Y270313D02*
X240000Y272314D01*
X256929Y266000D02*
X276599D01*
X267150Y285999D02*
Y296300D01*
X262150Y284288D02*
Y298150D01*
X260832Y282970D02*
X262150Y284288D01*
X267850Y297000D02*
Y298850D01*
X267150Y296300D02*
X267850Y297000D01*
Y298850D02*
X273000Y304000D01*
X262150Y298150D02*
X273000Y309000D01*
X283132Y272533D02*
X297537D01*
X299537Y270533D01*
X314335D01*
X250000Y266999D02*
X254000Y263000D01*
X280000D01*
X92501Y295000D02*
X208390D01*
X91721Y294220D02*
X92501Y295000D01*
X87579Y294220D02*
X91721D01*
X86799Y295000D02*
X87579Y294220D01*
X72631Y295000D02*
X86799D01*
X208390D02*
X212570Y290820D01*
X49000Y271369D02*
X72631Y295000D01*
X70000Y81000D02*
X83000Y68000D01*
X144000D01*
X79000Y222000D02*
X103000Y246000D01*
X65840Y222000D02*
X79000D01*
X64125Y223715D02*
X65840Y222000D01*
X64125Y223715D02*
Y230000D01*
X305429Y229000D02*
X321500Y245071D01*
Y263368D01*
X324500Y243828D02*
Y264610D01*
X276599Y266000D02*
X283132Y272533D01*
X62000Y112825D02*
X70000Y104825D01*
Y81000D02*
Y104825D01*
X22000Y211000D02*
X25000Y208000D01*
Y199571D02*
Y208000D01*
X34250Y143999D02*
Y152071D01*
X27750Y137499D02*
X34250Y143999D01*
X27750Y131571D02*
Y137499D01*
X30320Y124000D02*
X40750D01*
X27750Y126570D02*
X30320Y124000D01*
X27750Y126570D02*
Y131571D01*
X315577Y273533D02*
X324500Y264610D01*
X314335Y270533D02*
X321500Y263368D01*
X302473Y273533D02*
X315577D01*
X292382Y283624D02*
X302473Y273533D01*
X146000Y252000D02*
X163000Y235000D01*
X220000D01*
X254810Y229070D02*
X254880Y229000D01*
X220000Y235000D02*
X225930Y229070D01*
X254810D01*
X295429Y261000D02*
X311000D01*
X286896Y283624D02*
X292382D01*
X277700Y292820D02*
X286896Y283624D01*
X43500Y65500D02*
X46000D01*
X41200Y67800D02*
X43500Y65500D01*
X38500Y67800D02*
X41200D01*
X33000Y203571D02*
X37000Y199571D01*
X33000Y203571D02*
Y207000D01*
X40750Y124000D02*
Y131571D01*
X27750Y144570D02*
Y152071D01*
X15000D02*
X21250D01*
X13800Y90200D02*
X23500D01*
Y65500D02*
Y67800D01*
X19000Y61000D02*
X23500Y65500D01*
X18000Y61000D02*
X19000D01*
X39001Y271369D02*
X49000D01*
D173*
X140649Y267533D02*
X179000D01*
X131916Y258800D02*
X140649Y267533D01*
X68714Y258800D02*
X131916D01*
X68136Y259378D02*
X68714Y258800D01*
X33378Y259378D02*
X68136D01*
X15000Y241000D02*
X33378Y259378D01*
X276670Y127379D02*
Y133330D01*
X273437Y124145D02*
X276670Y127379D01*
X289999Y105000D02*
Y105449D01*
X312875Y128325D01*
X258529Y122279D02*
X260395Y124145D01*
X258437Y122279D02*
X258529D01*
X247520Y111363D02*
X258437Y122279D01*
X247520Y79257D02*
Y111363D01*
X260395Y124145D02*
X273437D01*
X247520Y79257D02*
X260630Y66147D01*
Y48075D02*
Y66147D01*
Y48075D02*
X265550Y43155D01*
X271000Y139000D02*
X276670Y133330D01*
X247000Y139000D02*
X271000D01*
X290000Y97000D02*
X301204Y85796D01*
X315140D01*
X240000Y146000D02*
X247000Y139000D01*
X312875Y128325D02*
Y132696D01*
X13000Y286000D02*
X23000D01*
D176*
X109000Y139400D02*
Y187000D01*
Y139400D02*
X124080Y124320D01*
X109000Y187000D02*
X116000Y194000D01*
X124080Y124320D02*
X179000D01*
X351837Y132140D02*
X365696Y146000D01*
X349556Y132140D02*
X351837D01*
X390999Y137471D02*
X409020Y119450D01*
X390999Y137471D02*
Y146000D01*
X365696D02*
X390999D01*
X409020Y119450D02*
X412000D01*
X404036Y103845D02*
X407138D01*
X400036Y107845D02*
X404036Y103845D01*
X396831Y107845D02*
X400036D01*
X407138Y103845D02*
X407155Y103828D01*
X349556Y132140D02*
X378006Y103690D01*
X392676D01*
X396831Y107845D01*
X407155Y86279D02*
Y103828D01*
X367465Y44841D02*
X367844Y45220D01*
X367465Y43760D02*
Y44841D01*
X357389Y33685D02*
X367465Y43760D01*
X344390Y33685D02*
X357389D01*
X367844Y46968D02*
X407155Y86279D01*
X367844Y45220D02*
Y46968D01*
X342396Y21000D02*
Y31690D01*
X330396Y9000D02*
X342396Y21000D01*
X194079Y9000D02*
X330396D01*
X342396Y31690D02*
X344390Y33685D01*
X180399Y22680D02*
X194079Y9000D01*
D181*
X403260Y272560D02*
D03*
X328001Y22680D02*
D03*
X302601D02*
D03*
X277201D02*
D03*
X242600D02*
D03*
X277700Y292820D02*
D03*
X353401Y327320D02*
D03*
X415000Y159700D02*
D03*
X180399Y22680D02*
D03*
X97300Y327320D02*
D03*
X122700D02*
D03*
X148100D02*
D03*
X293400D02*
D03*
X182600Y327321D02*
D03*
X207999Y327320D02*
D03*
D182*
X403260Y247160D02*
D03*
X415000Y134300D02*
D03*
D183*
X353401Y22680D02*
D03*
X217200D02*
D03*
X252300Y292820D02*
D03*
X328001Y327320D02*
D03*
X154999Y22680D02*
D03*
X71900Y327320D02*
D03*
X268000D02*
D03*
X233399D02*
D03*
D184*
X28000Y28000D02*
D03*
Y322000D02*
D03*
X403000Y28000D02*
D03*
Y322000D02*
D03*
D185*
X100924Y164080D02*
D03*
X439999Y320830D02*
D03*
Y30000D02*
D03*
X419000Y181250D02*
D03*
X385860Y188750D02*
D03*
X309000Y185340D02*
D03*
X283504Y183385D02*
D03*
X264907Y176550D02*
D03*
X257071Y206547D02*
D03*
X175000Y154000D02*
D03*
X190000Y153000D02*
D03*
X273900Y104750D02*
D03*
X289999Y105000D02*
D03*
X241999Y118000D02*
D03*
X255000Y130799D02*
D03*
X266150Y112500D02*
D03*
X271150Y129665D02*
D03*
X159000Y175000D02*
D03*
X140929Y185892D02*
D03*
X375275Y155640D02*
D03*
X368250Y167000D02*
D03*
X345000Y143522D02*
D03*
X346000Y115250D02*
D03*
X337000Y115000D02*
D03*
Y106316D02*
D03*
X335617Y82609D02*
D03*
X403999Y153000D02*
D03*
X390999Y146000D02*
D03*
X412000Y119450D02*
D03*
X397440Y99750D02*
D03*
X389263Y113506D02*
D03*
X369125Y21410D02*
D03*
X371999Y12000D02*
D03*
X422999Y119000D02*
D03*
X381760Y123390D02*
D03*
X349556Y132140D02*
D03*
X301275Y176000D02*
D03*
X303180Y165320D02*
D03*
X333000Y156320D02*
D03*
X396500Y164080D02*
D03*
X367875Y181590D02*
D03*
X309500Y157000D02*
D03*
X212070Y207590D02*
D03*
X190070Y196590D02*
D03*
X201070Y207590D02*
D03*
Y196590D02*
D03*
X212070D02*
D03*
X285550Y234270D02*
D03*
X287770Y219500D02*
D03*
X142400Y153475D02*
D03*
X361310Y46310D02*
D03*
X357400Y57146D02*
D03*
X320591Y220000D02*
D03*
X339875Y238000D02*
D03*
X315140Y85796D02*
D03*
X370760Y123390D02*
D03*
X381760Y134390D02*
D03*
X370760D02*
D03*
X352000Y165000D02*
D03*
X342000D02*
D03*
X352000Y175000D02*
D03*
X342000D02*
D03*
X124500Y157321D02*
D03*
X152607Y178679D02*
D03*
X70050Y252048D02*
D03*
X71150Y238920D02*
D03*
X83000Y204000D02*
D03*
X133000Y226999D02*
D03*
X123000Y224000D02*
D03*
X112000Y221000D02*
D03*
X242000Y107000D02*
D03*
X241999Y99000D02*
D03*
X240000Y146000D02*
D03*
X312875Y132696D02*
D03*
X266150Y82421D02*
D03*
X250235Y43155D02*
D03*
Y68735D02*
D03*
X265550Y43155D02*
D03*
X233399Y84000D02*
D03*
X226000D02*
D03*
X218687D02*
D03*
X223730Y73125D02*
D03*
X290000Y97000D02*
D03*
X286000Y87250D02*
D03*
X173000Y42000D02*
D03*
X191000Y59000D02*
D03*
X174000Y58000D02*
D03*
X424000Y275000D02*
D03*
X373000Y282070D02*
D03*
X423000Y217000D02*
D03*
X412500Y205500D02*
D03*
X216000Y299220D02*
D03*
X246000Y266999D02*
D03*
X240000Y275320D02*
D03*
X254000Y276999D02*
D03*
X267150Y285999D02*
D03*
X234000Y286999D02*
D03*
X295999Y266999D02*
D03*
X258400Y104750D02*
D03*
X266150Y97000D02*
D03*
X85999Y134321D02*
D03*
X144000Y68000D02*
D03*
X105750Y19000D02*
D03*
X127000Y30750D02*
D03*
X64125Y230000D02*
D03*
X310000Y250000D02*
D03*
X297000Y256000D02*
D03*
X336000Y261000D02*
D03*
X38679Y242000D02*
D03*
X124500Y193300D02*
D03*
X202570Y158640D02*
D03*
X217570D02*
D03*
X25935Y179000D02*
D03*
X43000D02*
D03*
X25000Y122000D02*
D03*
X352930Y271299D02*
D03*
X353000Y279820D02*
D03*
X190070Y43000D02*
D03*
X86250Y19250D02*
D03*
X48000Y146000D02*
D03*
X212070Y229590D02*
D03*
Y218590D02*
D03*
X318500Y279820D02*
D03*
X307500D02*
D03*
X311000Y261000D02*
D03*
X33500Y60500D02*
D03*
X195000Y103386D02*
D03*
X130750Y117250D02*
D03*
X62000Y112825D02*
D03*
X99250Y76250D02*
D03*
X79750Y97750D02*
D03*
X86250Y76250D02*
D03*
X220000Y276320D02*
D03*
X146000Y230000D02*
D03*
X61000Y250000D02*
D03*
X22000Y211000D02*
D03*
X33000Y207000D02*
D03*
X44750Y93000D02*
D03*
X60000Y202730D02*
D03*
Y151000D02*
D03*
X40750Y124000D02*
D03*
X27750Y144570D02*
D03*
X15000Y152071D02*
D03*
X60000Y87950D02*
D03*
X13800Y90200D02*
D03*
X46000Y65500D02*
D03*
X18000Y61000D02*
D03*
X13000Y230369D02*
D03*
X15000Y241000D02*
D03*
X49000Y271369D02*
D03*
Y286000D02*
D03*
X13000D02*
D03*
X116000Y194000D02*
D03*
X254810Y229070D02*
D03*
X224000Y289720D02*
D03*
X212570Y290820D02*
D03*
X181000Y104436D02*
D03*
X307500Y290820D02*
D03*
X318500Y290820D02*
D03*
X84000Y174320D02*
D03*
X167570Y278071D02*
D03*
X94000Y121000D02*
D03*
X102000Y105750D02*
D03*
X111400Y238920D02*
D03*
X89650Y299220D02*
D03*
X71050Y277020D02*
D03*
X71000Y264320D02*
D03*
X81270Y188590D02*
D03*
X151000Y153050D02*
D03*
X209999Y120320D02*
D03*
X179000Y124320D02*
D03*
X200000Y147320D02*
D03*
X179000Y267533D02*
D03*
X227000Y262000D02*
D03*
X168070Y240590D02*
D03*
X179070D02*
D03*
X190070D02*
D03*
X201070D02*
D03*
X212070D02*
D03*
X168070Y229590D02*
D03*
X179070D02*
D03*
X190070D02*
D03*
X201070D02*
D03*
X168070Y218590D02*
D03*
X179070D02*
D03*
X190070D02*
D03*
X201070D02*
D03*
X168070Y207590D02*
D03*
X179070D02*
D03*
X190070D02*
D03*
X168070Y196590D02*
D03*
X179070D02*
D03*
X374000Y86900D02*
D03*
Y94400D02*
D03*
Y79400D02*
D03*
D191*
X23000Y286000D02*
D03*
X39000D02*
D03*
D192*
X38500Y67800D02*
D03*
X33500D02*
D03*
X28500D02*
D03*
X23500D02*
D03*
X38500Y90200D02*
D03*
X33500D02*
D03*
X28500D02*
D03*
X23500D02*
D03*
D193*
X31000Y79000D02*
D03*
D194*
X23001Y271369D02*
D03*
Y230369D02*
D03*
X39001Y271369D02*
D03*
Y230369D02*
D03*
D195*
X37000Y186071D02*
D03*
X25000D02*
D03*
Y199571D02*
D03*
X37000D02*
D03*
D196*
Y187321D02*
D03*
D197*
X40750Y131571D02*
D03*
X34250D02*
D03*
X27750D02*
D03*
X21250D02*
D03*
Y152071D02*
D03*
X27750D02*
D03*
X34250D02*
D03*
X40750D02*
D03*
M02*
