﻿Field=#~Integer~#~50|Field=Comment~String~Comment~206|Field=Description~String~Description~277|Field=Designator~String~Designator~150|Field=Footprint~String~Footprint~64|Field=LibRef~String~LibRef~64|Field=P/N~String~P/N~64|Field=PartNumber~String~PartNumber~64|Field=Quantity~Integer~Quantity~64|Field=Supplier Part Number~String~Supplier Part Number~64|Field=Supplier~String~Supplier~100|Field=Manufacturer 1~String~Manufacturer 1~100|Field=Manufacturer Part Number 1~String~Manufacturer Part Number 1~100|Field=Supplier 1~String~Supplier 1~100|Field=Supplier Currency 1~String~Supplier Currency 1~100|Field=Supplier Order Qty 1~Integer~Supplier Order Qty 1~100|Field=Supplier Part Number 1~String~Supplier Part Number 1~100|Field=Supplier Stock 1~String~Supplier Stock 1~100|Field=Supplier Subtotal 1~Float~Supplier Subtotal 1~100|Field=Supplier Unit Price 1~Float~Supplier Unit Price 1~100|ReportField=Currency~<none>|ReportField=ProductionQuantity~1|ReportField=ProjectFileName~SolarRecording.PrjPcb|ReportField=ProjectFullPath~C:\Users\user\Documents\lukas\pcb-designs\SolarRecording\SolarRecording.PrjPcb|ReportField=Title~Bill of Materials For BOM Document [SolarRecording.BomDoc]|ReportField=TotalQuantity~86|ReportField=ReportTime~11:30:58|ReportField=ReportDate~07.06.2017|ReportField=ReportDateTime~07.06.2017 11:30:58|ReportField=OutputName~Bill of Materials|ReportField=OutputType~BOM_PartType|ReportField=GeneratorName~BOM|ReportField=GeneratorDescription~Bill of Materials|ReportField=VariantName~None|ReportField=Address1~|ReportField=Address2~|ReportField=Address3~|ReportField=Address4~|ReportField=Application_BuildNumber~|ReportField=ApprovedBy~|ReportField=Author~|ReportField=CheckedBy~|ReportField=CompanyName~ETH Zurich|ReportField=ConfigurationParameters~|ReportField=ConfiguratorName~|ReportField=CurrentDate~07.06.2017|ReportField=CurrentTime~11:30:37|ReportField=Date~|ReportField=DocumentFullPathAndName~C:\Users\user\Documents\lukas\pcb-designs\SolarRecording\BatteryEmulation.SchDoc|ReportField=DocumentName~BatteryEmulation.SchDoc|ReportField=DocumentNumber~3|ReportField=DrawnBy~Lukas Sigrist|ReportField=Engineer~Lukas Sigrist|ReportField=ImagePath~|ReportField=IsUserConfigurable~|ReportField=ModifiedDate~06.06.2017|ReportField=Organization~Computer Engineering Group|ReportField=ProjectName~SolarRecording.PrjPcb|ReportField=Revision~1|ReportField=Rule~|ReportField=SheetNumber~3|ReportField=SheetTotal~4|ReportField=Time~|ReportField=Title~Solar Harvesting Recording Platform|ReportField=VersionControl_RevNumber~|ReportField=DataSourceFileName~SolarRecording.BomDoc|ReportField=DataSourceFullPath~C:\Users\user\Documents\lukas\pcb-designs\SolarRecording\SolarRecording.BomDoc
1|Jumper|Jumper Receptacle 2.54mm|A1, A2, A3, A4, A5||CMP-00020-1|||5|||TE Connectivity AMP Connectors|382811-8|Digi-Key|USD|5|A26228-ND|136574||
2|CAP 10nF 50V 0603(1608)|CAP 10nF 50V ±10% 0603 (1608 Metric) Thickness 1mm SMD|C1, C6|CAPC0603(1608)100_N|CMP-1035-02321-1|||2|||KEMET|C0603C103K5RACTU|Digi-Key|USD|2|399-1091-1-ND|1983658|0.2|0.10
3|CAP 4.7uF 10V 0603(1608)|CAP 4.7uF 10V ±10% 0603 (1608 Metric) Thickness 1mm SMD|C2, C4|CAPC0603(1608)100_N|CMP-1035-02785-1|||2|||KEMET|C0603C475K8PACTU|Digi-Key|USD|2|399-5503-1-ND|135793|0.58|0.29
4|100uF|CAP 100uF 6.3V ±20% 1210 (3225 Metric) Thickness 2.8mm SMD|C3, C13, C23|CAPC1210(3225)280A_N|CMP-1038-02303-1|||3|||KEMET|C1210C107M9PACTU|Digi-Key|USD|3|399-4697-6-ND|120988|3.18|1.06
5|CAP 100nF 16V 0603(1608)|CAP 100nF 16V ±10% 0603 (1608 Metric) Thickness 1mm SMD|C5, C10, C11, C12, C14, C15, C16, C17, C18, C19, C20, C21|CAPC0603(1608)100_N|CMP-1035-02584-1|||12|||KEMET|C0603C104K4RACTU|Digi-Key|USD|12|399-1096-1-ND|3784107|0.3|0.025
6|22uF|CAP 22uF 6.3V ±10% 1210 (3225 Metric) Thickness 1.7mm SMD|C7|CAPC1210(3225)170_N|CMP-1038-02258-1|||1|||KEMET|C1210C226K9PACTU|Digi-Key|USD|1|399-3303-1-ND|4104|1.03|1.03
7|100nF 16V|CAP 100nF 16V ±10% 0603 (1608 Metric) Thickness 1mm SMD|C8|CAPC0603(1608)100_N|CMP-1035-02584-1|||1|||KEMET|C0603C104K4RACTU|Digi-Key|USD|1|399-1096-1-ND|3784107|0.1|0.10
8|1uF 16V|CAP 1uF 16V ±10% 0603 (1608 Metric) Thickness 1mm SMD|C9|CAPC0603(1608)100_N|CMP-1035-02737-1|||1|||KEMET|C0603C105K4PACTU|Digi-Key|USD|1|399-5090-1-ND|413884|0.11|0.11
9|10uF 16V|CAP 10uF 16V ±10% 0805 (2012 Metric) Thickness 1mm SMD|C22, C24|CAPC0805(2012)100_N|CMP-1036-04928-1|||2|||Yageo|C2012X5R1C106K/0.85|Digi-Key|USD|2|445-7644-1-ND|0|0.5|0.25
10|10uF|CAP 10uF 6.3V ±10% 0603 (1608 Metric) Thickness 1mm SMD|C25|CAPC0603(1608)100_N|CMP-1035-02796-1|||1|||Yageo|C1608X5R0J106K|Digi-Key|USD|1|445-7492-1-ND|492|0.5|0.50
11|68001-203HLF|3 CONTACT(S), MALE, STRAIGHT TWO PART BOARD CONNECTOR, SOLDER, 2.54mm, 1x3|CTRL, VOUT, VOUT2, VSOLAR|Pin Header, 1x3, 2.54mm|CMP-00101-1|68001-203HLF||4|609-3470-ND|Digi-Key|Amphenol FCI|68001-203HLF|Digi-Key|USD|4|609-3470-ND|8365|0.8|0.20
12|1N5819HW-7-F|1.0 A Surface Mount Schottky Barrier Rectifier, 40 V, -65 to 125 degC, 2-Pin SOD-123 Package, RoHS, Tape and Reel|D1, D2|DIOD-SOD-123-2_V|CMP-0303-00003-1||1N5819HW-7-F|2|||Diodes Inc.|1N5819HW-7-F|Digi-Key|USD|2|1N5819HW-FDIDKR-ND|674598|0.98|0.49
13|68000-102HLF|2 CONTACT(S), MALE, STRAIGHT TWO PART BOARD CONNECTOR, SOLDER, 2.54mm, 1x2|GND1_SPLIT, GND2_SPLIT|Pin Header, 1x2|CMP-00100-1|||2|609-3500-ND|Digi-Key|Amphenol FCI|68000-102HLF|Digi-Key|USD|2|609-3500-ND|107600|0.38|0.19
14|V_IN|SMA FEMALE PCB EDGE MOUNT|J1|132322|CMP-00231-1|||1|CON-SMA-EDGE-S-ND|Digi-Key|RF Solutions|CON-SMA-EDGE-S|Digi-Key|USD|1|CON-SMA-EDGE-S-ND|2277|2.1|2.10
15|V_BAT|SMA FEMALE PCB EDGE MOUNT|J2|132322|CMP-00231-1|||1|CON-SMA-EDGE-S-ND|Digi-Key|RF Solutions|CON-SMA-EDGE-S|Digi-Key|USD|1|CON-SMA-EDGE-S-ND|2277|2.1|2.10
16|V_OUT|SMA FEMALE PCB EDGE MOUNT|J3|132322|CMP-00231-1|||1|CON-SMA-EDGE-S-ND|Digi-Key|RF Solutions|CON-SMA-EDGE-S|Digi-Key|USD|1|CON-SMA-EDGE-S-ND|2277|2.1|2.10
17|I_IN|SMA FEMALE PCB EDGE MOUNT|J4|132322|CMP-00231-1|||1|CON-SMA-EDGE-S-ND|Digi-Key|RF Solutions|CON-SMA-EDGE-S|Digi-Key|USD|1|CON-SMA-EDGE-S-ND|2277|2.1|2.10
18|I_OUT|SMA FEMALE PCB EDGE MOUNT|J5|132322|CMP-00231-1|||1|CON-SMA-EDGE-S-ND|Digi-Key|RF Solutions|CON-SMA-EDGE-S|Digi-Key|USD|1|CON-SMA-EDGE-S-ND|2277|2.1|2.10
19|DA: 0x45||J6|Small Solder Jumper|CMP-00005-1|||1|||||||||||
20|DA: 0x44||J7|Small Solder Jumper|CMP-00005-1|||1|||||||||||
21|DA: 0x77||J8|Small Solder Jumper|CMP-00005-1|||1|||||||||||
22|DA: 0x76||J9|Small Solder Jumper|CMP-00005-1|||1|||||||||||
23|LPS4018-223MR|Fixed Inductors LPS4018 Low Profile 22uH 0.9A 20% SMD|L1|COILCRAFT-IND-LPS4018|CMP-00081-1|LPS4018-223MRC||1|994-LPS4018-223MRC|Mouser|||||1||0||0.00
24|LPS4018-103MR|Fixed Inductors LPS4018 Low Profile 10uH 1.25A 20% SMD|L2|COILCRAFT-IND-LPS4018|CMP-00083-1|LPS4018-103MRB||1|994-LPS4018-103MRB|Mouser|||||1||0||0.00
25|67997-206HLF|CONN HEADER 2x3 POS 2.54mm Pitch TH Male STR 15AU|MPP_SELECT, X2|Pin Header, 2x3, TH, 2.54mm Pitch|CMP-00150-1|||2|609-3234-ND|Digi-Key|Amphenol FCI|67997-206HLF|Digi-Key|USD|2|609-3234-ND|32672|0.62|0.31
26|4M99|4M99 0.1W 1% 0603 (1608 Metric)  SMD|R1, R3|RESC0603(1608)_N|CMP-1012-00928-1|||2|||Vishay|CRCW06034M99FKEA|Digi-Key|USD|2|541-4.99MHCT-ND|70469|0.2|0.10
27|10M|10M 0.1W 1% 0603 (1608 Metric)  SMD|R2|RESC0603(1608)_N|CMP-1012-00962-1|||1|||Vishay|CRCW060310M0FKEA|Digi-Key|USD|1|541-10.0MHCT-ND|124775|0.1|0.10
28|8M66|8M66 0.1W 1% 0603 (1608 Metric)  SMD|R4|RESC0603(1608)_N|CMP-1012-00955-1|||1|||Vishay|CRCW06038M66FKEA|Digi-Key|USD|1|541-8.66MHCT-ND|16157|0.1|0.10
29|8M06|8M06 0.1W 1% 0603 (1608 Metric)  SMD|R5|RESC0603(1608)_N|CMP-1012-00951-1|||1|||Vishay|CRCW06038M06FKEA|Digi-Key|USD|1|541-8.06MHCT-ND|15781|0.1|0.10
30|5M23|5M23 0.1W 1% 0603 (1608 Metric)  SMD|R6|RESC0603(1608)_N|CMP-1012-00931-1|||1|||Vishay|CRCW06035M23FKEA|Digi-Key|USD|1|541-5.23MHCT-ND|10132|0.1|0.10
31|4M32|4M32 0.1W 1% 0603 (1608 Metric)  SMD|R7|RESC0603(1608)_N|CMP-1012-00921-1|||1|||Vishay|CRCW06034M32FKEA|Digi-Key|USD|1|541-4.32MHCT-ND|13260|0.1|0.10
32|1M96|1M96 0.1W 1% 0603 (1608 Metric)  SMD|R8|RESC0603(1608)_N|CMP-1012-00880-1|||1|||Vishay|CRCW06031M96FKEA|Digi-Key|USD|1|541-1.96MHCT-ND|2050|0.1|0.10
33|7M87|7M87 0.1W 1% 0603 (1608 Metric)  SMD|R9|RESC0603(1608)_N|CMP-1012-00950-1|||1|||Vishay|CRCW06037M87FKEA|Digi-Key|USD|1|541-7.87MHCT-ND|22754|0.1|0.10
34|3M01|3M01 0.1W 1% 0603 (1608 Metric)  SMD|R10|RESC0603(1608)_N|CMP-1012-00902-1|||1|||Vishay|CRCW06033M01FKEA|Digi-Key|USD|1|541-3.01MHCT-ND|17770|0.1|0.10
35|107K|107K 0.1W 1% 0603 (1608 Metric)  SMD|R11|RESC0603(1608)_N|CMP-1012-00739-1|||1|||Vishay|CRCW0603107KFKEA|Digi-Key|USD|1|541-107KHCT-ND|25849|0.1|0.10
36|8K2|8K2 0.1W 1% 0603 (1608 Metric)  SMD|R12|RESC0603(1608)_N|CMP-1012-00613-1|||1|||Vishay|CRCW06038K20FKEA|Digi-Key|USD|1|541-8.20KHCT-ND|1186|0.1|0.10
37|30K1|30K1 0.1W 1% 0603 (1608 Metric)  SMD|R13|RESC0603(1608)_N|CMP-1012-00676-1|||1|||Vishay|CRCW060330K1FKEA|Digi-Key|USD|1|541-30.1KHCT-ND|122634|0.1|0.10
38|9K09|9K09 0.1W 1% 0603 (1608 Metric)  SMD|R14|RESC0603(1608)_N|CMP-1012-00618-1|||1|||Vishay|CRCW06039K09FKEA|Digi-Key|USD|1|541-9.09KHCT-ND|37839|0.1|0.10
39|13K3|13K3 0.1W 1% 0603 (1608 Metric)  SMD|R15|RESC0603(1608)_N|CMP-1012-00636-1|||1|||Vishay|CRCW060313K3FKEA|Digi-Key|USD|1|541-13.3KHCT-ND|4756|0.1|0.10
40|3R3 0.5W|3R3 0.5W 1% 1210 (3225 Metric)  SMD|R16|RESC1210(3225)_N|CMP-1015-00228-1|||1|||Vishay|CRCW12103R30FKEA|Digi-Key|USD|1|CRCW12103R30FKEA-ND|0||
41|20K5|20K5 0.1W 1% 0603 (1608 Metric)  SMD|R17|RESC0603(1608)_N|CMP-1012-00656-1|||1|||Vishay|CRCW060320K5FKEA|Digi-Key|USD|1|541-20.5KHCT-ND|52773|0.1|0.10
42|10K|10K 0.1W 1% 0603 (1608 Metric)  SMD|R18, R19, R20, R21|RESC0603(1608)_N|CMP-1012-00623-1|||4|||Vishay|CRCW060310K0FKEA|Digi-Key|USD|4|541-10.0KHCT-ND|2931828|0.4|0.10
43|976K|976K 0.1W 1% 0603 (1608 Metric)  SMD|R22|RESC0603(1608)_N|CMP-1012-00848-1|||1|||Vishay|CRCW0603976KFKEA|Digi-Key|USD|1|541-976KHCT-ND|27304|0.1|0.10
44|102K|102K 0.1W 1% 0603 (1608 Metric)  SMD|R23|RESC0603(1608)_N|CMP-1012-00737-1|||1|||Vishay|CRCW0603102KFKEA|Digi-Key|USD|1|541-102KHCT-ND|35828|0.1|0.10
45|760390015|Audio Transformers / Signal Transformers MID-SN6501 TI Driver Toroid .475mH 3.3VDC|T1|0.265" L x 0.395" W (6.73mm x 10.05mm)|CMP-00544-1|||1|732-4459-2-ND|Digi-Key|Wurth Electronics Midcom|760390015|Digi-Key|USD|1|732-4459-1-ND|0|1.9|1.90
46|BQ25570RGRT|IC ENERGY HARV CTRLR BATT 20VQFN|U1|QFN50P350X350X100_HS-21L|CMP-00082-2|BQ25570RGRT||1|296-37014-2-ND|Digi-Key|Texas Instruments|BQ25570RGRR|Digi-Key|USD|1|296-39934-1-ND|2990|7.06|7.06
47|SN6505BDBVT|TRANSFORMER DRIVER, 424KHZ, 5V, SOT-23-6|U2|SOT-23-CH6_N|CMP-00431-1|||1|296-43154-2-ND|Digikey|Texas Instruments|SN6505BDBVT|Digi-Key|USD|1|296-43154-1-ND|1825|5.51|5.51
48|LM4120IM5-5.0/NOPB|Precision Micropower Low Dropout Voltage Reference, 5-pin SOT-23, Pb-Free|U3|DBV0005A_L|CMP-0074-00212-4|||1|||National Semiconductor|LM4120IM5-5.0/NOPB|Digi-Key|USD|1|LM4120IM5-5.0/NOPBCT-ND|647|1.91|1.91
49|AD8655ARZ|Single Channel Low Offset Voltage Operational Amplifier, 28 MHz BW, 11 V/us SR, Industrial, 8-pin SOIC (R-8), Tube|U4|ADI-R-8_N|CMP-0384-01105-2||AD8655ARZ|1|||ANALOG DEVICES|AD8655ARZ|Digi-Key|USD|1|AD8655ARZ-ND|0|2.57|2.57
50|SHT31-DIS-B|Humidity Sensor, 2 %, 3.3 V, 0% to 100% Relative Humidity, TDFN, 8 Pins, 8 s|U5|SON50P250X100_HS-9L|CMP-00446-1|||1|1649-1011-2-ND|Digikey|Sensirion AG|SHT31-DIS-B|Digi-Key|USD|1|1649-1011-1-ND|6396|8.04|8.04
51|BME280|PRESSURE HUMIDITY TEMP GAS SENS|U6|BME280|CMP-00278-1|||1|828-1063-2-ND|Digi-Key|Bosch Sensortec|BME280|Digi-Key|USD|1|828-1063-1-ND|17978|7.58|7.58
52|TSL45315CL|Digital Ambient Light Sensor with Direct Lux Output, 2.3 to 3.3 V, CL-4, Pb-Free, Reel|U7, U9|AMS-CL-4-2000X2000DE_V|CMP-0550-00001-2||TSL45315CL|2|||ams|TSL45315CL|Digi-Key|USD|2|TSL45315-CLCT-ND|11510|3.74|1.87
53|LTC4316CMS#PBF|I2C Address Translator Interface 10-MSOP|U8|RM-10_L|CMP-00533-1|||1|LTC4316CMS#PBF-ND|Digikey|Linear Technology|LTC4316CMS#PBF|Digi-Key|USD|1|LTC4316CMS#PBF-ND|138|3.09|3.09
54|TPS76701QD|Single Output Fast Transient Response LDO, 1 A, Adjustable 1.5 to 5.5 V Output, 2.7 to 10 V Input, with Low IQ, 8-pin SOIC (D), -40 to 125 degC, Green (RoHS & no Sb/Br)|U10|D0008A_N|CMP-0395-00043-2||TPS76701QD|1|||Burr-Brown|TPS76701QD|Digi-Key|USD|1|296-2731-5-ND|237|3.29|3.29
55|110990030|GROVE 2MM PITCH 4PIN STRAIGHT CONN|X1|110990030|CMP-00434-1|110990030||1|1597-1082-ND|Digi-Key|Seeed Technology Co., Ltd|110990030|Digi-Key|USD|1|1597-1082-ND|20714|1.53|1.53
