G04 Layer_Physical_Order=2*
G04 Layer_Color=16711680*
%FSLAX25Y25*%
%MOIN*%
G70*
G01*
G75*
%ADD13R,0.05906X0.15551*%
%ADD59C,0.01378*%
%ADD60C,0.00984*%
%ADD61C,0.01969*%
%ADD62C,0.01000*%
%ADD64R,0.05906X0.05906*%
%ADD65C,0.05906*%
%ADD66R,0.05984X0.05984*%
%ADD67C,0.05984*%
%ADD68R,0.05984X0.05984*%
%ADD69R,0.05906X0.05906*%
%ADD70C,0.28346*%
%ADD71C,0.02362*%
%ADD72C,0.01969*%
%ADD73C,0.03150*%
G36*
X391732Y139764D02*
X388366D01*
Y155315D01*
X381476D01*
Y139764D01*
X366555D01*
Y155315D01*
X359665D01*
Y139764D01*
X339661D01*
Y146752D01*
X335709D01*
X331756D01*
Y139764D01*
X317850D01*
Y146752D01*
X313898D01*
X309945D01*
Y139764D01*
X289941D01*
Y155315D01*
X283051D01*
Y139764D01*
X268130D01*
Y155315D01*
X261240D01*
Y139764D01*
X240728D01*
Y155315D01*
X233839D01*
Y139764D01*
X218917D01*
Y155315D01*
X212028D01*
Y139764D01*
X191516D01*
Y155315D01*
X184626D01*
Y139764D01*
X169705D01*
Y155315D01*
X162815D01*
Y139764D01*
X153543D01*
Y163386D01*
X154995Y164837D01*
X155457Y164646D01*
Y162697D01*
X159154D01*
Y166394D01*
X157204D01*
X157013Y166856D01*
X163386Y173228D01*
X177165D01*
X182087Y178150D01*
Y200885D01*
X182587Y201239D01*
X201165D01*
X201423Y200827D01*
X201417Y200739D01*
X201231Y199803D01*
Y187008D01*
X201422Y186048D01*
X201966Y185234D01*
X207872Y179328D01*
X208686Y178785D01*
X209646Y178594D01*
X227362D01*
X228322Y178785D01*
X229136Y179328D01*
X235042Y185234D01*
X235042Y185234D01*
X235586Y186048D01*
X235777Y187008D01*
Y199803D01*
X235590Y200739D01*
X235585Y200827D01*
X235843Y201239D01*
X241142D01*
X241518Y201395D01*
X245582Y205458D01*
X246044Y205267D01*
Y183486D01*
X236460Y173902D01*
X236221Y173950D01*
X235568Y173820D01*
X235014Y173450D01*
X234644Y172897D01*
X234514Y172244D01*
X234644Y171591D01*
X235014Y171038D01*
X235568Y170668D01*
X236221Y170538D01*
X236873Y170668D01*
X237427Y171038D01*
X237797Y171591D01*
X237927Y172244D01*
X237879Y172483D01*
X247757Y182361D01*
X247974Y182687D01*
X248051Y183071D01*
Y228046D01*
X248513Y228295D01*
X248611Y228335D01*
X248717D01*
X248792Y228411D01*
X248889Y228451D01*
X251205Y230767D01*
X260827D01*
X261204Y230923D01*
X266125Y235844D01*
X266281Y236221D01*
Y246889D01*
X266274Y246905D01*
X266363Y247280D01*
X266521Y247520D01*
X266954Y247809D01*
X267324Y248363D01*
X267454Y249016D01*
X267454Y249018D01*
X270184Y251748D01*
X319383D01*
X323918Y247214D01*
Y233101D01*
X322837Y232020D01*
X322835Y232021D01*
X322182Y231891D01*
X321628Y231521D01*
X321627Y231519D01*
X321090D01*
X321088Y231521D01*
X320535Y231891D01*
X319882Y232021D01*
X319229Y231891D01*
X318676Y231521D01*
X318306Y230968D01*
X318176Y230315D01*
X318306Y229662D01*
X318676Y229109D01*
X319229Y228739D01*
X319882Y228609D01*
X320535Y228739D01*
X321088Y229109D01*
X321090Y229111D01*
X321627D01*
X321628Y229109D01*
X322182Y228739D01*
X322835Y228609D01*
X323487Y228739D01*
X324041Y229109D01*
X324411Y229662D01*
X324541Y230315D01*
X324540Y230317D01*
X325621Y231398D01*
X349648D01*
X349741Y230907D01*
X349187Y230537D01*
X348817Y229984D01*
X348688Y229331D01*
X348817Y228678D01*
X349187Y228124D01*
X349741Y227755D01*
X350394Y227625D01*
X351047Y227755D01*
X351600Y228124D01*
X351601Y228127D01*
X352139D01*
X352140Y228124D01*
X352694Y227755D01*
X353346Y227625D01*
X353999Y227755D01*
X354553Y228124D01*
X354554Y228127D01*
X378600D01*
X382661Y224065D01*
X382432Y223512D01*
X382312Y222603D01*
X382432Y221693D01*
X382661Y221140D01*
X373164Y211644D01*
X372903Y211253D01*
X372812Y210792D01*
X372812Y210792D01*
Y206916D01*
X372809Y206915D01*
X372440Y206362D01*
X372310Y205709D01*
X372440Y205056D01*
X372809Y204502D01*
X373363Y204133D01*
X374016Y204003D01*
X374669Y204133D01*
X375222Y204502D01*
X375592Y205056D01*
X375722Y205709D01*
X375592Y206362D01*
X375222Y206915D01*
X375220Y206916D01*
Y210293D01*
X384364Y219437D01*
X384917Y219208D01*
X385826Y219088D01*
X386736Y219208D01*
X387584Y219559D01*
X388311Y220118D01*
X388870Y220845D01*
X389221Y221693D01*
X389341Y222603D01*
X389221Y223512D01*
X388870Y224360D01*
X388311Y225088D01*
X387584Y225646D01*
X386736Y225997D01*
X385826Y226117D01*
X384917Y225997D01*
X384364Y225768D01*
X379950Y230182D01*
X379559Y230443D01*
X379098Y230535D01*
X379098Y230535D01*
X367437D01*
X367292Y231010D01*
X367338Y231070D01*
X367348Y231077D01*
X367389Y231138D01*
X367584Y231398D01*
X382554D01*
X382783Y230845D01*
X383342Y230117D01*
X384070Y229559D01*
X384917Y229208D01*
X385827Y229088D01*
X386736Y229208D01*
X387584Y229559D01*
X388312Y230117D01*
X388870Y230845D01*
X389221Y231693D01*
X389341Y232602D01*
X389221Y233512D01*
X388870Y234360D01*
X388312Y235087D01*
X387584Y235646D01*
X386736Y235997D01*
X385827Y236117D01*
X384917Y235997D01*
X384070Y235646D01*
X383342Y235087D01*
X382783Y234360D01*
X382554Y233807D01*
X366874D01*
X366795Y233860D01*
X366142Y233990D01*
X365489Y233860D01*
X365410Y233807D01*
X360968D01*
X360889Y233860D01*
X360236Y233990D01*
X359583Y233860D01*
X359504Y233807D01*
X326326D01*
Y247713D01*
X326235Y248173D01*
X325974Y248564D01*
X325974Y248564D01*
X320733Y253804D01*
X320343Y254065D01*
X319882Y254157D01*
X319882Y254157D01*
X269685D01*
X269224Y254065D01*
X268833Y253804D01*
X268833Y253804D01*
X266510Y251481D01*
X266211Y251457D01*
X265918Y251567D01*
X261204Y256282D01*
X260827Y256438D01*
X251205D01*
X246596Y261047D01*
Y270669D01*
X246440Y271046D01*
X242357Y275129D01*
X242548Y275590D01*
X391732Y275590D01*
Y139764D01*
D02*
G37*
G36*
Y276123D02*
X242548Y276123D01*
X242450Y276083D01*
X242344D01*
X242270Y276008D01*
X242172Y275967D01*
X241878Y275879D01*
X241696Y275886D01*
X241567Y275919D01*
X241518Y275967D01*
X241142Y276123D01*
X142717D01*
X142340Y275967D01*
X137419Y271046D01*
X137263Y270669D01*
Y236221D01*
X137419Y235844D01*
X142340Y230923D01*
X142717Y230767D01*
X172023D01*
X176789Y226001D01*
X181554Y221236D01*
Y216535D01*
Y206693D01*
X181554Y202125D01*
X181710Y201749D01*
X181716Y201742D01*
X181710Y201262D01*
X181648Y201113D01*
X181562Y200975D01*
X181572Y200929D01*
X181554Y200885D01*
Y178370D01*
X176945Y173761D01*
X163386D01*
X163009Y173605D01*
X156636Y167232D01*
X156596Y167134D01*
X156521Y167059D01*
Y166954D01*
X156480Y166856D01*
X156521Y166758D01*
Y166652D01*
X156605Y166448D01*
X156043Y165886D01*
X155965D01*
Y165807D01*
X155403Y165245D01*
X155199Y165329D01*
X155093D01*
X154995Y165370D01*
X154897Y165329D01*
X154791D01*
X154716Y165254D01*
X154618Y165214D01*
X153513Y164109D01*
X153022Y164206D01*
X152936Y164415D01*
X152296Y165249D01*
X151462Y165889D01*
X150491Y166291D01*
X149744Y166389D01*
Y162401D01*
Y158414D01*
X150491Y158512D01*
X151462Y158914D01*
X152296Y159554D01*
X152511Y159834D01*
X153011Y159664D01*
Y139764D01*
X100394D01*
Y411417D01*
X391732D01*
Y276123D01*
D02*
G37*
G36*
X246063Y270669D02*
Y260827D01*
X250984Y255906D01*
X260827D01*
X265542Y251190D01*
X265377Y250648D01*
X265095Y250592D01*
X264542Y250222D01*
X264172Y249669D01*
X264042Y249016D01*
X264090Y248777D01*
X246338Y231025D01*
X246120Y230699D01*
X246044Y230315D01*
Y206674D01*
X241142Y201772D01*
X234751D01*
X234228Y202121D01*
X233268Y202312D01*
X232308Y202121D01*
X231785Y201772D01*
X231299D01*
Y201286D01*
X230950Y200763D01*
X230759Y199803D01*
Y188047D01*
X228065Y185353D01*
X227522Y185518D01*
X227448Y185890D01*
X226966Y186612D01*
X226245Y187094D01*
X225689Y187205D01*
Y185039D01*
X225394D01*
Y184744D01*
X223229D01*
X223339Y184188D01*
X223430Y184052D01*
X223195Y183611D01*
X213813D01*
X213578Y184052D01*
X213669Y184188D01*
X213779Y184744D01*
X211614D01*
Y185039D01*
X211319D01*
Y187205D01*
X210763Y187094D01*
X210042Y186612D01*
X209560Y185890D01*
X209486Y185518D01*
X208943Y185353D01*
X206249Y188047D01*
Y199803D01*
X206058Y200763D01*
X205709Y201286D01*
Y201772D01*
X205223D01*
X204700Y202121D01*
X203740Y202312D01*
X202780Y202121D01*
X202257Y201772D01*
X182440D01*
X182087Y202125D01*
X182087Y206693D01*
Y216535D01*
Y221457D01*
X177165Y226378D01*
X172244Y231299D01*
X142717D01*
X137795Y236221D01*
Y270669D01*
X142717Y275591D01*
X241142D01*
X246063Y270669D01*
D02*
G37*
G36*
X265748Y246889D02*
Y236221D01*
X260827Y231299D01*
X250984D01*
X248513Y228828D01*
X248051Y229019D01*
Y229899D01*
X265248Y247097D01*
X265748Y246889D01*
D02*
G37*
%LPC*%
G36*
X275680Y210492D02*
X272027D01*
Y206839D01*
X272764Y206936D01*
X273726Y207335D01*
X274551Y207968D01*
X275185Y208794D01*
X275583Y209755D01*
X275680Y210492D01*
D02*
G37*
G36*
X271437D02*
X267784D01*
X267881Y209755D01*
X268280Y208794D01*
X268913Y207968D01*
X269739Y207335D01*
X270700Y206936D01*
X271437Y206839D01*
Y210492D01*
D02*
G37*
G36*
X261732Y194262D02*
X260833Y194144D01*
X259995Y193797D01*
X259275Y193244D01*
X258723Y192525D01*
X258376Y191687D01*
X258258Y190787D01*
X258376Y189888D01*
X258723Y189050D01*
X259275Y188330D01*
X259995Y187778D01*
X260833Y187431D01*
X261732Y187313D01*
X262632Y187431D01*
X263470Y187778D01*
X264189Y188330D01*
X264741Y189050D01*
X265089Y189888D01*
X265207Y190787D01*
X265089Y191687D01*
X264741Y192525D01*
X264189Y193244D01*
X263470Y193797D01*
X262632Y194144D01*
X261732Y194262D01*
D02*
G37*
G36*
X271732D02*
X270833Y194144D01*
X269995Y193797D01*
X269275Y193244D01*
X268723Y192525D01*
X268376Y191687D01*
X268258Y190787D01*
X268376Y189888D01*
X268723Y189050D01*
X269275Y188330D01*
X269995Y187778D01*
X270833Y187431D01*
X271732Y187313D01*
X272632Y187431D01*
X273470Y187778D01*
X274189Y188330D01*
X274741Y189050D01*
X275089Y189888D01*
X275207Y190787D01*
X275089Y191687D01*
X274741Y192525D01*
X274189Y193244D01*
X273470Y193797D01*
X272632Y194144D01*
X271732Y194262D01*
D02*
G37*
G36*
X389819Y185094D02*
X386122D01*
Y181398D01*
X389819D01*
Y185094D01*
D02*
G37*
G36*
X261732Y204262D02*
X260833Y204144D01*
X259995Y203797D01*
X259275Y203244D01*
X258723Y202525D01*
X258376Y201687D01*
X258258Y200787D01*
X258376Y199888D01*
X258723Y199050D01*
X259275Y198330D01*
X259995Y197778D01*
X260833Y197431D01*
X261732Y197313D01*
X262632Y197431D01*
X263470Y197778D01*
X264189Y198330D01*
X264741Y199050D01*
X265089Y199888D01*
X265207Y200787D01*
X265089Y201687D01*
X264741Y202525D01*
X264189Y203244D01*
X263470Y203797D01*
X262632Y204144D01*
X261732Y204262D01*
D02*
G37*
G36*
X313976Y232021D02*
X313323Y231891D01*
X312770Y231521D01*
X312400Y230968D01*
X312270Y230315D01*
X312400Y229662D01*
X312770Y229109D01*
X313323Y228739D01*
X313976Y228609D01*
X314216Y228657D01*
X318188Y224684D01*
X318514Y224467D01*
X318898Y224390D01*
X358836D01*
X363170Y220057D01*
Y206693D01*
X363246Y206309D01*
X363464Y205983D01*
X369055Y200392D01*
X369380Y200175D01*
X369764Y200098D01*
X382471D01*
X382784Y199345D01*
X383342Y198617D01*
X384070Y198058D01*
X384917Y197707D01*
X385827Y197588D01*
X386737Y197707D01*
X387584Y198058D01*
X388312Y198617D01*
X388871Y199345D01*
X389222Y200192D01*
X389341Y201102D01*
X389222Y202012D01*
X388871Y202859D01*
X388312Y203587D01*
X387584Y204146D01*
X386737Y204497D01*
X385827Y204616D01*
X384917Y204497D01*
X384070Y204146D01*
X383342Y203587D01*
X382784Y202859D01*
X382471Y202105D01*
X370180D01*
X365177Y207109D01*
Y220472D01*
X365100Y220856D01*
X364883Y221182D01*
X359962Y226103D01*
X359636Y226321D01*
X359252Y226397D01*
X319313D01*
X315635Y230076D01*
X315682Y230315D01*
X315552Y230968D01*
X315183Y231521D01*
X314629Y231891D01*
X313976Y232021D01*
D02*
G37*
G36*
X313976Y210367D02*
X313323Y210237D01*
X312769Y209867D01*
X312400Y209314D01*
X312270Y208661D01*
X312400Y208008D01*
X312769Y207455D01*
X312972Y207319D01*
Y200788D01*
X313049Y200404D01*
X313266Y200078D01*
X316219Y197125D01*
X316545Y196907D01*
X316929Y196831D01*
X343146D01*
X343282Y196628D01*
X343835Y196258D01*
X344488Y196129D01*
X345141Y196258D01*
X345694Y196628D01*
X346064Y197182D01*
X346194Y197835D01*
X346064Y198487D01*
X345694Y199041D01*
X345141Y199411D01*
X344488Y199541D01*
X343835Y199411D01*
X343282Y199041D01*
X343146Y198838D01*
X317345D01*
X314979Y201204D01*
Y207319D01*
X315182Y207455D01*
X315552Y208008D01*
X315682Y208661D01*
X315552Y209314D01*
X315182Y209867D01*
X314629Y210237D01*
X313976Y210367D01*
D02*
G37*
G36*
X330709Y218241D02*
X330056Y218112D01*
X329502Y217742D01*
X329133Y217188D01*
X329003Y216535D01*
X329133Y215883D01*
X329502Y215329D01*
X330056Y214959D01*
X330709Y214829D01*
X330948Y214877D01*
X349684Y196141D01*
X350010Y195923D01*
X350394Y195847D01*
X361789D01*
X367243Y190393D01*
X367569Y190175D01*
X367953Y190099D01*
X382471D01*
X382783Y189345D01*
X383342Y188617D01*
X384070Y188059D01*
X384917Y187708D01*
X385827Y187588D01*
X386736Y187708D01*
X387584Y188059D01*
X388312Y188617D01*
X388870Y189345D01*
X389221Y190193D01*
X389341Y191102D01*
X389221Y192012D01*
X388870Y192860D01*
X388312Y193587D01*
X387584Y194146D01*
X386736Y194497D01*
X385827Y194617D01*
X384917Y194497D01*
X384070Y194146D01*
X383342Y193587D01*
X382783Y192860D01*
X382471Y192106D01*
X368368D01*
X362914Y197560D01*
X362589Y197777D01*
X362205Y197854D01*
X350809D01*
X332367Y216296D01*
X332415Y216535D01*
X332285Y217188D01*
X331915Y217742D01*
X331362Y218112D01*
X330709Y218241D01*
D02*
G37*
G36*
X189961Y200365D02*
X189051Y200245D01*
X188204Y199894D01*
X187476Y199335D01*
X186917Y198608D01*
X186566Y197760D01*
X186446Y196850D01*
X186566Y195941D01*
X186917Y195093D01*
X187476Y194365D01*
X188204Y193807D01*
X189051Y193456D01*
X189961Y193336D01*
X190870Y193456D01*
X191718Y193807D01*
X192446Y194365D01*
X193004Y195093D01*
X193355Y195941D01*
X193475Y196850D01*
X193355Y197760D01*
X193004Y198608D01*
X192446Y199335D01*
X191718Y199894D01*
X190870Y200245D01*
X189961Y200365D01*
D02*
G37*
G36*
X316437Y222634D02*
X315958Y222538D01*
X315302Y222100D01*
X314863Y221444D01*
X314768Y220965D01*
X316437D01*
Y222634D01*
D02*
G37*
G36*
X321358D02*
Y220965D01*
X323027D01*
X322932Y221444D01*
X322494Y222100D01*
X321837Y222538D01*
X321358Y222634D01*
D02*
G37*
G36*
X323027Y216043D02*
X321358D01*
Y214374D01*
X321837Y214470D01*
X322494Y214908D01*
X322932Y215564D01*
X323027Y216043D01*
D02*
G37*
G36*
X316437D02*
X314768D01*
X314863Y215564D01*
X315302Y214908D01*
X315958Y214470D01*
X316437Y214374D01*
Y216043D01*
D02*
G37*
G36*
X389311Y216087D02*
X382342D01*
Y209118D01*
X389311D01*
Y216087D01*
D02*
G37*
G36*
X271437Y214735D02*
X270700Y214638D01*
X269739Y214240D01*
X268913Y213607D01*
X268280Y212781D01*
X267881Y211819D01*
X267784Y211083D01*
X271437D01*
Y214735D01*
D02*
G37*
G36*
X329724Y208399D02*
X329071Y208269D01*
X328518Y207899D01*
X328382Y207696D01*
X320239D01*
X320104Y207899D01*
X319550Y208269D01*
X318898Y208399D01*
X318245Y208269D01*
X317691Y207899D01*
X317321Y207346D01*
X317192Y206693D01*
X317321Y206040D01*
X317691Y205486D01*
X318245Y205117D01*
X318898Y204987D01*
X319550Y205117D01*
X320104Y205486D01*
X320239Y205689D01*
X328382D01*
X328518Y205486D01*
X329071Y205117D01*
X329724Y204987D01*
X330377Y205117D01*
X330931Y205486D01*
X331300Y206040D01*
X331430Y206693D01*
X331300Y207346D01*
X330931Y207899D01*
X330377Y208269D01*
X329724Y208399D01*
D02*
G37*
G36*
X265177Y214232D02*
X258287D01*
Y207343D01*
X265177D01*
Y214232D01*
D02*
G37*
G36*
X272027Y214735D02*
Y211083D01*
X275680D01*
X275583Y211819D01*
X275185Y212781D01*
X274551Y213607D01*
X273726Y214240D01*
X272764Y214638D01*
X272027Y214735D01*
D02*
G37*
G36*
X385531Y185094D02*
X381835D01*
Y181398D01*
X385531D01*
Y185094D01*
D02*
G37*
G36*
X202067Y149803D02*
Y147933D01*
X203937D01*
X203826Y148489D01*
X203344Y149210D01*
X202623Y149692D01*
X202067Y149803D01*
D02*
G37*
G36*
X250689D02*
X250133Y149692D01*
X249412Y149210D01*
X248930Y148489D01*
X248819Y147933D01*
X250689D01*
Y149803D01*
D02*
G37*
G36*
X201476D02*
X200921Y149692D01*
X200199Y149210D01*
X199717Y148489D01*
X199607Y147933D01*
X201476D01*
Y149803D01*
D02*
G37*
G36*
X317850Y155823D02*
X314193D01*
Y147343D01*
X317850D01*
Y155823D01*
D02*
G37*
G36*
X339661D02*
X336004D01*
Y147343D01*
X339661D01*
Y155823D01*
D02*
G37*
G36*
X349114Y149803D02*
X348558Y149692D01*
X347837Y149210D01*
X347355Y148489D01*
X347244Y147933D01*
X349114D01*
Y149803D01*
D02*
G37*
G36*
X349705D02*
Y147933D01*
X351574D01*
X351464Y148489D01*
X350982Y149210D01*
X350260Y149692D01*
X349705Y149803D01*
D02*
G37*
G36*
X300492D02*
Y147933D01*
X302362D01*
X302251Y148489D01*
X301769Y149210D01*
X301048Y149692D01*
X300492Y149803D01*
D02*
G37*
G36*
X251279D02*
Y147933D01*
X253149D01*
X253039Y148489D01*
X252557Y149210D01*
X251835Y149692D01*
X251279Y149803D01*
D02*
G37*
G36*
X299902D02*
X299346Y149692D01*
X298624Y149210D01*
X298142Y148489D01*
X298032Y147933D01*
X299902D01*
Y149803D01*
D02*
G37*
G36*
X253149Y147343D02*
X251279D01*
Y145473D01*
X251835Y145583D01*
X252557Y146065D01*
X253039Y146787D01*
X253149Y147343D01*
D02*
G37*
G36*
X299902D02*
X298032D01*
X298142Y146787D01*
X298624Y146065D01*
X299346Y145583D01*
X299902Y145473D01*
Y147343D01*
D02*
G37*
G36*
X250689D02*
X248819D01*
X248930Y146787D01*
X249412Y146065D01*
X250133Y145583D01*
X250689Y145473D01*
Y147343D01*
D02*
G37*
G36*
X201476D02*
X199607D01*
X199717Y146787D01*
X200199Y146065D01*
X200921Y145583D01*
X201476Y145473D01*
Y147343D01*
D02*
G37*
G36*
X203937D02*
X202067D01*
Y145473D01*
X202623Y145583D01*
X203344Y146065D01*
X203826Y146787D01*
X203937Y147343D01*
D02*
G37*
G36*
X313602Y155823D02*
X309945D01*
Y147343D01*
X313602D01*
Y155823D01*
D02*
G37*
G36*
X335413D02*
X331756D01*
Y147343D01*
X335413D01*
Y155823D01*
D02*
G37*
G36*
X351574Y147343D02*
X349705D01*
Y145473D01*
X350260Y145583D01*
X350982Y146065D01*
X351464Y146787D01*
X351574Y147343D01*
D02*
G37*
G36*
X302362D02*
X300492D01*
Y145473D01*
X301048Y145583D01*
X301769Y146065D01*
X302251Y146787D01*
X302362Y147343D01*
D02*
G37*
G36*
X349114D02*
X347244D01*
X347355Y146787D01*
X347837Y146065D01*
X348558Y145583D01*
X349114Y145473D01*
Y147343D01*
D02*
G37*
G36*
X159154Y162106D02*
X155457D01*
Y158409D01*
X159154D01*
Y162106D01*
D02*
G37*
G36*
X385531Y180807D02*
X381835D01*
Y177110D01*
X385531D01*
Y180807D01*
D02*
G37*
G36*
X389819D02*
X386122D01*
Y177110D01*
X389819D01*
Y180807D01*
D02*
G37*
G36*
X163441Y162106D02*
X159744D01*
Y158409D01*
X163441D01*
Y162106D01*
D02*
G37*
G36*
Y166394D02*
X159744D01*
Y162697D01*
X163441D01*
Y166394D01*
D02*
G37*
G36*
X354331Y191876D02*
X352030Y191695D01*
X349785Y191156D01*
X347652Y190273D01*
X345684Y189067D01*
X343929Y187567D01*
X342430Y185812D01*
X341224Y183844D01*
X340340Y181711D01*
X339801Y179467D01*
X339620Y177165D01*
X339801Y174864D01*
X340340Y172619D01*
X341224Y170487D01*
X342430Y168519D01*
X343929Y166763D01*
X345684Y165264D01*
X347652Y164058D01*
X349785Y163175D01*
X352030Y162636D01*
X354331Y162455D01*
X356632Y162636D01*
X358877Y163175D01*
X361009Y164058D01*
X362978Y165264D01*
X364733Y166763D01*
X366232Y168519D01*
X367438Y170487D01*
X368321Y172619D01*
X368860Y174864D01*
X369041Y177165D01*
X368860Y179467D01*
X368321Y181711D01*
X367438Y183844D01*
X366232Y185812D01*
X364733Y187567D01*
X362978Y189067D01*
X361009Y190273D01*
X358877Y191156D01*
X356632Y191695D01*
X354331Y191876D01*
D02*
G37*
G36*
X307347Y262960D02*
Y259268D01*
X311039D01*
X310941Y260015D01*
X310538Y260986D01*
X309898Y261820D01*
X309065Y262459D01*
X308093Y262862D01*
X307347Y262960D01*
D02*
G37*
G36*
X385827Y271546D02*
X384917Y271426D01*
X384070Y271075D01*
X383342Y270516D01*
X382784Y269788D01*
X382432Y268941D01*
X382313Y268031D01*
X382432Y267122D01*
X382784Y266274D01*
X383342Y265546D01*
X384070Y264988D01*
X384917Y264637D01*
X385827Y264517D01*
X386737Y264637D01*
X387584Y264988D01*
X388312Y265546D01*
X388871Y266274D01*
X389222Y267122D01*
X389341Y268031D01*
X389222Y268941D01*
X388871Y269788D01*
X388312Y270516D01*
X387584Y271075D01*
X386737Y271426D01*
X385827Y271546D01*
D02*
G37*
G36*
X306756Y262960D02*
X306009Y262862D01*
X305038Y262459D01*
X304204Y261820D01*
X303564Y260986D01*
X303162Y260015D01*
X303064Y259268D01*
X306756D01*
Y262960D01*
D02*
G37*
G36*
X338287Y258071D02*
X337732Y257960D01*
X337010Y257478D01*
X336528Y256756D01*
X336418Y256201D01*
X338287D01*
Y258071D01*
D02*
G37*
G36*
X338878D02*
Y256201D01*
X340748D01*
X340637Y256756D01*
X340155Y257478D01*
X339434Y257960D01*
X338878Y258071D01*
D02*
G37*
G36*
X290536Y262457D02*
X283567D01*
Y255488D01*
X290536D01*
Y262457D01*
D02*
G37*
G36*
X338287Y236910D02*
X336418D01*
X336528Y236354D01*
X337010Y235632D01*
X337732Y235150D01*
X338287Y235040D01*
Y236910D01*
D02*
G37*
G36*
X340748D02*
X338878D01*
Y235040D01*
X339434Y235150D01*
X340155Y235632D01*
X340637Y236354D01*
X340748Y236910D01*
D02*
G37*
G36*
X338287Y239370D02*
X337732Y239259D01*
X337010Y238777D01*
X336528Y238056D01*
X336418Y237500D01*
X338287D01*
Y239370D01*
D02*
G37*
G36*
X320768Y222634D02*
X320289Y222538D01*
X319632Y222100D01*
X319194Y221444D01*
X319152Y221236D01*
X318643D01*
X318601Y221444D01*
X318163Y222100D01*
X317506Y222538D01*
X317027Y222634D01*
Y220669D01*
X316732D01*
Y220374D01*
X314768D01*
X314863Y219895D01*
X315302Y219239D01*
X315958Y218800D01*
X316166Y218759D01*
Y218249D01*
X315958Y218208D01*
X315302Y217769D01*
X314863Y217113D01*
X314768Y216634D01*
X316732D01*
Y216339D01*
X317027D01*
Y214374D01*
X317506Y214470D01*
X318163Y214908D01*
X318601Y215564D01*
X318643Y215772D01*
X319152D01*
X319194Y215564D01*
X319632Y214908D01*
X320289Y214470D01*
X320768Y214374D01*
Y216339D01*
X321063D01*
Y216634D01*
X323027D01*
X322932Y217113D01*
X322494Y217769D01*
X321837Y218208D01*
X321629Y218249D01*
Y218759D01*
X321837Y218800D01*
X322494Y219239D01*
X322932Y219895D01*
X323027Y220374D01*
X321063D01*
Y220669D01*
X320768D01*
Y222634D01*
D02*
G37*
G36*
X330922Y222189D02*
X330269Y222059D01*
X329823Y221761D01*
X329393Y222049D01*
X328740Y222179D01*
X328087Y222049D01*
X327534Y221679D01*
X327164Y221125D01*
X327034Y220472D01*
X327164Y219820D01*
X327534Y219266D01*
X328087Y218896D01*
X328740Y218766D01*
X329393Y218896D01*
X329839Y219194D01*
X330269Y218907D01*
X330922Y218777D01*
X331575Y218907D01*
X332128Y219277D01*
X332129Y219279D01*
X347998D01*
X348006Y219266D01*
X348560Y218896D01*
X349213Y218766D01*
X349866Y218896D01*
X350394Y219249D01*
X350922Y218896D01*
X351575Y218766D01*
X352228Y218896D01*
X352781Y219266D01*
X353151Y219820D01*
X353281Y220472D01*
X353151Y221125D01*
X352781Y221679D01*
X352228Y222049D01*
X351575Y222179D01*
X350922Y222049D01*
X350394Y221696D01*
X349866Y222049D01*
X349213Y222179D01*
X348560Y222049D01*
X348019Y221687D01*
X332129D01*
X332128Y221690D01*
X331575Y222059D01*
X330922Y222189D01*
D02*
G37*
G36*
X340748Y255610D02*
X338878D01*
Y253740D01*
X339434Y253851D01*
X340155Y254333D01*
X340637Y255054D01*
X340748Y255610D01*
D02*
G37*
G36*
X385827Y261546D02*
X384917Y261426D01*
X384070Y261075D01*
X383342Y260517D01*
X382783Y259789D01*
X382432Y258941D01*
X382312Y258032D01*
X382432Y257122D01*
X382783Y256274D01*
X383342Y255547D01*
X384070Y254988D01*
X384917Y254637D01*
X385827Y254517D01*
X386736Y254637D01*
X387584Y254988D01*
X388312Y255547D01*
X388870Y256274D01*
X389221Y257122D01*
X389341Y258032D01*
X389221Y258941D01*
X388870Y259789D01*
X388312Y260517D01*
X387584Y261075D01*
X386736Y261426D01*
X385827Y261546D01*
D02*
G37*
G36*
X338287Y255610D02*
X336418D01*
X336528Y255054D01*
X337010Y254333D01*
X337732Y253851D01*
X338287Y253740D01*
Y255610D01*
D02*
G37*
G36*
X362894Y254626D02*
X361024D01*
X361134Y254070D01*
X361616Y253349D01*
X362338Y252867D01*
X362894Y252756D01*
Y254626D01*
D02*
G37*
G36*
X365354D02*
X363484D01*
Y252756D01*
X364040Y252867D01*
X364761Y253349D01*
X365244Y254070D01*
X365354Y254626D01*
D02*
G37*
G36*
X363484Y257086D02*
Y255217D01*
X365354D01*
X365244Y255772D01*
X364761Y256494D01*
X364040Y256976D01*
X363484Y257086D01*
D02*
G37*
G36*
X297052Y262487D02*
X296142Y262367D01*
X295294Y262016D01*
X294567Y261458D01*
X294008Y260730D01*
X293657Y259882D01*
X293537Y258973D01*
X293657Y258063D01*
X294008Y257216D01*
X294567Y256488D01*
X295294Y255929D01*
X296142Y255578D01*
X297052Y255458D01*
X297961Y255578D01*
X298809Y255929D01*
X299537Y256488D01*
X300095Y257216D01*
X300446Y258063D01*
X300566Y258973D01*
X300446Y259882D01*
X300095Y260730D01*
X299537Y261458D01*
X298809Y262016D01*
X297961Y262367D01*
X297052Y262487D01*
D02*
G37*
G36*
X362894Y257086D02*
X362338Y256976D01*
X361616Y256494D01*
X361134Y255772D01*
X361024Y255217D01*
X362894D01*
Y257086D01*
D02*
G37*
G36*
X306756Y258677D02*
X303064D01*
X303162Y257930D01*
X303564Y256959D01*
X304204Y256125D01*
X305038Y255485D01*
X306009Y255083D01*
X306756Y254985D01*
Y258677D01*
D02*
G37*
G36*
X311039D02*
X307347D01*
Y254985D01*
X308093Y255083D01*
X309065Y255485D01*
X309898Y256125D01*
X310538Y256959D01*
X310941Y257930D01*
X311039Y258677D01*
D02*
G37*
G36*
X338878Y239370D02*
Y237500D01*
X340748D01*
X340637Y238056D01*
X340155Y238777D01*
X339434Y239259D01*
X338878Y239370D01*
D02*
G37*
G36*
X385531Y252024D02*
X381835D01*
Y248327D01*
X385531D01*
Y252024D01*
D02*
G37*
G36*
X389819D02*
X386122D01*
Y248327D01*
X389819D01*
Y252024D01*
D02*
G37*
G36*
X316929Y247769D02*
X316276Y247639D01*
X315723Y247269D01*
X315587Y247066D01*
X290354D01*
X289970Y246990D01*
X289645Y246773D01*
X284723Y241851D01*
X284506Y241526D01*
X284430Y241142D01*
Y225611D01*
X276850Y218031D01*
X276632Y217705D01*
X276555Y217321D01*
Y207030D01*
X273365Y203840D01*
X272632Y204144D01*
X271732Y204262D01*
X270833Y204144D01*
X269995Y203797D01*
X269275Y203244D01*
X268723Y202525D01*
X268376Y201687D01*
X268258Y200787D01*
X268376Y199888D01*
X268723Y199050D01*
X269275Y198330D01*
X269995Y197778D01*
X270833Y197431D01*
X271732Y197313D01*
X272632Y197431D01*
X273470Y197778D01*
X274189Y198330D01*
X274741Y199050D01*
X275089Y199888D01*
X275207Y200787D01*
X275089Y201687D01*
X274784Y202420D01*
X278024Y205660D01*
X278524Y205453D01*
Y177581D01*
X267301Y166358D01*
X180118D01*
X179734Y166281D01*
X179409Y166064D01*
X177405Y164060D01*
X177165Y164108D01*
X176513Y163978D01*
X175959Y163608D01*
X175589Y163054D01*
X175459Y162402D01*
X175589Y161749D01*
X175959Y161195D01*
X176513Y160825D01*
X177165Y160696D01*
X177818Y160825D01*
X178372Y161195D01*
X178742Y161749D01*
X178871Y162402D01*
X178824Y162641D01*
X180534Y164351D01*
X267717D01*
X268101Y164427D01*
X268426Y164645D01*
X280237Y176456D01*
X280455Y176781D01*
X280475Y176883D01*
X280975Y176834D01*
Y173712D01*
X280533Y173051D01*
X280373Y172244D01*
X280533Y171438D01*
X280975Y170777D01*
Y169775D01*
X280533Y169114D01*
X280373Y168307D01*
X280533Y167501D01*
X280990Y166817D01*
X281674Y166360D01*
X282480Y166200D01*
X283287Y166360D01*
X283970Y166817D01*
X284427Y167501D01*
X284588Y168307D01*
X284427Y169114D01*
X283986Y169775D01*
Y170777D01*
X284427Y171438D01*
X284588Y172244D01*
X284427Y173051D01*
X283986Y173712D01*
Y207194D01*
X284427Y207855D01*
X284588Y208661D01*
X284427Y209468D01*
X283986Y210129D01*
Y211131D01*
X284427Y211792D01*
X284588Y212598D01*
X284427Y213405D01*
X283970Y214089D01*
X283287Y214545D01*
X282480Y214706D01*
X281674Y214545D01*
X281031Y214116D01*
X280829Y214163D01*
X280531Y214302D01*
Y215136D01*
X289095Y223700D01*
X289313Y224025D01*
X289389Y224410D01*
Y227931D01*
X290553Y229095D01*
X291116Y229109D01*
X291670Y228739D01*
X292323Y228609D01*
X292976Y228739D01*
X293529Y229109D01*
X293665Y229311D01*
X297813D01*
X306413Y220712D01*
X306365Y220472D01*
X306495Y219819D01*
X306614Y219641D01*
X306434Y219096D01*
X305880Y218726D01*
X305510Y218173D01*
X305381Y217520D01*
X305510Y216867D01*
X305880Y216313D01*
X305866Y215750D01*
X303718Y213602D01*
X293665D01*
X293529Y213805D01*
X292976Y214175D01*
X292323Y214304D01*
X291670Y214175D01*
X291116Y213805D01*
X290747Y213251D01*
X290617Y212598D01*
X290747Y211946D01*
X291116Y211392D01*
X291670Y211022D01*
X292323Y210892D01*
X292976Y211022D01*
X293529Y211392D01*
X293665Y211595D01*
X304134D01*
X304518Y211671D01*
X304843Y211889D01*
X307796Y214842D01*
X308014Y215167D01*
X308090Y215551D01*
Y216178D01*
X308293Y216313D01*
X308663Y216867D01*
X308793Y217520D01*
X308663Y218173D01*
X308544Y218351D01*
X308724Y218896D01*
X309277Y219266D01*
X309647Y219819D01*
X309777Y220472D01*
X309647Y221125D01*
X309277Y221679D01*
X308724Y222048D01*
X308071Y222178D01*
X307832Y222131D01*
X298938Y231025D01*
X298612Y231242D01*
X298228Y231318D01*
X293665D01*
X293529Y231521D01*
X292976Y231891D01*
X292323Y232021D01*
X291670Y231891D01*
X291116Y231521D01*
X290981Y231318D01*
X290354D01*
X289970Y231242D01*
X289645Y231025D01*
X287676Y229056D01*
X287459Y228731D01*
X287382Y228346D01*
Y224825D01*
X279383Y216826D01*
X278841Y216991D01*
X278809Y217152D01*
X286143Y224486D01*
X286360Y224811D01*
X286437Y225195D01*
Y240726D01*
X290770Y245059D01*
X315587D01*
X315723Y244857D01*
X316276Y244487D01*
X316929Y244357D01*
X317582Y244487D01*
X318135Y244857D01*
X318505Y245410D01*
X318635Y246063D01*
X318505Y246716D01*
X318135Y247269D01*
X317582Y247639D01*
X316929Y247769D01*
D02*
G37*
G36*
X385531Y247736D02*
X381835D01*
Y244040D01*
X385531D01*
Y247736D01*
D02*
G37*
G36*
X389819D02*
X386122D01*
Y244040D01*
X389819D01*
Y247736D01*
D02*
G37*
G36*
X118110Y231246D02*
X115809Y231065D01*
X113564Y230526D01*
X111432Y229643D01*
X109464Y228437D01*
X107708Y226938D01*
X106209Y225182D01*
X105003Y223214D01*
X104120Y221081D01*
X103581Y218837D01*
X103400Y216535D01*
X103581Y214234D01*
X104120Y211990D01*
X105003Y209857D01*
X106209Y207889D01*
X107708Y206133D01*
X109464Y204634D01*
X111432Y203428D01*
X113564Y202545D01*
X115809Y202006D01*
X118110Y201825D01*
X120412Y202006D01*
X122656Y202545D01*
X124789Y203428D01*
X126757Y204634D01*
X128512Y206133D01*
X130011Y207889D01*
X131218Y209857D01*
X132101Y211990D01*
X132640Y214234D01*
X132821Y216535D01*
X132640Y218837D01*
X132101Y221081D01*
X131218Y223214D01*
X130011Y225182D01*
X128512Y226938D01*
X126757Y228437D01*
X124789Y229643D01*
X122656Y230526D01*
X120412Y231065D01*
X118110Y231246D01*
D02*
G37*
G36*
X162402Y203478D02*
X161749Y203348D01*
X161195Y202978D01*
X160825Y202425D01*
X160801Y202299D01*
X157480Y198979D01*
X154160Y202299D01*
X154135Y202425D01*
X153765Y202978D01*
X153212Y203348D01*
X152559Y203478D01*
X151906Y203348D01*
X151353Y202978D01*
X150983Y202425D01*
X150853Y201772D01*
X150983Y201119D01*
X151353Y200565D01*
X151906Y200196D01*
X152031Y200171D01*
X155975Y196227D01*
Y190482D01*
X143475D01*
X143369Y190552D01*
X142717Y190682D01*
X142064Y190552D01*
X141510Y190183D01*
X141140Y189629D01*
X141010Y188976D01*
X141140Y188323D01*
X141510Y187770D01*
X142064Y187400D01*
X142717Y187270D01*
X143369Y187400D01*
X143475Y187471D01*
X156721D01*
X156827Y187400D01*
X157480Y187270D01*
X158133Y187400D01*
X158239Y187471D01*
X164595D01*
X164701Y187400D01*
X165354Y187270D01*
X166007Y187400D01*
X166561Y187770D01*
X166930Y188323D01*
X167060Y188976D01*
X166930Y189629D01*
X166561Y190183D01*
X166007Y190552D01*
X165354Y190682D01*
X164701Y190552D01*
X164595Y190482D01*
X158986D01*
Y196227D01*
X162929Y200171D01*
X163054Y200196D01*
X163608Y200565D01*
X163978Y201119D01*
X164108Y201772D01*
X163978Y202425D01*
X163608Y202978D01*
X163054Y203348D01*
X162402Y203478D01*
D02*
G37*
G36*
X148622Y215944D02*
Y214074D01*
X150492D01*
X150381Y214630D01*
X149899Y215352D01*
X149178Y215834D01*
X148622Y215944D01*
D02*
G37*
G36*
X165354D02*
X164799Y215834D01*
X164077Y215352D01*
X163595Y214630D01*
X163485Y214074D01*
X165354D01*
Y215944D01*
D02*
G37*
G36*
X148031D02*
X147476Y215834D01*
X146754Y215352D01*
X146272Y214630D01*
X146162Y214074D01*
X148031D01*
Y215944D01*
D02*
G37*
G36*
X165945D02*
Y214074D01*
X167815D01*
X167704Y214630D01*
X167222Y215352D01*
X166501Y215834D01*
X165945Y215944D01*
D02*
G37*
G36*
X165354Y213484D02*
X163485D01*
X163595Y212928D01*
X164077Y212207D01*
X164799Y211725D01*
X165354Y211614D01*
Y213484D01*
D02*
G37*
G36*
X167815D02*
X165945D01*
Y211614D01*
X166501Y211725D01*
X167222Y212207D01*
X167704Y212928D01*
X167815Y213484D01*
D02*
G37*
G36*
X150492D02*
X148622D01*
Y211614D01*
X149178Y211725D01*
X149899Y212207D01*
X150381Y212928D01*
X150492Y213484D01*
D02*
G37*
G36*
X148031D02*
X146162D01*
X146272Y212928D01*
X146754Y212207D01*
X147476Y211725D01*
X148031Y211614D01*
Y213484D01*
D02*
G37*
G36*
X153740Y177854D02*
X151870D01*
Y175985D01*
X152426Y176095D01*
X153147Y176577D01*
X153629Y177299D01*
X153740Y177854D01*
D02*
G37*
G36*
X151279D02*
X149410D01*
X149520Y177299D01*
X150002Y176577D01*
X150724Y176095D01*
X151279Y175985D01*
Y177854D01*
D02*
G37*
G36*
X132579D02*
X130709D01*
X130819Y177299D01*
X131301Y176577D01*
X132023Y176095D01*
X132579Y175985D01*
Y177854D01*
D02*
G37*
G36*
X135039D02*
X133169D01*
Y175985D01*
X133725Y176095D01*
X134447Y176577D01*
X134929Y177299D01*
X135039Y177854D01*
D02*
G37*
G36*
X151279Y180315D02*
X150724Y180204D01*
X150002Y179722D01*
X149520Y179001D01*
X149410Y178445D01*
X151279D01*
Y180315D01*
D02*
G37*
G36*
X151870D02*
Y178445D01*
X153740D01*
X153629Y179001D01*
X153147Y179722D01*
X152426Y180204D01*
X151870Y180315D01*
D02*
G37*
G36*
X133169D02*
Y178445D01*
X135039D01*
X134929Y179001D01*
X134447Y179722D01*
X133725Y180204D01*
X133169Y180315D01*
D02*
G37*
G36*
X132579D02*
X132023Y180204D01*
X131301Y179722D01*
X130819Y179001D01*
X130709Y178445D01*
X132579D01*
Y180315D01*
D02*
G37*
G36*
X108563Y169302D02*
Y165354D01*
Y161406D01*
X109300Y161503D01*
X110261Y161902D01*
X111087Y162535D01*
X111721Y163361D01*
X112119Y164322D01*
X112209Y165006D01*
X112713D01*
X112786Y164455D01*
X113133Y163617D01*
X113685Y162897D01*
X114404Y162345D01*
X115243Y161998D01*
X116142Y161880D01*
X117041Y161998D01*
X117879Y162345D01*
X118599Y162897D01*
X119151Y163617D01*
X119498Y164455D01*
X119616Y165354D01*
X119498Y166254D01*
X119151Y167092D01*
X118599Y167811D01*
X117879Y168363D01*
X117041Y168710D01*
X116142Y168829D01*
X115243Y168710D01*
X114404Y168363D01*
X113685Y167811D01*
X113133Y167092D01*
X112786Y166254D01*
X112713Y165703D01*
X112209D01*
X112119Y166386D01*
X111721Y167348D01*
X111087Y168174D01*
X110261Y168807D01*
X109300Y169205D01*
X108563Y169302D01*
D02*
G37*
G36*
X124016Y168829D02*
X123117Y168710D01*
X122278Y168363D01*
X121559Y167811D01*
X121007Y167092D01*
X120660Y166254D01*
X120541Y165354D01*
X120660Y164455D01*
X121007Y163617D01*
X121559Y162897D01*
X122278Y162345D01*
X123117Y161998D01*
X124016Y161880D01*
X124915Y161998D01*
X125753Y162345D01*
X126473Y162897D01*
X127025Y163617D01*
X127372Y164455D01*
X127490Y165354D01*
X127372Y166254D01*
X127025Y167092D01*
X126473Y167811D01*
X125753Y168363D01*
X124915Y168710D01*
X124016Y168829D01*
D02*
G37*
G36*
X107973Y165059D02*
X104320D01*
X104417Y164322D01*
X104815Y163361D01*
X105449Y162535D01*
X106274Y161902D01*
X107236Y161503D01*
X107973Y161406D01*
Y165059D01*
D02*
G37*
G36*
X149154Y162106D02*
X145461D01*
X145560Y161359D01*
X145962Y160388D01*
X146602Y159554D01*
X147436Y158914D01*
X148407Y158512D01*
X149154Y158414D01*
Y162106D01*
D02*
G37*
G36*
X107973Y169302D02*
X107236Y169205D01*
X106274Y168807D01*
X105449Y168174D01*
X104815Y167348D01*
X104417Y166386D01*
X104320Y165650D01*
X107973D01*
Y169302D01*
D02*
G37*
G36*
X149154Y166389D02*
X148407Y166291D01*
X147436Y165889D01*
X146602Y165249D01*
X145962Y164415D01*
X145560Y163444D01*
X145461Y162697D01*
X149154D01*
Y166389D01*
D02*
G37*
G36*
X121063Y182808D02*
X120410Y182678D01*
X119857Y182309D01*
X119487Y181755D01*
X119357Y181102D01*
X119487Y180449D01*
X119857Y179896D01*
X120060Y179761D01*
Y176181D01*
X120136Y175797D01*
X120353Y175471D01*
X128445Y167380D01*
Y161909D01*
X135335D01*
Y168799D01*
X129864D01*
X122066Y176597D01*
Y179761D01*
X122269Y179896D01*
X122639Y180449D01*
X122769Y181102D01*
X122639Y181755D01*
X122269Y182309D01*
X121716Y182678D01*
X121063Y182808D01*
D02*
G37*
G36*
X108957Y287598D02*
X108401Y287488D01*
X107679Y287006D01*
X107197Y286284D01*
X107087Y285728D01*
X108957D01*
Y287598D01*
D02*
G37*
G36*
X109547D02*
Y285728D01*
X111417D01*
X111307Y286284D01*
X110825Y287006D01*
X110103Y287488D01*
X109547Y287598D01*
D02*
G37*
G36*
X123425Y285925D02*
X121555D01*
Y284055D01*
X122111Y284166D01*
X122832Y284648D01*
X123314Y285369D01*
X123425Y285925D01*
D02*
G37*
G36*
X111417Y285138D02*
X109547D01*
Y283268D01*
X110103Y283379D01*
X110825Y283861D01*
X111307Y284582D01*
X111417Y285138D01*
D02*
G37*
G36*
X120965Y285925D02*
X119095D01*
X119205Y285369D01*
X119687Y284648D01*
X120409Y284166D01*
X120965Y284055D01*
Y285925D01*
D02*
G37*
G36*
X358366Y305610D02*
X356496D01*
X356607Y305054D01*
X357089Y304333D01*
X357810Y303851D01*
X358366Y303740D01*
Y305610D01*
D02*
G37*
G36*
X360826D02*
X358957D01*
Y303740D01*
X359512Y303851D01*
X360234Y304333D01*
X360716Y305054D01*
X360826Y305610D01*
D02*
G37*
G36*
X360630Y293635D02*
X359977Y293505D01*
X359424Y293135D01*
X359422Y293133D01*
X141339D01*
X140878Y293042D01*
X140487Y292781D01*
X140487Y292781D01*
X125660Y277953D01*
X125222Y277781D01*
X124669Y278151D01*
X124016Y278281D01*
X123363Y278151D01*
X122809Y277781D01*
X122440Y277228D01*
X122310Y276575D01*
X122440Y275922D01*
X122809Y275368D01*
X123363Y274999D01*
X124016Y274869D01*
X124669Y274999D01*
X125222Y275368D01*
X125224Y275371D01*
X125984D01*
X125984Y275371D01*
X126445Y275462D01*
X126836Y275723D01*
X141837Y290725D01*
X359422D01*
X359424Y290723D01*
X359977Y290353D01*
X360630Y290223D01*
X361283Y290353D01*
X361836Y290723D01*
X362206Y291276D01*
X362336Y291929D01*
X362206Y292582D01*
X361836Y293135D01*
X361283Y293505D01*
X360630Y293635D01*
D02*
G37*
G36*
X120965Y288386D02*
X120409Y288275D01*
X119687Y287793D01*
X119205Y287071D01*
X119095Y286516D01*
X120965D01*
Y288386D01*
D02*
G37*
G36*
X121555D02*
Y286516D01*
X123425D01*
X123314Y287071D01*
X122832Y287793D01*
X122111Y288275D01*
X121555Y288386D01*
D02*
G37*
G36*
X373524Y281299D02*
Y279429D01*
X375393D01*
X375283Y279985D01*
X374801Y280706D01*
X374079Y281188D01*
X373524Y281299D01*
D02*
G37*
G36*
X108957Y285138D02*
X107087D01*
X107197Y284582D01*
X107679Y283861D01*
X108401Y283379D01*
X108957Y283268D01*
Y285138D01*
D02*
G37*
G36*
X372933Y281299D02*
X372377Y281188D01*
X371656Y280706D01*
X371174Y279985D01*
X371063Y279429D01*
X372933D01*
Y281299D01*
D02*
G37*
G36*
Y278839D02*
X371063D01*
X371174Y278283D01*
X371656Y277561D01*
X372377Y277079D01*
X372933Y276969D01*
Y278839D01*
D02*
G37*
G36*
X375393D02*
X373524D01*
Y276969D01*
X374079Y277079D01*
X374801Y277561D01*
X375283Y278283D01*
X375393Y278839D01*
D02*
G37*
G36*
X374212Y359154D02*
X372342D01*
Y357284D01*
X372898Y357394D01*
X373620Y357876D01*
X374102Y358598D01*
X374212Y359154D01*
D02*
G37*
G36*
X117028Y359645D02*
X116472Y359535D01*
X115750Y359053D01*
X115268Y358331D01*
X115158Y357776D01*
X117028D01*
Y359645D01*
D02*
G37*
G36*
X371752Y359154D02*
X369882D01*
X369993Y358598D01*
X370475Y357876D01*
X371196Y357394D01*
X371752Y357284D01*
Y359154D01*
D02*
G37*
G36*
X117028Y357185D02*
X115158D01*
X115268Y356629D01*
X115750Y355908D01*
X116472Y355426D01*
X117028Y355315D01*
Y357185D01*
D02*
G37*
G36*
X119488D02*
X117618D01*
Y355315D01*
X118174Y355426D01*
X118895Y355908D01*
X119377Y356629D01*
X119488Y357185D01*
D02*
G37*
G36*
X118110Y408412D02*
X115809Y408230D01*
X113564Y407691D01*
X111432Y406808D01*
X109464Y405602D01*
X107708Y404103D01*
X106209Y402348D01*
X105003Y400379D01*
X104120Y398247D01*
X103581Y396002D01*
X103400Y393701D01*
X103581Y391400D01*
X104120Y389155D01*
X105003Y387022D01*
X106209Y385054D01*
X107708Y383299D01*
X109464Y381800D01*
X111432Y380593D01*
X113564Y379710D01*
X115809Y379171D01*
X118110Y378990D01*
X120412Y379171D01*
X122656Y379710D01*
X124789Y380593D01*
X126757Y381800D01*
X128512Y383299D01*
X130011Y385054D01*
X131218Y387022D01*
X132101Y389155D01*
X132640Y391400D01*
X132821Y393701D01*
X132640Y396002D01*
X132101Y398247D01*
X131218Y400379D01*
X130011Y402348D01*
X128512Y404103D01*
X126757Y405602D01*
X124789Y406808D01*
X122656Y407691D01*
X120412Y408230D01*
X118110Y408412D01*
D02*
G37*
G36*
X374016D02*
X371714Y408230D01*
X369470Y407691D01*
X367337Y406808D01*
X365369Y405602D01*
X363614Y404103D01*
X362115Y402348D01*
X360909Y400379D01*
X360025Y398247D01*
X359486Y396002D01*
X359305Y393701D01*
X359486Y391400D01*
X360025Y389155D01*
X360909Y387022D01*
X362115Y385054D01*
X363614Y383299D01*
X365369Y381800D01*
X367337Y380593D01*
X369470Y379710D01*
X371714Y379171D01*
X374016Y378990D01*
X376317Y379171D01*
X378562Y379710D01*
X380694Y380593D01*
X382663Y381800D01*
X384418Y383299D01*
X385917Y385054D01*
X387123Y387022D01*
X388006Y389155D01*
X388545Y391400D01*
X388726Y393701D01*
X388545Y396002D01*
X388006Y398247D01*
X387123Y400379D01*
X385917Y402348D01*
X384418Y404103D01*
X382663Y405602D01*
X380694Y406808D01*
X378562Y407691D01*
X376317Y408230D01*
X374016Y408412D01*
D02*
G37*
G36*
X372342Y361614D02*
Y359744D01*
X374212D01*
X374102Y360300D01*
X373620Y361021D01*
X372898Y361503D01*
X372342Y361614D01*
D02*
G37*
G36*
X117618Y359645D02*
Y357776D01*
X119488D01*
X119377Y358331D01*
X118895Y359053D01*
X118174Y359535D01*
X117618Y359645D01*
D02*
G37*
G36*
X371752Y361614D02*
X371196Y361503D01*
X370475Y361021D01*
X369993Y360300D01*
X369882Y359744D01*
X371752D01*
Y361614D01*
D02*
G37*
G36*
X123228Y312697D02*
X121358D01*
Y310827D01*
X121914Y310938D01*
X122635Y311420D01*
X123117Y312141D01*
X123228Y312697D01*
D02*
G37*
G36*
X120768Y315157D02*
X120212Y315047D01*
X119491Y314565D01*
X119008Y313843D01*
X118898Y313287D01*
X120768D01*
Y315157D01*
D02*
G37*
G36*
Y312697D02*
X118898D01*
X119008Y312141D01*
X119491Y311420D01*
X120212Y310938D01*
X120768Y310827D01*
Y312697D01*
D02*
G37*
G36*
X358366Y308071D02*
X357810Y307960D01*
X357089Y307478D01*
X356607Y306756D01*
X356496Y306201D01*
X358366D01*
Y308071D01*
D02*
G37*
G36*
X358957D02*
Y306201D01*
X360826D01*
X360716Y306756D01*
X360234Y307478D01*
X359512Y307960D01*
X358957Y308071D01*
D02*
G37*
G36*
X365158Y339304D02*
X364505Y339175D01*
X363951Y338805D01*
X363581Y338251D01*
X363452Y337598D01*
X363499Y337359D01*
X360511Y334371D01*
X360293Y334046D01*
X360217Y333661D01*
Y333035D01*
X360014Y332899D01*
X359644Y332346D01*
X359514Y331693D01*
X359644Y331040D01*
X360014Y330487D01*
X360568Y330117D01*
X361221Y329987D01*
X361873Y330117D01*
X362427Y330487D01*
X362797Y331040D01*
X362927Y331693D01*
X362797Y332346D01*
X362427Y332899D01*
X362441Y333463D01*
X364918Y335940D01*
X365158Y335892D01*
X365810Y336022D01*
X366364Y336392D01*
X366734Y336946D01*
X366863Y337598D01*
X366734Y338251D01*
X366364Y338805D01*
X365810Y339175D01*
X365158Y339304D01*
D02*
G37*
G36*
X133858Y348163D02*
X133205Y348033D01*
X132652Y347663D01*
X132282Y347110D01*
X132152Y346457D01*
X132282Y345804D01*
X132652Y345250D01*
X132654Y345249D01*
Y340066D01*
X130407Y337818D01*
X129160D01*
X129159Y337821D01*
X128606Y338190D01*
X127953Y338320D01*
X127300Y338190D01*
X127094Y338053D01*
X126594Y338320D01*
Y340587D01*
X126797Y340723D01*
X127167Y341276D01*
X127296Y341929D01*
X127167Y342582D01*
X126797Y343135D01*
X126243Y343505D01*
X125591Y343635D01*
X124938Y343505D01*
X124384Y343135D01*
X124014Y342582D01*
X123884Y341929D01*
X124014Y341276D01*
X124384Y340723D01*
X124587Y340587D01*
Y333071D01*
X124663Y332687D01*
X124881Y332361D01*
X129971Y327272D01*
X129970Y327264D01*
X129744Y326791D01*
X120494D01*
X119331Y327955D01*
X119317Y328518D01*
X119686Y329072D01*
X119816Y329724D01*
X119686Y330377D01*
X119317Y330931D01*
X119043Y331113D01*
X119018Y331267D01*
X119083Y331688D01*
X119683Y332089D01*
X120165Y332810D01*
X120275Y333366D01*
X115945D01*
X116056Y332810D01*
X116538Y332089D01*
X117138Y331688D01*
X117203Y331267D01*
X117177Y331113D01*
X116904Y330931D01*
X116534Y330377D01*
X116404Y329724D01*
X116534Y329072D01*
X116904Y328518D01*
X117107Y328383D01*
Y327756D01*
X117183Y327372D01*
X117401Y327046D01*
X119369Y325078D01*
X119695Y324860D01*
X120079Y324784D01*
X129506D01*
X130886Y323403D01*
Y322208D01*
X130726Y322101D01*
X130565Y322042D01*
X130262D01*
X130101Y322101D01*
X129590Y322442D01*
X128937Y322572D01*
X128284Y322442D01*
X127731Y322073D01*
X127361Y321519D01*
X127231Y320866D01*
X127361Y320213D01*
X127731Y319660D01*
X127934Y319524D01*
Y317913D01*
Y285791D01*
X127731Y285655D01*
X127361Y285102D01*
X127231Y284449D01*
X127361Y283796D01*
X127731Y283243D01*
X128284Y282873D01*
X128937Y282743D01*
X129590Y282873D01*
X130143Y283243D01*
X130513Y283796D01*
X130643Y284449D01*
X130513Y285102D01*
X130143Y285655D01*
X129940Y285791D01*
Y316910D01*
X357910D01*
X358046Y316707D01*
X358599Y316337D01*
X359252Y316207D01*
X359905Y316337D01*
X360458Y316707D01*
X360828Y317261D01*
X360958Y317913D01*
X360828Y318566D01*
X360458Y319120D01*
X360095Y319363D01*
X360246Y319863D01*
X364173D01*
X364557Y319939D01*
X364883Y320157D01*
X369840Y325113D01*
X370079Y325066D01*
X370732Y325196D01*
X371285Y325565D01*
X371655Y326119D01*
X371785Y326772D01*
X371655Y327425D01*
X371285Y327978D01*
X370732Y328348D01*
X370079Y328478D01*
X369426Y328348D01*
X368872Y327978D01*
X368503Y327425D01*
X368373Y326772D01*
X368420Y326532D01*
X363758Y321870D01*
X358268D01*
X357884Y321793D01*
X357558Y321576D01*
X356868Y320885D01*
X136545D01*
X136419Y321519D01*
X136049Y322073D01*
X135846Y322208D01*
Y323819D01*
X135770Y324203D01*
X135552Y324529D01*
X126594Y333487D01*
Y334908D01*
X127094Y335176D01*
X127300Y335038D01*
X127953Y334908D01*
X128606Y335038D01*
X129159Y335408D01*
X129160Y335410D01*
X130905D01*
X130905Y335410D01*
X131366Y335502D01*
X131757Y335763D01*
X134710Y338715D01*
X134710Y338715D01*
X134971Y339106D01*
X135063Y339567D01*
X135063Y339567D01*
Y345249D01*
X135065Y345250D01*
X135434Y345804D01*
X135564Y346457D01*
X135434Y347110D01*
X135065Y347663D01*
X134511Y348033D01*
X133858Y348163D01*
D02*
G37*
G36*
X118405Y335826D02*
Y333957D01*
X120275D01*
X120165Y334512D01*
X119683Y335234D01*
X118961Y335716D01*
X118405Y335826D01*
D02*
G37*
G36*
X121358Y315157D02*
Y313287D01*
X123228D01*
X123117Y313843D01*
X122635Y314565D01*
X121914Y315047D01*
X121358Y315157D01*
D02*
G37*
G36*
X117815Y335826D02*
X117259Y335716D01*
X116538Y335234D01*
X116056Y334512D01*
X115945Y333957D01*
X117815D01*
Y335826D01*
D02*
G37*
G36*
X165650Y227559D02*
Y225689D01*
X167519D01*
X167409Y226245D01*
X166927Y226966D01*
X166205Y227448D01*
X165650Y227559D01*
D02*
G37*
G36*
X148917D02*
Y225689D01*
X150787D01*
X150677Y226245D01*
X150195Y226966D01*
X149473Y227448D01*
X148917Y227559D01*
D02*
G37*
G36*
X165059D02*
X164503Y227448D01*
X163782Y226966D01*
X163300Y226245D01*
X163189Y225689D01*
X165059D01*
Y227559D01*
D02*
G37*
G36*
X167519Y225098D02*
X165650D01*
Y223229D01*
X166205Y223339D01*
X166927Y223821D01*
X167409Y224543D01*
X167519Y225098D01*
D02*
G37*
G36*
X148327Y227559D02*
X147771Y227448D01*
X147050Y226966D01*
X146567Y226245D01*
X146457Y225689D01*
X148327D01*
Y227559D01*
D02*
G37*
G36*
X165059Y225098D02*
X163189D01*
X163300Y224543D01*
X163782Y223821D01*
X164503Y223339D01*
X165059Y223229D01*
Y225098D01*
D02*
G37*
G36*
X148327D02*
X146457D01*
X146567Y224543D01*
X147050Y223821D01*
X147771Y223339D01*
X148327Y223229D01*
Y225098D01*
D02*
G37*
G36*
X150787D02*
X148917D01*
Y223229D01*
X149473Y223339D01*
X150195Y223821D01*
X150677Y224543D01*
X150787Y225098D01*
D02*
G37*
G36*
X189665Y206555D02*
X185968D01*
Y202858D01*
X189665D01*
Y206555D01*
D02*
G37*
G36*
Y210842D02*
X185968D01*
Y207146D01*
X189665D01*
Y210842D01*
D02*
G37*
G36*
X193953Y206555D02*
X190256D01*
Y202858D01*
X193953D01*
Y206555D01*
D02*
G37*
G36*
X218839Y219980D02*
X211949D01*
Y214521D01*
X208930Y211503D01*
X208711Y211175D01*
X208634Y210787D01*
Y208029D01*
X208439Y207899D01*
X208069Y207346D01*
X207940Y206693D01*
X208069Y206040D01*
X208439Y205487D01*
X208993Y205117D01*
X209646Y204987D01*
X210298Y205117D01*
X210852Y205487D01*
X211222Y206040D01*
X211352Y206693D01*
X211222Y207346D01*
X210852Y207899D01*
X210657Y208029D01*
Y210368D01*
X213379Y213090D01*
X218839D01*
Y219980D01*
D02*
G37*
G36*
X225098Y187205D02*
X224543Y187094D01*
X223821Y186612D01*
X223339Y185890D01*
X223229Y185335D01*
X225098D01*
Y187205D01*
D02*
G37*
G36*
X211910D02*
Y185335D01*
X213779D01*
X213669Y185890D01*
X213187Y186612D01*
X212465Y187094D01*
X211910Y187205D01*
D02*
G37*
G36*
X225394Y220010D02*
X224494Y219892D01*
X223656Y219545D01*
X222937Y218992D01*
X222385Y218273D01*
X222038Y217435D01*
X221919Y216535D01*
X222038Y215636D01*
X222385Y214798D01*
X222937Y214078D01*
X223656Y213526D01*
X224494Y213179D01*
X225394Y213061D01*
X226293Y213179D01*
X227131Y213526D01*
X227851Y214078D01*
X228403Y214798D01*
X228750Y215636D01*
X228868Y216535D01*
X228750Y217435D01*
X228403Y218273D01*
X227851Y218992D01*
X227131Y219545D01*
X226293Y219892D01*
X225394Y220010D01*
D02*
G37*
G36*
X235394D02*
X234494Y219892D01*
X233656Y219545D01*
X232937Y218992D01*
X232385Y218273D01*
X232037Y217435D01*
X231919Y216535D01*
X232037Y215636D01*
X232385Y214798D01*
X232937Y214078D01*
X233656Y213526D01*
X234494Y213179D01*
X235394Y213061D01*
X236293Y213179D01*
X237131Y213526D01*
X237851Y214078D01*
X238403Y214798D01*
X238750Y215636D01*
X238868Y216535D01*
X238750Y217435D01*
X238403Y218273D01*
X237851Y218992D01*
X237131Y219545D01*
X236293Y219892D01*
X235394Y220010D01*
D02*
G37*
G36*
X193953Y210842D02*
X190256D01*
Y207146D01*
X193953D01*
Y210842D01*
D02*
G37*
G36*
X165039Y238366D02*
X163169D01*
Y236496D01*
X163725Y236607D01*
X164446Y237089D01*
X164929Y237810D01*
X165039Y238366D01*
D02*
G37*
G36*
X162579D02*
X160709D01*
X160819Y237810D01*
X161302Y237089D01*
X162023Y236607D01*
X162579Y236496D01*
Y238366D01*
D02*
G37*
G36*
X152264D02*
X150394D01*
X150505Y237810D01*
X150987Y237089D01*
X151708Y236607D01*
X152264Y236496D01*
Y238366D01*
D02*
G37*
G36*
X154724D02*
X152854D01*
Y236496D01*
X153410Y236607D01*
X154131Y237089D01*
X154614Y237810D01*
X154724Y238366D01*
D02*
G37*
G36*
X225394Y230010D02*
X224494Y229892D01*
X223656Y229544D01*
X222937Y228992D01*
X222385Y228273D01*
X222038Y227435D01*
X221919Y226535D01*
X222038Y225636D01*
X222385Y224798D01*
X222937Y224078D01*
X223656Y223526D01*
X224494Y223179D01*
X225394Y223061D01*
X226293Y223179D01*
X227131Y223526D01*
X227851Y224078D01*
X228403Y224798D01*
X228750Y225636D01*
X228868Y226535D01*
X228750Y227435D01*
X228403Y228273D01*
X227851Y228992D01*
X227131Y229544D01*
X226293Y229892D01*
X225394Y230010D01*
D02*
G37*
G36*
X235394D02*
X234494Y229892D01*
X233656Y229544D01*
X232937Y228992D01*
X232385Y228273D01*
X232037Y227435D01*
X231919Y226535D01*
X232037Y225636D01*
X232385Y224798D01*
X232937Y224078D01*
X233656Y223526D01*
X234494Y223179D01*
X235394Y223061D01*
X236293Y223179D01*
X237131Y223526D01*
X237851Y224078D01*
X238403Y224798D01*
X238750Y225636D01*
X238868Y226535D01*
X238750Y227435D01*
X238403Y228273D01*
X237851Y228992D01*
X237131Y229544D01*
X236293Y229892D01*
X235394Y230010D01*
D02*
G37*
G36*
X215394D02*
X214494Y229892D01*
X213656Y229544D01*
X212937Y228992D01*
X212385Y228273D01*
X212037Y227435D01*
X211919Y226535D01*
X212037Y225636D01*
X212385Y224798D01*
X212937Y224078D01*
X213656Y223526D01*
X214494Y223179D01*
X215394Y223061D01*
X216293Y223179D01*
X217131Y223526D01*
X217851Y224078D01*
X218403Y224798D01*
X218750Y225636D01*
X218868Y226535D01*
X218750Y227435D01*
X218403Y228273D01*
X217851Y228992D01*
X217131Y229544D01*
X216293Y229892D01*
X215394Y230010D01*
D02*
G37*
G36*
X162579Y240827D02*
X162023Y240716D01*
X161302Y240234D01*
X160819Y239512D01*
X160709Y238957D01*
X162579D01*
Y240827D01*
D02*
G37*
G36*
X163169D02*
Y238957D01*
X165039D01*
X164929Y239512D01*
X164446Y240234D01*
X163725Y240716D01*
X163169Y240827D01*
D02*
G37*
G36*
X152854D02*
Y238957D01*
X154724D01*
X154614Y239512D01*
X154131Y240234D01*
X153410Y240716D01*
X152854Y240827D01*
D02*
G37*
G36*
X152264D02*
X151708Y240716D01*
X150987Y240234D01*
X150505Y239512D01*
X150394Y238957D01*
X152264D01*
Y240827D01*
D02*
G37*
%LPD*%
D13*
X188071Y147047D02*
D03*
X166260D02*
D03*
X237283D02*
D03*
X215472D02*
D03*
X384921D02*
D03*
X363110D02*
D03*
X286496D02*
D03*
X264685D02*
D03*
X335709D02*
D03*
X313898D02*
D03*
D59*
X360555Y232602D02*
X365823D01*
X360236Y232283D02*
X360555Y232602D01*
X366461D02*
X385827D01*
X366142Y232283D02*
X366461Y232602D01*
X365823D02*
X366142Y232283D01*
X322835Y230315D02*
X325122Y232602D01*
X319882Y230315D02*
X322835D01*
X325122Y232602D02*
Y247713D01*
X319882Y252953D02*
X325122Y247713D01*
X269685Y252953D02*
X319882D01*
X265748Y249016D02*
X269685Y252953D01*
X325122Y232602D02*
X360555D01*
X374016Y205709D02*
Y210792D01*
X385826Y222603D01*
X349408Y220472D02*
X349409Y220472D01*
X350394Y229331D02*
X353346D01*
X379098D01*
X385826Y222603D01*
X141339Y291929D02*
X360630D01*
X125984Y276575D02*
X141339Y291929D01*
X124016Y276575D02*
X125984D01*
X127953Y336614D02*
X130905D01*
X133858Y339567D01*
Y346457D01*
X349408Y220472D02*
X349408Y220472D01*
X349407D02*
X349408Y220472D01*
X349407D02*
X349407Y220472D01*
X349406D02*
X349407Y220472D01*
X330911D02*
X330922D01*
X328937D02*
X328948Y220483D01*
X349409Y220472D02*
X349409Y220472D01*
X349410Y220472D01*
X349508Y220374D01*
X330911Y220472D02*
X330922Y220483D01*
X328740Y220472D02*
X328937D01*
X330911D01*
X349202Y220483D02*
X349213Y220472D01*
X330922Y220483D02*
X330932D01*
X349202D01*
X349213Y220472D02*
X349406D01*
X349407D01*
X349408D01*
X349409D01*
X349410D01*
X351575D01*
X349395Y220483D02*
X349406Y220472D01*
X349406Y220472D01*
X330922Y220472D02*
X330932Y220483D01*
D60*
X121063Y176181D02*
Y181102D01*
Y176181D02*
X131890Y165354D01*
X358268Y320866D02*
X364173D01*
X370079Y326772D02*
Y326772D01*
X364173Y320866D02*
X370079Y326772D01*
X357283Y319882D02*
X358268Y320866D01*
X135827Y319882D02*
X357283D01*
X134843Y320866D02*
X135827Y319882D01*
X128937Y317913D02*
X359252D01*
X128937D02*
Y320866D01*
X131890D02*
Y323819D01*
X134843Y320866D02*
Y323819D01*
X129921Y325787D02*
X131890Y323819D01*
X361221Y331693D02*
Y333661D01*
X120079Y325787D02*
X129921D01*
X361221Y333661D02*
X365158Y337598D01*
X118110Y327756D02*
X120079Y325787D01*
X118110Y327756D02*
Y329724D01*
X318898Y206693D02*
X329724D01*
X307087Y215551D02*
Y217520D01*
X304134Y212598D02*
X307087Y215551D01*
X292323Y212598D02*
X304134D01*
X298228Y230315D02*
X308071Y220472D01*
X288386Y224410D02*
Y228346D01*
X290354Y230315D01*
X292323D01*
X298228D01*
X285433Y225195D02*
Y241142D01*
X290354Y246063D01*
X177165Y162402D02*
X180118Y165354D01*
X247047Y230315D02*
X265748Y249016D01*
X236221Y172244D02*
X247047Y183071D01*
Y230315D01*
X277559Y217321D02*
X285433Y225195D01*
X271732Y200787D02*
X277559Y206614D01*
Y217321D01*
X279528Y215551D02*
X288386Y224410D01*
X279528Y177165D02*
Y215551D01*
X267717Y165354D02*
X279528Y177165D01*
X180118Y165354D02*
X267717D01*
X369764Y201102D02*
X385827D01*
X364173Y206693D02*
X369764Y201102D01*
X290354Y246063D02*
X316929D01*
X313976Y230315D02*
X318898Y225394D01*
X364173Y206693D02*
Y220472D01*
X313976Y208661D02*
X314173Y208858D01*
X359252Y225394D02*
X364173Y220472D01*
X318898Y225394D02*
X359252D01*
X313976Y200788D02*
Y208661D01*
Y200788D02*
X316929Y197835D01*
X344488D01*
X128937Y284449D02*
Y317913D01*
X125591Y333071D02*
X134843Y323819D01*
X125591Y333071D02*
Y341929D01*
X330709Y216535D02*
X350394Y196850D01*
X362205D01*
X367953Y191102D01*
X385827D01*
D61*
X282480Y208661D02*
Y212598D01*
Y172244D02*
Y208661D01*
Y168307D02*
Y172244D01*
X157480Y188976D02*
Y196850D01*
X162402Y201772D01*
X152559D02*
X157480Y196850D01*
Y196850D02*
Y196850D01*
X142717Y188976D02*
X157480D01*
X165354D01*
D62*
X209646Y206693D02*
Y210787D01*
X215394Y216535D01*
D64*
X131890Y165354D02*
D03*
X215394Y216535D02*
D03*
D65*
X124016Y165354D02*
D03*
X116142D02*
D03*
X108268D02*
D03*
X215394Y226535D02*
D03*
X225394Y216535D02*
D03*
X235394D02*
D03*
X225394Y226535D02*
D03*
X235394D02*
D03*
X271732Y210787D02*
D03*
X261732Y200787D02*
D03*
Y190787D02*
D03*
X271732Y200787D02*
D03*
Y190787D02*
D03*
D66*
X287052Y258973D02*
D03*
X159449Y162401D02*
D03*
D67*
X297052Y258973D02*
D03*
X307051Y258972D02*
D03*
X189961Y196850D02*
D03*
X385827Y258032D02*
D03*
X385827Y268031D02*
D03*
X149449Y162401D02*
D03*
X385826Y222603D02*
D03*
X385827Y232602D02*
D03*
Y191102D02*
D03*
X385827Y201102D02*
D03*
D68*
X189961Y206850D02*
D03*
X385827Y248032D02*
D03*
X385826Y212603D02*
D03*
X385827Y181102D02*
D03*
D69*
X261732Y210787D02*
D03*
D70*
X118110Y393701D02*
D03*
X118110Y216535D02*
D03*
X374016Y393701D02*
D03*
X354331Y177165D02*
D03*
D71*
X338583Y255906D02*
D03*
X363189Y254921D02*
D03*
X338583Y237205D02*
D03*
X300197Y147638D02*
D03*
X250984D02*
D03*
X201772D02*
D03*
X148327Y213779D02*
D03*
X165650D02*
D03*
X165354Y225394D02*
D03*
X148622D02*
D03*
X121063Y181102D02*
D03*
X349410Y147638D02*
D03*
X373228Y279134D02*
D03*
X358661Y305906D02*
D03*
X372047Y359449D02*
D03*
X117323Y357480D02*
D03*
X121260Y286221D02*
D03*
X151575Y178150D02*
D03*
X132874D02*
D03*
X162402Y201772D02*
D03*
X225394Y185039D02*
D03*
X211614D02*
D03*
X162874Y238661D02*
D03*
X360236Y232283D02*
D03*
X366142D02*
D03*
X152559Y238661D02*
D03*
X370079Y326772D02*
D03*
X128937Y320866D02*
D03*
X131890D02*
D03*
X134843D02*
D03*
X361221Y331693D02*
D03*
X125591Y341929D02*
D03*
X359252Y317913D02*
D03*
X360630Y291929D02*
D03*
X365158Y337598D02*
D03*
X118110Y329724D02*
D03*
X318898Y206693D02*
D03*
X329724D02*
D03*
X322835Y230315D02*
D03*
X319882D02*
D03*
X307087Y217520D02*
D03*
X292323Y212598D02*
D03*
X308071Y220472D02*
D03*
X177165Y162402D02*
D03*
X292323Y230315D02*
D03*
X265748Y249016D02*
D03*
X236221Y172244D02*
D03*
X374016Y205709D02*
D03*
X316929Y246063D02*
D03*
X313976Y230315D02*
D03*
X313976Y208661D02*
D03*
X330709Y216535D02*
D03*
X353346Y229331D02*
D03*
X350394D02*
D03*
X344488Y197835D02*
D03*
X124016Y276575D02*
D03*
X128937Y284449D02*
D03*
X209646Y206693D02*
D03*
X127953Y336614D02*
D03*
X109252Y285433D02*
D03*
X118110Y333661D02*
D03*
X121063Y312992D02*
D03*
X157480Y188976D02*
D03*
X152559Y201772D02*
D03*
X142717Y188976D02*
D03*
X165354D02*
D03*
X133858Y346457D02*
D03*
X328740Y220472D02*
D03*
X330922Y220483D02*
D03*
X349213Y220472D02*
D03*
X351575D02*
D03*
D72*
X321063Y216339D02*
D03*
X316732D02*
D03*
X321063Y220669D02*
D03*
X316732D02*
D03*
D73*
X282480Y212598D02*
D03*
Y208661D02*
D03*
Y172244D02*
D03*
Y168307D02*
D03*
M02*
