colname_old,colname_new,unit
#position,position,[]
device_id,device_id,[]
timestamp,delete,
sensortype,delete,
sensortype_serialid,delete,
header_seqnr,delete,
header_originatorid,delete,
header_atime,delete,
payload_sample_valid,delete,
payload_sample_no,delete,
dcx_battery,delete,
dcx_p1,dcx_p1,[mBar]
dcx_p2,dcx_p2,[mBar]
dcx_p12,dcx_p12,[mBar]
dcx_tob1,dcx_tob1,[°C]
dcx_tob2,dcx_tob2,[°C]
generation_time,time,[UTC]
