colname_old,colname_new,unit
#position,delete,[]
device_id,delete,
file_size,delete,
transmitted,delete,
transmission_time_eff,delete,
transmission_time_tot,delete,
chunk_retransmissions,delete,
file_queue_length,delete,
file_queue_size,delete,
relative_file,relative_file,
file_complete,delete,
data,data,
generation_time,time,[UTC]
