__annotation_id,__target,start_time,end_time
5a14dcff-721f-4b7e-8cca-f10ef3e9ed3a,no_visibility,2017-08-01 05:59:04+00:00,2017-08-01 10:01:04+00:00
7a8219fa-7581-4c0f-91a1-927167979ee9,snow,2017-08-01 05:59:04+00:00,2017-08-01 06:01:04+00:00
75bd6584-edf8-45db-a9e6-f7c8cca52028,mountaineer,2017-08-02 09:50:04+00:00,2017-08-02 09:54:04+00:00
