colname_old,colname_new,unit
#position,position,[]
device_id,device_id,[]
timestamp,delete,
wind_direction_minimum,wind_direction_minimum,[°]
wind_direction_average,wind_direction_average,[°]
wind_direction_maximum,wind_direction_maximum,[°]
wind_speed_minimum,wind_speed_minimum,[km/h]
wind_speed_average,wind_speed_average,[km/h]
wind_speed_maximum,wind_speed_maximum,[km/h]
air_temperature,temp_air,[°C]
internal_temperature,temp_internal,[°C]
relative_humidity,relative_humidity,[%RH]
air_pressure,air_pressure,[hPa]
generation_time,time,[UTC]
