22,0,1
22,0,2
22,0,3
22,0,4
22,0,5
22,0,6
22,0,7
22,0,8
22,0,9
33,0,1
33,0,2
33,0,3
33,0,4
33,0,5
33,0,6
33,0,7
33,0,8
33,0,9
24,0,1
24,0,2
24,0,3
24,0,4
24,0,5
24,0,6
24,0,7
24,0,8
23,0,1
23,0,2
23,0,3
23,0,4
23,0,5
23,0,6
23,0,7
23,0,8
23,0,9
19,0,1
19,0,2
19,0,3
19,0,4
19,0,5
16,0,1
16,0,2
16,0,3
16,0,4
16,0,5
16,0,6
16,0,7
16,0,8
16,0,9
7,0,1
7,0,2
7,0,3
7,0,4
7,0,5
2,0,1
2,0,2
2,0,3
2,0,4
2,0,5
2,0,6
2,0,7
2,0,8
2,0,9
2,0,10
2,0,11
2,0,12
2,0,13
2,0,14
2,0,15
2,0,16
2,0,17
2,0,18
2,0,19
2,0,20
2,0,21
13,0,1
13,0,2
13,0,3
13,0,4
13,0,5
15,0,1
15,0,2
15,0,3
15,0,4
15,0,5
15,0,6
15,0,7
15,0,8
15,0,9
15,0,10
15,0,11
15,0,12
15,0,13
15,0,14
15,0,15
15,0,16
15,0,17
15,0,18
15,0,19
15,0,20
15,0,21
15,0,22
3,0,1
3,0,2
3,0,3
3,0,4
3,0,5
3,0,6
3,0,7
3,0,8
3,0,9
3,0,10
3,0,11
3,0,12
3,0,13
3,0,14
3,0,15
3,0,16
3,0,17
3,0,18
3,0,19
3,0,20
3,0,21
8,0,1
8,0,2
8,0,3
8,0,4
8,0,5
8,0,6
8,0,7
8,0,8
8,0,9
28,0,1
28,0,2
28,0,3
28,0,4
28,0,5
28,0,6
28,0,7
28,0,8
6,0,1
6,0,2
6,0,3
6,0,4
6,0,5
6,0,6
6,0,7
6,0,8
10,0,1
10,0,2
10,0,3
10,0,4
10,0,5
10,0,6
10,0,7
10,0,8
18,0,1
18,0,2
18,0,3
18,0,4
18,0,5
18,0,6
18,0,7
18,0,8
18,0,9
14,0,1
14,0,2
14,0,3
14,0,4
14,0,5
26,0,1
26,0,2
26,0,3
26,0,4
26,0,5
26,0,6
26,0,7
26,0,8
26,0,9
26,0,10
26,0,11
4,0,1
4,0,2
4,0,3
4,0,4
4,0,5
4,0,6
4,0,7
4,0,8
4,0,9
27,0,1
27,0,2
27,0,3
27,0,4
27,0,5
27,0,6
27,0,7
27,0,8
27,0,9
25,0,1
25,0,2
25,0,3
25,0,4
25,0,5
20,0,1
20,0,2
20,0,3
20,0,4
20,0,5
11,0,1
11,0,2
11,0,3
11,0,4
11,0,5
32,0,1
32,0,2
32,0,3
32,0,4
32,0,5
32,0,6
32,0,7
32,0,8
17,0,1
17,0,2
17,0,3
17,0,4
17,0,5
17,0,6
17,0,7
17,0,8
8,0,10
8,0,11
8,0,12
8,0,13
8,0,14
8,0,15
7,0,6
7,0,7
7,0,8
7,0,9
7,0,10
7,0,11
28,0,9
28,0,10
28,0,11
28,0,12
28,0,13
28,0,14
28,0,15
28,0,16
28,0,17
14,0,6
14,0,7
14,0,8
14,0,9
14,0,10
14,0,11
27,0,10
27,0,11
27,0,12
27,0,13
27,0,14
27,0,15
20,0,6
20,0,7
20,0,8
20,0,9
20,0,10
20,0,11
6,0,9
6,0,10
6,0,11
6,0,12
6,0,13
6,0,14
6,0,15
6,0,16
6,0,17
19,0,6
19,0,7
19,0,8
19,0,9
19,0,10
19,0,11
13,0,6
13,0,7
13,0,8
13,0,9
13,0,10
13,0,11
24,0,9
24,0,10
24,0,11
24,0,12
24,0,13
24,0,14
24,0,15
24,0,16
24,0,17
33,0,10
33,0,11
33,0,12
33,0,13
33,0,14
33,0,15
16,0,10
16,0,11
16,0,12
16,0,13
16,0,14
16,0,15
22,0,10
22,0,11
22,0,12
22,0,13
22,0,14
22,0,15
23,0,10
23,0,11
23,0,12
23,0,13
23,0,14
23,0,15
32,0,9
32,0,10
32,0,11
32,0,12
32,0,13
32,0,14
32,0,15
32,0,16
32,0,17
15,0,23
15,0,24
15,0,25
15,0,26
15,0,27
15,0,28
15,0,29
15,0,30
15,0,31
15,0,32
15,0,33
15,0,34
15,0,35
15,0,36
15,0,37
15,0,38
15,0,39
15,0,40
15,0,41
15,0,42
15,0,43
15,0,44
15,0,45
15,0,46
15,0,47
15,0,48
15,0,49
15,0,50
15,0,51
15,0,52
15,0,53
15,0,54
15,0,55
3,0,22
3,0,23
3,0,24
3,0,25
3,0,26
3,0,27
3,0,28
3,0,29
3,0,30
3,0,31
3,0,32
3,0,33
3,0,34
3,0,35
3,0,36
3,0,37
3,0,38
3,0,39
3,0,40
3,0,41
3,0,42
3,0,43
3,0,44
3,0,45
3,0,46
3,0,47
3,0,48
3,0,49
3,0,50
3,0,51
3,0,52
3,0,53
3,0,54
3,0,55
3,0,56
3,0,57
26,0,12
26,0,13
26,0,14
26,0,15
26,0,16
26,0,17
26,0,18
26,0,19
26,0,20
18,0,10
18,0,11
18,0,12
18,0,13
18,0,14
18,0,15
4,0,10
4,0,11
4,0,12
4,0,13
4,0,14
4,0,15
25,0,6
25,0,7
25,0,8
25,0,9
25,0,10
25,0,11
2,0,22
2,0,23
2,0,24
2,0,25
2,0,26
2,0,27
2,0,28
2,0,29
2,0,30
2,0,31
2,0,32
2,0,33
2,0,34
2,0,35
2,0,36
2,0,37
2,0,38
2,0,39
2,0,40
2,0,41
2,0,42
2,0,43
2,0,44
2,0,45
2,0,46
2,0,47
2,0,48
2,0,49
2,0,50
2,0,51
2,0,52
2,0,53
2,0,54
2,0,55
2,0,56
2,0,57
10,0,9
10,0,10
10,0,11
17,0,9
17,0,10
17,0,11
17,0,12
17,0,13
17,0,14
17,0,15
17,0,16
17,0,17
11,0,6
11,0,7
11,0,8
11,0,9
11,0,10
11,0,11
13,0,12
13,0,13
13,0,14
13,0,15
13,0,16
13,0,17
8,0,16
8,0,17
8,0,18
8,0,19
8,0,20
8,0,21
15,0,56
15,0,57
15,0,58
15,0,59
15,0,60
15,0,61
15,0,62
15,0,63
15,0,64
15,0,65
15,0,66
15,0,67
15,0,68
15,0,69
15,0,70
15,0,71
15,0,72
15,0,73
15,0,74
15,0,75
15,0,76
15,0,77
15,0,78
15,0,79
15,0,80
15,0,81
15,0,82
15,0,83
15,0,84
15,0,85
15,0,86
15,0,87
15,0,88
24,0,18
24,0,19
24,0,20
24,0,21
24,0,22
24,0,23
24,0,24
24,0,25
24,0,26
4,0,16
4,0,17
4,0,18
4,0,19
4,0,20
4,0,21
7,0,12
7,0,13
7,0,14
7,0,15
7,0,16
7,0,17
22,0,16
22,0,17
22,0,18
22,0,19
22,0,20
22,0,21
26,0,21
26,0,22
26,0,23
26,0,24
26,0,25
26,0,26
26,0,27
26,0,28
26,0,29
18,0,16
18,0,17
18,0,18
18,0,19
18,0,20
18,0,21
2,0,58
2,0,59
2,0,60
2,0,61
2,0,62
2,0,63
2,0,64
2,0,65
2,0,66
2,0,67
2,0,68
2,0,69
2,0,70
2,0,71
2,0,72
2,0,73
2,0,74
2,0,75
2,0,76
2,0,77
2,0,78
2,0,79
2,0,80
2,0,81
2,0,82
2,0,83
2,0,84
2,0,85
2,0,86
2,0,87
2,0,88
2,0,89
2,0,90
2,0,91
2,0,92
2,0,93
33,0,16
33,0,17
33,0,18
33,0,19
33,0,20
33,0,21
27,0,16
27,0,17
27,0,18
27,0,19
27,0,20
27,0,21
23,0,16
23,0,17
23,0,18
23,0,19
23,0,20
23,0,21
16,0,16
16,0,17
16,0,18
16,0,19
16,0,20
16,0,21
25,0,12
25,0,13
25,0,14
25,0,15
25,0,16
25,0,17
3,0,58
3,0,59
3,0,60
3,0,61
3,0,62
3,0,63
3,0,64
3,0,65
3,0,66
3,0,67
3,0,68
3,0,69
3,0,70
3,0,71
3,0,72
3,0,73
3,0,74
3,0,75
3,0,76
3,0,77
3,0,78
3,0,79
3,0,80
3,0,81
3,0,82
3,0,83
3,0,84
3,0,85
3,0,86
3,0,87
3,0,88
3,0,89
3,0,90
3,0,91
3,0,92
3,0,93
14,0,12
14,0,13
14,0,14
14,0,15
14,0,16
14,0,17
20,0,12
20,0,13
20,0,14
20,0,15
20,0,16
20,0,17
32,0,18
32,0,19
32,0,20
32,0,21
32,0,22
32,0,23
32,0,24
32,0,25
32,0,26
6,0,18
6,0,19
6,0,20
6,0,21
6,0,22
6,0,23
6,0,24
6,0,25
6,0,26
28,0,18
28,0,19
28,0,20
28,0,21
28,0,22
28,0,23
28,0,24
28,0,25
28,0,26
19,0,12
19,0,13
19,0,14
19,0,15
19,0,16
19,0,17
10,0,12
10,0,13
10,0,14
17,0,18
17,0,19
17,0,20
17,0,21
17,0,22
17,0,23
17,0,24
17,0,25
17,0,26
11,0,12
11,0,13
11,0,14
11,0,15
11,0,16
11,0,17
26,0,30
26,0,31
26,0,32
26,0,33
26,0,34
26,0,35
26,0,36
26,0,37
26,0,38
7,0,18
7,0,19
7,0,20
7,0,21
7,0,22
7,0,23
4,0,22
4,0,23
4,0,24
4,0,25
4,0,26
4,0,27
16,0,22
16,0,23
16,0,24
16,0,25
16,0,26
16,0,27
33,0,22
33,0,23
33,0,24
33,0,25
33,0,26
33,0,27
18,0,22
18,0,23
18,0,24
18,0,25
18,0,26
18,0,27
14,0,18
14,0,19
14,0,20
14,0,21
14,0,22
14,0,23
19,0,18
19,0,19
19,0,20
19,0,21
19,0,22
19,0,23
23,0,22
23,0,23
23,0,24
23,0,25
23,0,26
23,0,27
2,0,94
2,0,95
2,0,96
2,0,97
2,0,98
2,0,99
2,0,100
2,0,101
2,0,102
2,0,103
2,0,104
2,0,105
2,0,106
2,0,107
2,0,108
2,0,109
2,0,110
2,0,111
2,0,112
2,0,113
2,0,114
2,0,115
2,0,116
2,0,117
2,0,118
2,0,119
2,0,120
2,0,121
2,0,122
2,0,123
2,0,124
2,0,125
2,0,126
2,0,127
2,0,128
2,0,129
25,0,18
25,0,19
25,0,20
25,0,21
25,0,22
25,0,23
3,0,94
3,0,95
3,0,96
3,0,97
3,0,98
3,0,99
3,0,100
3,0,101
3,0,102
3,0,103
3,0,104
3,0,105
3,0,106
3,0,107
3,0,108
3,0,109
3,0,110
3,0,111
3,0,112
3,0,113
3,0,114
3,0,115
3,0,116
3,0,117
3,0,118
3,0,119
3,0,120
3,0,121
3,0,122
3,0,123
3,0,124
3,0,125
3,0,126
3,0,127
3,0,128
3,0,129
20,0,18
20,0,19
20,0,20
20,0,21
20,0,22
20,0,23
6,0,27
6,0,28
6,0,29
6,0,30
6,0,31
6,0,32
6,0,33
6,0,34
6,0,35
28,0,27
28,0,28
28,0,29
28,0,30
28,0,31
28,0,32
28,0,33
28,0,34
28,0,35
13,0,18
13,0,19
13,0,20
13,0,21
13,0,22
13,0,23
10,0,15
10,0,16
10,0,17
17,0,27
17,0,28
17,0,29
17,0,30
17,0,31
17,0,32
17,0,33
17,0,34
17,0,35
8,0,22
8,0,23
8,0,24
8,0,25
8,0,26
8,0,27
27,0,22
27,0,23
27,0,24
27,0,25
27,0,26
27,0,27
15,0,89
15,0,90
15,0,91
15,0,92
15,0,93
15,0,94
15,0,95
15,0,96
15,0,97
15,0,98
15,0,99
15,0,100
15,0,101
15,0,102
15,0,103
15,0,104
15,0,105
15,0,106
15,0,107
15,0,108
15,0,109
15,0,110
15,0,111
15,0,112
15,0,113
15,0,114
15,0,115
15,0,116
15,0,117
15,0,118
15,0,119
15,0,120
15,0,121
24,0,27
24,0,28
24,0,29
24,0,30
24,0,31
24,0,32
24,0,33
24,0,34
24,0,35
22,0,22
22,0,23
22,0,24
22,0,25
22,0,26
22,0,27
11,0,18
11,0,19
11,0,20
11,0,21
11,0,22
11,0,23
32,0,27
32,0,28
32,0,29
32,0,30
32,0,31
32,0,32
32,0,33
32,0,34
32,0,35
3,0,130
3,0,131
3,0,132
3,0,133
3,0,134
3,0,135
3,0,136
3,0,137
3,0,138
3,0,139
3,0,140
3,0,141
3,0,142
3,0,143
3,0,144
3,0,145
3,0,146
3,0,147
3,0,148
3,0,149
3,0,150
3,0,151
3,0,152
3,0,153
3,0,154
3,0,155
3,0,156
3,0,157
3,0,158
3,0,159
3,0,160
3,0,161
3,0,162
3,0,163
3,0,164
3,0,165
28,0,36
28,0,37
28,0,38
28,0,39
28,0,40
28,0,41
28,0,42
28,0,43
28,0,44
14,0,24
14,0,25
14,0,26
14,0,27
14,0,28
14,0,29
10,0,18
10,0,19
10,0,20
6,0,36
6,0,37
6,0,38
6,0,39
6,0,40
6,0,41
6,0,42
6,0,43
6,0,44
24,0,36
24,0,37
24,0,38
24,0,39
24,0,40
24,0,41
24,0,42
24,0,43
24,0,44
27,0,28
27,0,29
27,0,30
27,0,31
27,0,32
27,0,33
15,0,122
15,0,123
15,0,124
15,0,125
15,0,126
15,0,127
15,0,128
15,0,129
15,0,130
15,0,131
15,0,132
15,0,133
15,0,134
15,0,135
15,0,136
15,0,137
15,0,138
15,0,139
15,0,140
15,0,141
15,0,142
15,0,143
15,0,144
15,0,145
15,0,146
15,0,147
15,0,148
15,0,149
15,0,150
15,0,151
15,0,152
15,0,153
15,0,154
8,0,28
8,0,29
8,0,30
8,0,31
8,0,32
8,0,33
7,0,24
7,0,25
7,0,26
7,0,27
7,0,28
7,0,29
26,0,39
26,0,40
26,0,41
26,0,42
26,0,43
26,0,44
26,0,45
26,0,46
26,0,47
11,0,24
11,0,25
11,0,26
11,0,27
11,0,28
11,0,29
4,0,28
4,0,29
4,0,30
4,0,31
4,0,32
4,0,33
16,0,28
16,0,29
16,0,30
16,0,31
16,0,32
16,0,33
18,0,28
18,0,29
18,0,30
18,0,31
18,0,32
18,0,33
19,0,24
19,0,25
19,0,26
19,0,27
19,0,28
19,0,29
33,0,28
33,0,29
33,0,30
33,0,31
33,0,32
33,0,33
2,0,130
2,0,131
2,0,132
2,0,133
2,0,134
2,0,135
2,0,136
2,0,137
2,0,138
2,0,139
2,0,140
2,0,141
2,0,142
2,0,143
2,0,144
2,0,145
2,0,146
2,0,147
2,0,148
2,0,149
2,0,150
2,0,151
2,0,152
2,0,153
2,0,154
2,0,155
2,0,156
2,0,157
2,0,158
2,0,159
2,0,160
2,0,161
2,0,162
2,0,163
2,0,164
2,0,165
13,0,24
13,0,25
13,0,26
13,0,27
13,0,28
13,0,29
20,0,24
20,0,25
20,0,26
20,0,27
20,0,28
20,0,29
23,0,28
23,0,29
23,0,30
23,0,31
23,0,32
23,0,33
22,0,28
22,0,29
22,0,30
22,0,31
22,0,32
22,0,33
25,0,24
25,0,25
25,0,26
25,0,27
25,0,28
25,0,29
17,0,36
17,0,37
17,0,38
17,0,39
17,0,40
17,0,41
17,0,42
17,0,43
17,0,44
32,0,36
32,0,37
32,0,38
32,0,39
32,0,40
32,0,41
32,0,42
32,0,43
32,0,44
24,0,45
24,0,46
24,0,47
24,0,48
24,0,49
24,0,50
24,0,51
24,0,52
24,0,53
4,0,34
4,0,35
4,0,36
4,0,37
4,0,38
4,0,39
26,0,48
26,0,49
26,0,50
26,0,51
26,0,52
26,0,53
26,0,54
26,0,55
26,0,56
7,0,30
7,0,31
7,0,32
7,0,33
7,0,34
7,0,35
8,0,34
8,0,35
8,0,36
8,0,37
8,0,38
8,0,39
16,0,34
16,0,35
16,0,36
16,0,37
16,0,38
16,0,39
18,0,34
18,0,35
18,0,36
18,0,37
18,0,38
18,0,39
19,0,30
19,0,31
19,0,32
19,0,33
19,0,34
19,0,35
20,0,30
20,0,31
20,0,32
20,0,33
20,0,34
20,0,35
33,0,34
33,0,35
33,0,36
33,0,37
33,0,38
33,0,39
10,0,21
10,0,22
10,0,23
23,0,34
23,0,35
23,0,36
23,0,37
23,0,38
23,0,39
22,0,34
22,0,35
22,0,36
22,0,37
22,0,38
22,0,39
25,0,30
25,0,31
25,0,32
25,0,33
25,0,34
25,0,35
14,0,30
14,0,31
14,0,32
14,0,33
14,0,34
14,0,35
3,0,166
3,0,167
3,0,168
3,0,169
3,0,170
3,0,171
3,0,172
3,0,173
3,0,174
3,0,175
3,0,176
3,0,177
3,0,178
3,0,179
3,0,180
3,0,181
3,0,182
3,0,183
3,0,184
3,0,185
3,0,186
3,0,187
3,0,188
3,0,189
3,0,190
3,0,191
3,0,192
3,0,193
3,0,194
3,0,195
3,0,196
3,0,197
3,0,198
3,0,199
3,0,200
3,0,201
2,0,166
2,0,167
2,0,168
2,0,169
2,0,170
2,0,171
2,0,172
2,0,173
2,0,174
2,0,175
2,0,176
2,0,177
2,0,178
2,0,179
2,0,180
2,0,181
2,0,182
2,0,183
2,0,184
2,0,185
2,0,186
2,0,187
2,0,188
2,0,189
2,0,190
2,0,191
2,0,192
2,0,193
2,0,194
2,0,195
2,0,196
2,0,197
2,0,198
2,0,199
2,0,200
2,0,201
13,0,30
13,0,31
13,0,32
13,0,33
13,0,34
13,0,35
17,0,45
17,0,46
17,0,47
17,0,48
17,0,49
17,0,50
17,0,51
17,0,52
17,0,53
28,0,45
28,0,46
28,0,47
28,0,48
28,0,49
28,0,50
28,0,51
28,0,52
28,0,53
6,0,45
6,0,46
6,0,47
6,0,48
6,0,49
6,0,50
6,0,51
6,0,52
6,0,53
27,0,34
27,0,35
27,0,36
27,0,37
27,0,38
27,0,39
15,0,155
15,0,156
15,0,157
15,0,158
15,0,159
15,0,160
15,0,161
15,0,162
15,0,163
15,0,164
15,0,165
15,0,166
15,0,167
15,0,168
15,0,169
15,0,170
15,0,171
15,0,172
15,0,173
15,0,174
15,0,175
15,0,176
15,0,177
15,0,178
15,0,179
15,0,180
15,0,181
15,0,182
15,0,183
15,0,184
15,0,185
15,0,186
15,0,187
11,0,30
11,0,31
11,0,32
11,0,33
11,0,34
11,0,35
32,0,45
32,0,46
32,0,47
32,0,48
32,0,49
32,0,50
32,0,51
32,0,52
32,0,53
23,0,40
23,0,41
23,0,42
23,0,43
23,0,44
23,0,45
13,0,36
13,0,37
13,0,38
13,0,39
13,0,40
13,0,41
10,0,24
10,0,25
10,0,26
22,0,40
22,0,41
22,0,42
22,0,43
22,0,44
22,0,45
25,0,36
25,0,37
25,0,38
25,0,39
25,0,40
25,0,41
14,0,36
14,0,37
14,0,38
14,0,39
14,0,40
14,0,41
33,0,40
33,0,41
33,0,42
33,0,43
33,0,44
33,0,45
3,0,202
3,0,203
3,0,204
3,0,205
3,0,206
3,0,207
3,0,208
3,0,209
3,0,210
3,0,211
3,0,212
3,0,213
3,0,214
3,0,215
3,0,216
3,0,217
3,0,218
3,0,219
3,0,220
3,0,221
3,0,222
3,0,223
3,0,224
3,0,225
3,0,226
3,0,227
3,0,228
3,0,229
3,0,230
3,0,231
3,0,232
3,0,233
3,0,234
3,0,235
3,0,236
3,0,237
2,0,202
2,0,203
2,0,204
2,0,205
2,0,206
2,0,207
2,0,208
2,0,209
2,0,210
2,0,211
2,0,212
2,0,213
2,0,214
2,0,215
2,0,216
2,0,217
2,0,218
2,0,219
2,0,220
2,0,221
2,0,222
2,0,223
2,0,224
2,0,225
2,0,226
2,0,227
2,0,228
2,0,229
2,0,230
2,0,231
2,0,232
2,0,233
2,0,234
2,0,235
2,0,236
2,0,237
28,0,54
28,0,55
28,0,56
28,0,57
28,0,58
28,0,59
28,0,60
28,0,61
28,0,62
15,0,188
15,0,189
15,0,190
15,0,191
15,0,192
15,0,193
15,0,194
15,0,195
15,0,196
15,0,197
15,0,198
15,0,199
15,0,200
15,0,201
15,0,202
15,0,203
15,0,204
15,0,205
15,0,206
15,0,207
15,0,208
15,0,209
15,0,210
15,0,211
15,0,212
15,0,213
15,0,214
15,0,215
15,0,216
15,0,217
15,0,218
15,0,219
15,0,220
24,0,54
24,0,55
24,0,56
24,0,57
24,0,58
24,0,59
24,0,60
24,0,61
24,0,62
6,0,54
6,0,55
6,0,56
6,0,57
6,0,58
6,0,59
6,0,60
6,0,61
6,0,62
27,0,40
27,0,41
27,0,42
27,0,43
27,0,44
27,0,45
8,0,40
8,0,41
8,0,42
8,0,43
8,0,44
8,0,45
4,0,40
4,0,41
4,0,42
4,0,43
4,0,44
4,0,45
7,0,36
7,0,37
7,0,38
7,0,39
7,0,40
7,0,41
26,0,57
26,0,58
26,0,59
26,0,60
26,0,61
26,0,62
20,0,36
20,0,37
20,0,38
20,0,39
20,0,40
20,0,41
16,0,40
16,0,41
16,0,42
16,0,43
16,0,44
16,0,45
11,0,36
11,0,37
11,0,38
11,0,39
11,0,40
11,0,41
19,0,36
19,0,37
19,0,38
19,0,39
19,0,40
19,0,41
18,0,40
18,0,41
18,0,42
18,0,43
18,0,44
18,0,45
32,0,54
32,0,55
32,0,56
32,0,57
32,0,58
32,0,59
32,0,60
32,0,61
32,0,62
17,0,54
17,0,55
17,0,56
17,0,57
17,0,58
17,0,59
17,0,60
17,0,61
17,0,62
33,0,46
33,0,47
33,0,48
33,0,49
33,0,50
33,0,51
2,0,238
2,0,239
2,0,240
2,0,241
2,0,242
2,0,243
2,0,244
2,0,245
2,0,246
2,0,247
2,0,248
2,0,249
2,0,250
2,0,251
2,0,252
2,0,253
2,0,254
2,0,255
2,1,0
2,1,1
2,1,2
2,1,3
2,1,4
2,1,5
2,1,6
2,1,7
2,1,8
2,1,9
2,1,10
2,1,11
2,1,12
2,1,13
2,1,14
2,1,15
2,1,16
2,1,17
8,0,46
8,0,47
8,0,48
8,0,49
8,0,50
8,0,51
15,0,221
15,0,222
15,0,223
15,0,224
15,0,225
15,0,226
15,0,227
15,0,228
15,0,229
15,0,230
15,0,231
15,0,232
15,0,233
15,0,234
15,0,235
15,0,236
15,0,237
15,0,238
15,0,239
15,0,240
15,0,241
15,0,242
15,0,243
15,0,244
15,0,245
15,0,246
15,0,247
15,0,248
15,0,249
15,0,250
15,0,251
15,0,252
15,0,253
6,0,63
6,0,64
6,0,65
6,0,66
6,0,67
6,0,68
6,0,69
6,0,70
6,0,71
27,0,46
27,0,47
27,0,48
27,0,49
27,0,50
27,0,51
20,0,42
20,0,43
20,0,44
20,0,45
20,0,46
20,0,47
4,0,46
4,0,47
4,0,48
4,0,49
4,0,50
4,0,51
26,0,63
26,0,64
26,0,65
26,0,66
26,0,67
26,0,68
26,0,69
26,0,70
26,0,71
16,0,46
16,0,47
16,0,48
16,0,49
16,0,50
16,0,51
19,0,42
19,0,43
19,0,44
19,0,45
19,0,46
19,0,47
18,0,46
18,0,47
18,0,48
18,0,49
18,0,50
18,0,51
7,0,42
7,0,43
7,0,44
7,0,45
7,0,46
7,0,47
23,0,46
23,0,47
23,0,48
23,0,49
23,0,50
23,0,51
11,0,42
11,0,43
11,0,44
11,0,45
11,0,46
11,0,47
32,0,63
32,0,64
32,0,65
32,0,66
32,0,67
32,0,68
32,0,69
32,0,70
32,0,71
22,0,46
22,0,47
22,0,48
22,0,49
22,0,50
22,0,51
13,0,42
13,0,43
13,0,44
13,0,45
13,0,46
13,0,47
25,0,42
25,0,43
25,0,44
25,0,45
25,0,46
25,0,47
10,0,27
10,0,28
10,0,29
3,0,238
3,0,239
3,0,240
3,0,241
3,0,242
3,0,243
3,0,244
3,0,245
3,0,246
3,0,247
3,0,248
3,0,249
3,0,250
3,0,251
3,0,252
3,0,253
3,0,254
3,0,255
3,1,0
3,1,1
3,1,2
3,1,3
3,1,4
3,1,5
3,1,6
3,1,7
3,1,8
3,1,9
3,1,10
3,1,11
3,1,12
3,1,13
3,1,14
3,1,15
3,1,16
3,1,17
14,0,42
14,0,43
14,0,44
14,0,45
14,0,46
14,0,47
24,0,63
24,0,64
24,0,65
24,0,66
24,0,67
24,0,68
24,0,69
24,0,70
24,0,71
28,0,63
28,0,64
28,0,65
28,0,66
28,0,67
28,0,68
28,0,69
28,0,70
28,0,71
17,0,63
17,0,64
17,0,65
17,0,66
17,0,67
17,0,68
17,0,69
17,0,70
17,0,71
27,0,52
27,0,53
27,0,54
27,0,55
27,0,56
27,0,57
26,0,72
26,0,73
26,0,74
26,0,75
26,0,76
26,0,77
26,0,78
26,0,79
26,0,80
18,0,52
18,0,53
18,0,54
18,0,55
18,0,56
18,0,57
7,0,48
7,0,49
7,0,50
7,0,51
7,0,52
7,0,53
16,0,52
16,0,53
16,0,54
16,0,55
16,0,56
16,0,57
25,0,48
25,0,49
25,0,50
25,0,51
25,0,52
25,0,53
23,0,52
23,0,53
23,0,54
23,0,55
23,0,56
23,0,57
19,0,48
19,0,49
19,0,50
19,0,51
19,0,52
19,0,53
3,1,18
3,1,19
3,1,20
3,1,21
3,1,22
3,1,23
3,1,24
3,1,25
3,1,26
3,1,27
3,1,28
3,1,29
3,1,30
3,1,31
3,1,32
3,1,33
3,1,34
3,1,35
3,1,36
3,1,37
3,1,38
3,1,39
3,1,40
3,1,41
3,1,42
3,1,43
3,1,44
3,1,45
3,1,46
3,1,47
3,1,48
3,1,49
3,1,50
3,1,51
3,1,52
3,1,53
11,0,48
11,0,49
11,0,50
11,0,51
11,0,52
11,0,53
13,0,48
13,0,49
13,0,50
13,0,51
13,0,52
13,0,53
22,0,52
22,0,53
22,0,54
22,0,55
22,0,56
22,0,57
33,0,52
33,0,53
33,0,54
33,0,55
33,0,56
33,0,57
14,0,48
14,0,49
14,0,50
14,0,51
14,0,52
14,0,53
28,0,72
28,0,73
28,0,74
28,0,75
28,0,76
28,0,77
28,0,78
28,0,79
28,0,80
24,0,72
24,0,73
24,0,74
24,0,75
24,0,76
24,0,77
24,0,78
24,0,79
24,0,80
10,0,30
10,0,31
10,0,32
15,0,254
15,0,255
15,1,0
15,1,1
15,1,2
15,1,3
15,1,4
15,1,5
15,1,6
15,1,7
15,1,8
15,1,9
15,1,10
15,1,11
15,1,12
15,1,13
15,1,14
15,1,15
15,1,16
15,1,17
15,1,18
15,1,19
15,1,20
15,1,21
15,1,22
15,1,23
15,1,24
15,1,25
15,1,26
15,1,27
15,1,28
15,1,29
15,1,30
8,0,52
8,0,53
8,0,54
8,0,55
8,0,56
8,0,57
2,1,18
2,1,19
2,1,20
2,1,21
2,1,22
2,1,23
2,1,24
2,1,25
2,1,26
2,1,27
2,1,28
2,1,29
2,1,30
2,1,31
2,1,32
2,1,33
2,1,34
2,1,35
2,1,36
2,1,37
2,1,38
2,1,39
2,1,40
2,1,41
2,1,42
2,1,43
2,1,44
2,1,45
2,1,46
2,1,47
2,1,48
2,1,49
2,1,50
2,1,51
2,1,52
2,1,53
4,0,52
4,0,53
4,0,54
4,0,55
4,0,56
4,0,57
20,0,48
20,0,49
20,0,50
20,0,51
20,0,52
20,0,53
6,0,72
6,0,73
6,0,74
6,0,75
6,0,76
6,0,77
6,0,78
6,0,79
6,0,80
32,0,72
32,0,73
32,0,74
32,0,75
32,0,76
32,0,77
32,0,78
32,0,79
32,0,80
17,0,72
17,0,73
17,0,74
17,0,75
17,0,76
17,0,77
17,0,78
17,0,79
17,0,80
14,0,54
14,0,55
14,0,56
14,0,57
14,0,58
14,0,59
3,1,54
3,1,55
3,1,56
3,1,57
3,1,58
3,1,59
3,1,60
3,1,61
3,1,62
3,1,63
3,1,64
3,1,65
3,1,66
3,1,67
3,1,68
3,1,69
3,1,70
3,1,71
3,1,72
3,1,73
3,1,74
3,1,75
3,1,76
3,1,77
3,1,78
3,1,79
3,1,80
3,1,81
3,1,82
3,1,83
3,1,84
3,1,85
3,1,86
3,1,87
3,1,88
3,1,89
33,0,58
33,0,59
33,0,60
33,0,61
33,0,62
33,0,63
13,0,54
13,0,55
13,0,56
13,0,57
13,0,58
13,0,59
22,0,58
22,0,59
22,0,60
22,0,61
22,0,62
22,0,63
27,0,58
27,0,59
27,0,60
27,0,61
27,0,62
27,0,63
28,0,81
28,0,82
28,0,83
28,0,84
28,0,85
28,0,86
28,0,87
28,0,88
28,0,89
15,1,31
15,1,32
15,1,33
15,1,34
15,1,35
15,1,36
15,1,37
15,1,38
15,1,39
15,1,40
15,1,41
15,1,42
15,1,43
15,1,44
15,1,45
15,1,46
15,1,47
15,1,48
15,1,49
15,1,50
15,1,51
15,1,52
15,1,53
15,1,54
15,1,55
15,1,56
15,1,57
15,1,58
15,1,59
15,1,60
15,1,61
15,1,62
15,1,63
10,0,33
10,0,34
10,0,35
24,0,81
24,0,82
24,0,83
24,0,84
24,0,85
24,0,86
24,0,87
24,0,88
24,0,89
2,1,54
2,1,55
2,1,56
2,1,57
2,1,58
2,1,59
2,1,60
2,1,61
2,1,62
2,1,63
2,1,64
2,1,65
2,1,66
2,1,67
2,1,68
2,1,69
2,1,70
2,1,71
2,1,72
2,1,73
2,1,74
2,1,75
2,1,76
2,1,77
2,1,78
2,1,79
2,1,80
2,1,81
2,1,82
2,1,83
2,1,84
2,1,85
2,1,86
2,1,87
2,1,88
2,1,89
4,0,58
4,0,59
4,0,60
4,0,61
4,0,62
4,0,63
8,0,58
8,0,59
8,0,60
8,0,61
8,0,62
8,0,63
20,0,54
20,0,55
20,0,56
20,0,57
20,0,58
20,0,59
6,0,81
6,0,82
6,0,83
6,0,84
6,0,85
6,0,86
6,0,87
6,0,88
6,0,89
26,0,81
26,0,82
26,0,83
26,0,84
26,0,85
26,0,86
26,0,87
26,0,88
26,0,89
16,0,58
16,0,59
16,0,60
16,0,61
16,0,62
16,0,63
7,0,54
7,0,55
7,0,56
7,0,57
7,0,58
7,0,59
25,0,54
25,0,55
25,0,56
25,0,57
25,0,58
25,0,59
23,0,58
23,0,59
23,0,60
23,0,61
23,0,62
23,0,63
18,0,58
18,0,59
18,0,60
18,0,61
18,0,62
18,0,63
17,0,81
17,0,82
17,0,83
17,0,84
17,0,85
17,0,86
17,0,87
17,0,88
17,0,89
19,0,54
19,0,55
19,0,56
19,0,57
19,0,58
19,0,59
11,0,54
11,0,55
11,0,56
11,0,57
11,0,58
11,0,59
32,0,81
32,0,82
32,0,83
32,0,84
32,0,85
32,0,86
32,0,87
32,0,88
32,0,89
8,0,64
8,0,65
8,0,66
8,0,67
8,0,68
8,0,69
20,0,60
20,0,61
20,0,62
20,0,63
20,0,64
20,0,65
10,0,36
10,0,37
10,0,38
26,0,90
26,0,91
26,0,92
26,0,93
26,0,94
26,0,95
26,0,96
26,0,97
26,0,98
4,0,64
4,0,65
4,0,66
4,0,67
4,0,68
4,0,69
6,0,90
6,0,91
6,0,92
6,0,93
6,0,94
6,0,95
6,0,96
6,0,97
6,0,98
7,0,60
7,0,61
7,0,62
7,0,63
7,0,64
7,0,65
16,0,64
16,0,65
16,0,66
16,0,67
16,0,68
16,0,69
18,0,64
18,0,65
18,0,66
18,0,67
18,0,68
18,0,69
14,0,60
14,0,61
14,0,62
14,0,63
14,0,64
14,0,65
3,1,90
3,1,91
3,1,92
3,1,93
3,1,94
3,1,95
3,1,96
3,1,97
3,1,98
3,1,99
3,1,100
3,1,101
3,1,102
3,1,103
3,1,104
3,1,105
3,1,106
3,1,107
3,1,108
3,1,109
3,1,110
3,1,111
3,1,112
3,1,113
3,1,114
3,1,115
3,1,116
3,1,117
3,1,118
3,1,119
3,1,120
3,1,121
3,1,122
3,1,123
3,1,124
3,1,125
22,0,64
22,0,65
22,0,66
22,0,67
22,0,68
22,0,69
25,0,60
25,0,61
25,0,62
25,0,63
25,0,64
25,0,65
13,0,60
13,0,61
13,0,62
13,0,63
13,0,64
13,0,65
15,1,64
15,1,65
15,1,66
15,1,67
15,1,68
15,1,69
15,1,70
15,1,71
15,1,72
15,1,73
15,1,74
15,1,75
15,1,76
15,1,77
15,1,78
15,1,79
15,1,80
15,1,81
15,1,82
15,1,83
15,1,84
15,1,85
15,1,86
15,1,87
15,1,88
15,1,89
15,1,90
15,1,91
15,1,92
15,1,93
15,1,94
15,1,95
15,1,96
17,0,90
17,0,91
17,0,92
17,0,93
17,0,94
17,0,95
17,0,96
17,0,97
17,0,98
2,1,90
2,1,91
2,1,92
2,1,93
2,1,94
2,1,95
2,1,96
2,1,97
2,1,98
2,1,99
2,1,100
2,1,101
2,1,102
2,1,103
2,1,104
2,1,105
2,1,106
2,1,107
2,1,108
2,1,109
2,1,110
2,1,111
2,1,112
2,1,113
2,1,114
2,1,115
2,1,116
2,1,117
2,1,118
2,1,119
2,1,120
2,1,121
2,1,122
2,1,123
2,1,124
2,1,125
33,0,64
33,0,65
33,0,66
33,0,67
33,0,68
33,0,69
19,0,60
19,0,61
19,0,62
19,0,63
19,0,64
19,0,65
23,0,64
23,0,65
23,0,66
23,0,67
23,0,68
23,0,69
28,0,90
28,0,91
28,0,92
28,0,93
28,0,94
28,0,95
28,0,96
28,0,97
28,0,98
27,0,64
27,0,65
27,0,66
27,0,67
27,0,68
27,0,69
24,0,90
24,0,91
24,0,92
24,0,93
24,0,94
24,0,95
24,0,96
24,0,97
24,0,98
11,0,60
11,0,61
11,0,62
11,0,63
11,0,64
11,0,65
32,0,90
32,0,91
32,0,92
32,0,93
32,0,94
32,0,95
32,0,96
32,0,97
32,0,98
6,0,99
6,0,100
6,0,101
6,0,102
6,0,103
6,0,104
6,0,105
6,0,106
6,0,107
16,0,70
16,0,71
16,0,72
16,0,73
16,0,74
16,0,75
14,0,66
14,0,67
14,0,68
14,0,69
14,0,70
14,0,71
25,0,66
25,0,67
25,0,68
25,0,69
25,0,70
25,0,71
18,0,70
18,0,71
18,0,72
18,0,73
18,0,74
18,0,75
23,0,70
23,0,71
23,0,72
23,0,73
23,0,74
23,0,75
22,0,70
22,0,71
22,0,72
22,0,73
22,0,74
22,0,75
19,0,66
19,0,67
19,0,68
19,0,69
19,0,70
19,0,71
2,1,126
2,1,127
2,1,128
2,1,129
2,1,130
2,1,131
2,1,132
2,1,133
2,1,134
2,1,135
2,1,136
2,1,137
2,1,138
2,1,139
2,1,140
2,1,141
2,1,142
2,1,143
2,1,144
2,1,145
2,1,146
2,1,147
2,1,148
2,1,149
2,1,150
2,1,151
2,1,152
2,1,153
2,1,154
2,1,155
2,1,156
2,1,157
2,1,158
2,1,159
2,1,160
2,1,161
3,1,126
3,1,127
3,1,128
3,1,129
3,1,130
3,1,131
3,1,132
3,1,133
3,1,134
3,1,135
3,1,136
3,1,137
3,1,138
3,1,139
3,1,140
3,1,141
3,1,142
3,1,143
3,1,144
3,1,145
3,1,146
3,1,147
3,1,148
3,1,149
3,1,150
3,1,151
3,1,152
3,1,153
3,1,154
3,1,155
3,1,156
3,1,157
3,1,158
3,1,159
3,1,160
3,1,161
15,1,97
15,1,98
15,1,99
15,1,100
15,1,101
15,1,102
15,1,103
15,1,104
15,1,105
15,1,106
15,1,107
15,1,108
15,1,109
15,1,110
15,1,111
15,1,112
15,1,113
15,1,114
15,1,115
15,1,116
15,1,117
15,1,118
15,1,119
15,1,120
15,1,121
15,1,122
15,1,123
15,1,124
15,1,125
15,1,126
15,1,127
15,1,128
15,1,129
27,0,70
27,0,71
27,0,72
27,0,73
27,0,74
27,0,75
13,0,66
13,0,67
13,0,68
13,0,69
13,0,70
13,0,71
28,0,99
28,0,100
28,0,101
28,0,102
28,0,103
28,0,104
28,0,105
28,0,106
28,0,107
33,0,70
33,0,71
33,0,72
33,0,73
33,0,74
33,0,75
8,0,70
8,0,71
8,0,72
8,0,73
8,0,74
8,0,75
10,0,39
10,0,40
10,0,41
20,0,66
20,0,67
20,0,68
20,0,69
20,0,70
20,0,71
26,0,99
26,0,100
26,0,101
26,0,102
26,0,103
26,0,104
26,0,105
26,0,106
26,0,107
24,0,99
24,0,100
24,0,101
24,0,102
24,0,103
24,0,104
24,0,105
24,0,106
24,0,107
4,0,70
4,0,71
4,0,72
4,0,73
4,0,74
4,0,75
11,0,66
11,0,67
11,0,68
11,0,69
11,0,70
11,0,71
7,0,66
7,0,67
7,0,68
7,0,69
7,0,70
7,0,71
17,0,99
17,0,100
17,0,101
17,0,102
17,0,103
17,0,104
17,0,105
17,0,106
17,0,107
32,0,99
32,0,100
32,0,101
32,0,102
32,0,103
32,0,104
32,0,105
32,0,106
32,0,107
10,0,42
23,0,76
23,0,77
24,0,108
24,0,109
24,0,110
14,0,72
14,0,73
7,0,72
7,0,73
8,0,76
8,0,77
3,1,162
3,1,163
3,1,164
3,1,165
3,1,166
3,1,167
3,1,168
3,1,169
3,1,170
3,1,171
3,1,172
3,1,173
20,0,72
20,0,73
6,0,108
6,0,109
6,0,110
17,0,108
17,0,109
17,0,110
22,0,76
22,0,77
16,0,76
16,0,77
19,0,72
19,0,73
2,1,162
2,1,163
2,1,164
2,1,165
2,1,166
2,1,167
2,1,168
2,1,169
2,1,170
2,1,171
2,1,172
2,1,173
32,0,108
32,0,109
32,0,110
26,0,108
26,0,109
26,0,110
13,0,72
13,0,73
28,0,108
28,0,109
28,0,110
33,0,76
33,0,77
25,0,72
25,0,73
15,1,130
15,1,131
15,1,132
15,1,133
15,1,134
15,1,135
15,1,136
15,1,137
15,1,138
15,1,139
15,1,140
18,0,76
18,0,77
27,0,76
27,0,77
4,0,76
4,0,77
11,0,72
11,0,73
