# observer_id,node_id,mean_mA
32,32,17.041739
1,1,14.595363
2,2,14.349028
3,3,14.237631
4,4,14.604142
6,6,15.464998
33,33,13.951488
8,8,14.141977
10,10,14.895002
15,15,14.157983
16,16,14.158665
18,18,14.757043
22,22,18.305633
28,28,14.376456
31,31,13.242986
