1: 126 (126 ok) packets
2: 104 (104 ok) packets
3: 195 (195 ok) packets
6: 199 (199 ok) packets
8: 134 (134 ok) packets
15: 108 (108 ok) packets
16: 199 (199 ok) packets
18: 200 (200 ok) packets
22: 200 (200 ok) packets
28: 199 (199 ok) packets
31: 120 (120 ok) packets
Data Yield: 59.47 % (0.59)
Average Current Drain: 3.51 mA (0.86)
Performance Metric: 0.73
