# observer_id,node_id,mean_mA
32,32,4.572499
1,1,2.522078
2,2,2.387643
3,3,13.728253
4,4,14.045810
6,6,6.733720
33,33,13.689858
8,8,2.433974
10,10,2.632556
15,15,2.593512
16,16,5.565704
18,18,2.389962
22,22,13.131535
28,28,2.319535
31,31,12.953358
