# observer_id,node_id,mean_mA
32,32,17.170051
1,1,14.530296
2,2,14.381220
3,3,14.246912
4,4,14.430619
6,6,15.756846
33,33,13.682148
8,8,14.110779
10,10,15.253018
15,15,14.258095
16,16,14.140265
18,18,14.493408
22,22,18.229272
28,28,14.329609
31,31,13.282737
