# observer_id,node_id,mean_mA
32,32,20.673140
1,1,18.804139
2,2,18.644351
3,3,18.642820
4,4,18.924407
6,6,19.640564
33,33,18.508154
8,8,18.697168
10,10,19.008410
15,15,18.528399
16,16,18.623461
18,18,18.653022
22,22,19.183130
28,28,18.691476
31,31,17.811362
