32: 9 (9 ok) packets
33: 55 (55 ok) packets
2: 15 (15 ok) packets
3: 50 (50 ok) packets
4: 18 (18 ok) packets
6: 71 (71 ok) packets
1: 2 (2 ok) packets
8: 36 (36 ok) packets
10: 10 (10 ok) packets
15: 31 (31 ok) packets
16: 100 (100 ok) packets
18: 74 (74 ok) packets
22: 197 (197 ok) packets
28: 93 (93 ok) packets
31: 24 (24 ok) packets
Data Yield: 26.17 % (0.26)
Average Current Drain: 19.15 mA (0.23)
Performance Metric: 0.25
