32: 1 (1 ok) packets
2: 2 (2 ok) packets
3: 78 (78 ok) packets
4: 24 (24 ok) packets
6: 127 (127 ok) packets
16: 124 (124 ok) packets
18: 106 (106 ok) packets
22: 200 (200 ok) packets
28: 134 (134 ok) packets
Data Yield: 26.53 % (0.27)
Average Current Drain: 14.57 mA (0.42)
Performance Metric: 0.34
