[INFO: DesignProjectApp] Pkt:18,12,60495[INFO: DesignProjectApp] Pkt:22,14,35045

[INFO: DesignProjectApp] Pkt:32,17,7624[INFO: DesignProjectApp] Pkt:22,21,20084

[INFO: DesignProjectApp] Pkt:18,27,55134[INFO: DesignProjectApp] Pkt:22,29,63500

[INFO: DesignProjectApp] Pkt:18,42,10761[INFO: DesignProjectApp] Pkt:22,44,48687

[INFO: DesignProjectApp] Pkt:18,57,52288[INFO: DesignProjectApp] Pkt:22,59,23742

[INFO: DesignProjectApp] Pkt:31,57,5228[INFO: DesignProjectApp] Pkt:22,61,27756

[INFO: DesignProjectApp] Pkt:18,67,17814[INFO: DesignProjectApp] Pkt:22,69,56580

[INFO: DesignProjectApp] Pkt:18,82,17441[INFO: DesignProjectApp] Pkt:22,84,57863

[INFO: DesignProjectApp] Pkt:18,97,60856[INFO: DesignProjectApp] Pkt:22,99,18166

[INFO: DesignProjectApp] Pkt:18,102,[INFO: DesignProjectApp] Pkt:22,104,44947

[INFO: DesignProjectApp] Pkt:18,107,[INFO: DesignProjectApp] Pkt:22,109,50428

[INFO: DesignProjectApp] Pkt:31,107,1[INFO: DesignProjectApp] Pkt:22,111,31194

[INFO: DesignProjectApp] Pkt:16,111,[INFO: DesignProjectApp] Pkt:22,114,26369

[INFO: DesignProjectApp] Pkt:8,110,5517[INFO: DesignProjectApp] Pkt:22,116,61415

[INFO: DesignProjectApp] Pkt:18,117,[INFO: DesignProjectApp] Pkt:22,119,27186

[INFO: DesignProjectApp] Pkt:18,122,[INFO: DesignProjectApp] Pkt:22,124,62687

[INFO: DesignProjectApp] Pkt:18,132,41[INFO: DesignProjectApp] Pkt:22,134,25773

[INFO: DesignProjectApp] Pkt:33,132,41[INFO: DesignProjectApp] Pkt:22,136,29555

[INFO: DesignProjectApp] Pkt:1,130,4721[INFO: DesignProjectApp] Pkt:22,137,25136

[INFO: DesignProjectApp] Pkt:18,137,[INFO: DesignProjectApp] Pkt:22,139,15406

[INFO: DesignProjectApp] Pkt:8,140,5422[INFO: DesignProjectApp] Pkt:22,146,31201

[INFO: DesignProjectApp] Pkt:18,157,59[INFO: DesignProjectApp] Pkt:22,159,6378

[INFO: DesignProjectApp] Pkt:18,162,4027[INFO: DesignProjectApp] Pkt:22,164,22199

[INFO: DesignProjectApp] Pkt:31,162,4027[INFO: DesignProjectApp] Pkt:22,166,48525

[INFO: DesignProjectApp] Pkt:28,168,4[INFO: DesignProjectApp] Pkt:22,167,56130

[INFO: DesignProjectApp] Pkt:1,157,59788[INFO: DesignProjectApp] Pkt:22,168,42835

[INFO: DesignProjectApp] Pkt:33,167,5[INFO: DesignProjectApp] Pkt:22,171,27022

[INFO: DesignProjectApp] Pkt:33,182,92[INFO: DesignProjectApp] Pkt:22,186,761

[INFO: DesignProjectApp] Pkt:33,187,210[INFO: DesignProjectApp] Pkt:22,191,21578

[INFO: DesignProjectApp] Pkt:33,192,4[INFO: DesignProjectApp] Pkt:22,196,31895

32: 124 (124 ok) packets
33: 82 (82 ok) packets
4: 89 (89 ok) packets
6: 56 (56 ok) packets
1: 88 (88 ok) packets
8: 128 (128 ok) packets
16: 87 (87 ok) packets
18: 110 (110 ok) packets
22: 170 (170 ok) packets
28: 159 (159 ok) packets
31: 122 (122 ok) packets
Data Yield: 40.50 % (0.41)
Average Current Drain: 4.60 mA (0.82)
Performance Metric: 0.61
