# observer_id,node_id,mean_mA
32,32,5.077173
1,1,3.771324
2,2,3.608872
3,3,2.473256
4,4,3.775441
6,6,3.599425
33,33,2.436325
8,8,3.704419
10,10,3.872315
15,15,3.539887
16,16,2.501290
18,18,2.548797
22,22,20.518152
28,28,3.429668
31,31,1.862982
