# observer_id,node_id,mean_mA
32,32,16.646709
1,1,14.779412
2,2,14.327220
3,3,14.282724
4,4,14.443833
6,6,15.513019
33,33,13.790087
8,8,13.950328
10,10,15.041110
15,15,14.180297
16,16,14.102707
18,18,14.593185
22,22,18.289791
28,28,14.304681
31,31,13.279394
