# observer_id,node_id,mean_mA
32,32,5.064114
1,1,2.793575
2,2,2.619035
3,3,2.742082
4,4,3.226939
6,6,3.933787
33,33,2.721147
8,8,3.201785
10,10,2.801462
15,15,2.595149
16,16,2.679180
18,18,2.654607
22,22,3.734439
28,28,2.762886
31,31,2.155632
