32: 200 (200 ok) packets
33: 200 (200 ok) packets
2: 90 (90 ok) packets
3: 200 (200 ok) packets
4: 200 (200 ok) packets
6: 200 (200 ok) packets
1: 90 (90 ok) packets
8: 90 (90 ok) packets
10: 200 (200 ok) packets
15: 200 (200 ok) packets
16: 200 (200 ok) packets
18: 200 (200 ok) packets
22: 200 (200 ok) packets
28: 200 (200 ok) packets
31: 200 (200 ok) packets
Data Yield: 89.00 % (0.89)
Average Current Drain: 2.96 mA (0.88)
Performance Metric: 0.89
