# observer_id,node_id,mean_mA
32,32,16.766600
1,1,14.624722
2,2,14.426490
3,3,14.069709
4,4,14.603159
6,6,15.613049
33,33,13.959777
8,8,14.192185
10,10,15.318954
15,15,14.329757
16,16,14.365011
18,18,14.608423
22,22,18.238065
28,28,14.476958
31,31,13.062260
