# observer_id,node_id,mean_mA
32,32,16.328374
1,1,14.760242
2,2,14.475081
3,3,14.232502
4,4,14.369202
6,6,16.010448
33,33,13.918159
8,8,14.025704
10,10,14.880368
15,15,14.051442
16,16,14.048614
18,18,14.792636
22,22,18.389632
28,28,14.469166
31,31,13.259398
