32: 3 (3 ok) packets
33: 1 (1 ok) packets
2: 7 (7 ok) packets
3: 114 (114 ok) packets
4: 30 (30 ok) packets
6: 123 (123 ok) packets
10: 6 (6 ok) packets
15: 8 (8 ok) packets
16: 125 (125 ok) packets
18: 110 (110 ok) packets
22: 200 (200 ok) packets
28: 127 (127 ok) packets
31: 30 (30 ok) packets
Data Yield: 29.47 % (0.29)
Average Current Drain: 14.46 mA (0.42)
Performance Metric: 0.36
