# observer_id,node_id,mean_mA
32,32,15.825280
1,1,14.627876
2,2,14.315455
3,3,14.216671
4,4,14.702781
6,6,15.561353
33,33,14.013865
8,8,14.083738
10,10,14.949414
15,15,14.109104
16,16,14.146625
18,18,14.634826
22,22,17.934891
28,28,14.272492
31,31,13.218969
