# observer_id,node_id,mean_mA
32,32,5.253907
1,1,3.791854
2,2,3.610863
3,3,2.478864
4,4,3.789594
6,6,3.702268
33,33,3.556020
8,8,3.719212
10,10,3.875591
15,15,3.541674
16,16,2.513523
18,18,2.561457
22,22,20.501909
28,28,3.327718
31,31,1.862097
