# observer_id,node_id,mean_mA
32,32,4.565919
1,1,2.499154
2,2,2.367630
3,3,13.716665
4,4,14.063862
6,6,6.749841
33,33,13.655216
8,8,2.491688
10,10,2.800377
15,15,2.592123
16,16,5.599307
18,18,2.446827
22,22,12.852227
28,28,2.458318
31,31,12.955114
