32: 10 (10 ok) packets
33: 33 (33 ok) packets
2: 7 (7 ok) packets
3: 46 (46 ok) packets
4: 29 (29 ok) packets
6: 50 (50 ok) packets
1: 6 (6 ok) packets
8: 26 (26 ok) packets
10: 4 (4 ok) packets
15: 33 (33 ok) packets
16: 93 (93 ok) packets
18: 62 (62 ok) packets
22: 197 (197 ok) packets
28: 94 (94 ok) packets
31: 22 (22 ok) packets
Data Yield: 23.73 % (0.24)
Average Current Drain: 19.28 mA (0.23)
Performance Metric: 0.23
