32: 11 (11 ok) packets
33: 36 (36 ok) packets
2: 20 (20 ok) packets
3: 52 (52 ok) packets
4: 19 (19 ok) packets
6: 77 (77 ok) packets
1: 6 (6 ok) packets
8: 41 (41 ok) packets
10: 17 (17 ok) packets
15: 24 (24 ok) packets
16: 68 (68 ok) packets
18: 50 (50 ok) packets
22: 195 (195 ok) packets
28: 95 (95 ok) packets
31: 22 (22 ok) packets
Data Yield: 24.43 % (0.24)
Average Current Drain: 19.20 mA (0.23)
Performance Metric: 0.24
