# observer_id,node_id,mean_mA
32,32,6.316152
1,1,3.833126
2,2,3.606841
3,3,2.475511
4,4,3.775033
6,6,3.314603
33,33,2.439655
8,8,2.563965
10,10,3.874378
15,15,3.544337
16,16,2.496566
18,18,2.534479
22,22,20.517056
28,28,3.337337
31,31,1.867543
