# observer_id,node_id,mean_mA
32,32,6.163154
1,1,4.601109
2,2,4.455129
3,3,4.734486
4,4,4.619324
6,6,5.618426
33,33,4.370346
8,8,4.521492
10,10,4.678388
15,15,4.000925
16,16,4.373120
18,18,4.537092
22,22,8.151730
28,28,4.443406
31,31,3.931588
