1: 108 (108 ok) packets
2: 103 (103 ok) packets
3: 188 (188 ok) packets
6: 200 (200 ok) packets
8: 134 (134 ok) packets
15: 106 (106 ok) packets
16: 197 (197 ok) packets
18: 199 (199 ok) packets
22: 200 (200 ok) packets
28: 200 (200 ok) packets
31: 78 (78 ok) packets
Data Yield: 57.10 % (0.57)
Average Current Drain: 3.49 mA (0.86)
Performance Metric: 0.72
