# observer_id,node_id,mean_mA
32,32,16.104314
1,1,14.510306
2,2,14.507204
3,3,14.063560
4,4,14.558138
6,6,16.006790
33,33,13.949738
8,8,14.099105
10,10,15.020973
15,15,14.169861
16,16,14.383526
18,18,14.765354
22,22,18.377105
28,28,14.526878
31,31,13.370793
