33: 2 (2 ok) packets
2: 4 (4 ok) packets
3: 70 (70 ok) packets
4: 22 (22 ok) packets
6: 113 (113 ok) packets
16: 122 (122 ok) packets
18: 117 (117 ok) packets
22: 200 (200 ok) packets
28: 130 (130 ok) packets
Data Yield: 26.00 % (0.26)
Average Current Drain: 14.49 mA (0.42)
Performance Metric: 0.34
