# timestamp,observer_id,node_id,direction,output
1547255185.372296,2,2,r,[INFO: CC430     ] MCU: CC430F5147, Reset Source: nRST, Compile date: Dec 10 2018
1547255185.440500,2,2,r,[INFO: RF1A      ] RF module configured (0dBm, 869.0MHz, 30b)
1547255185.440500,2,2,r,[INFO: Main      ] Starting Contiki-NG
1547255185.440500,2,2,r,[INFO: Main      ]  Net: nullnet
1547255185.440500,2,2,r,[INFO: Main      ]  MAC: nullmac
1547255185.440500,2,2,r,[INFO: Main      ] Link-layer address 0000.0000.0000.0000
1547255185.440500,2,2,r,[INFO: CC430     ] Node started. Node ID is set to 2. Platform DPP1
1547255185.386430,4,4,r,[INFO: CC430     ] MCU: CC430F5147, Reset Source: nRST, Compile date: Dec 10 2018
1547255185.448668,4,4,r,[INFO: RF1A      ] RF module configured (0dBm, 869.0MHz, 30b)
1547255185.448668,4,4,r,[INFO: Main      ] Starting Contiki-NG
1547255185.448668,4,4,r,[INFO: Main      ]  Net: nullnet
1547255185.448668,4,4,r,[INFO: Main      ]  MAC: nullmac
1547255185.448668,4,4,r,[INFO: Main      ] Link-layer address 0000.0000.0000.0000
1547255185.448668,4,4,r,[INFO: CC430     ] Node started. Node ID is set to 4. Platform DPP1
1547255185.409401,1,1,r,[INFO: CC430     ] MCU: CC430F5147, Reset Source: nRST, Compile date: Dec 10 2018
1547255185.409401,1,1,r,[INFO: RF1A      ] RF module configured (0dBm, 869.0MHz, 30b)
1547255185.409401,1,1,r,[INFO: Main      ] Starting Contiki-NG
1547255185.409401,1,1,r,[INFO: Main      ]  Net: nullnet
1547255185.409401,1,1,r,[INFO: Main      ]  MAC: nullmac
1547255185.409401,1,1,r,[INFO: Main      ] Link-layer address 0000.0000.0000.0000
1547255185.409401,1,1,r,[INFO: CC430     ] Node started. Node ID is set to 1. Platform DPP1
1547255185.404186,32,32,r,[INFO: CC430     ] MCU: CC430F5147, Reset Source: nRST, Compile date: Dec 10 2018
1547255185.404186,32,32,r,[INFO: RF1A      ] RF module configured (0dBm, 869.0MHz, 30b)
1547255185.404186,32,32,r,[INFO: Main      ] Starting Contiki-NG
1547255185.404186,32,32,r,[INFO: Main      ]  Net: nullnet
1547255185.404186,32,32,r,[INFO: Main      ]  MAC: nullmac
1547255185.404186,32,32,r,[INFO: Main      ] Link-layer address 0000.0000.0000.0000
1547255185.404186,32,32,r,[INFO: CC430     ] Node started. Node ID is set to 32. Platform DPP1
1547255185.396675,33,33,r,[INFO: CC430     ] MCU: CC430F5147, Reset Source: nRST, Compile date: Dec 10 2018
1547255185.458379,33,33,r,[INFO: RF1A      ] RF module configured (0dBm, 869.0MHz, 30b)
1547255185.458379,33,33,r,[INFO: Main      ] Starting Contiki-NG
1547255185.458379,33,33,r,[INFO: Main      ]  Net: nullnet
1547255185.458379,33,33,r,[INFO: Main      ]  MAC: nullmac
1547255185.458379,33,33,r,[INFO: Main      ] Link-layer address 0000.0000.0000.0000
1547255185.458379,33,33,r,[INFO: CC430     ] Node started. Node ID is set to 33. Platform DPP1
1547255185.391501,28,28,r,[INFO: CC430     ] MCU: CC430F5147, Reset Source: nRST, Compile date: Dec 10 2018
1547255185.484688,28,28,r,[INFO: RF1A      ] RF module configured (0dBm, 869.0MHz, 30b)
1547255185.484688,28,28,r,[INFO: Main      ] Starting Contiki-NG
1547255185.484688,28,28,r,[INFO: Main      ]  Net: nullnet
1547255185.484688,28,28,r,[INFO: Main      ]  MAC: nullmac
1547255185.484688,28,28,r,[INFO: Main      ] Link-layer address 0000.0000.0000.0000
1547255185.484688,28,28,r,[INFO: CC430     ] Node started. Node ID is set to 28. Platform DPP1
1547255185.385668,22,22,r,[INFO: CC430     ] MCU: CC430F5147, Reset Source: nRST, Compile date: Dec 10 2018
1547255185.450443,22,22,r,[INFO: RF1A      ] RF module configured (0dBm, 869.0MHz, 30b)
1547255185.450443,22,22,r,[INFO: Main      ] Starting Contiki-NG
1547255185.450443,22,22,r,[INFO: Main      ]  Net: nullnet
1547255185.450443,22,22,r,[INFO: Main      ]  MAC: nullmac
1547255185.450443,22,22,r,[INFO: Main      ] Link-layer address 0000.0000.0000.0000
1547255185.450443,22,22,r,[INFO: CC430     ] Node started. Node ID is set to 22. Platform DPP1
1547255198.461930,22,22,r,Pkt:22,1,56984
1547255198.498641,22,22,r,Pkt:22,2,18161
1547255198.498641,22,22,r,Pkt:22,3,53974
1547255198.498641,22,22,r,Pkt:22,4,10583
1547255198.498641,22,22,r,Pkt:22,5,19524
1547255198.498641,22,22,r,Pkt:22,6,24877
1547255198.498641,22,22,r,Pkt:22,7,18018
1547255198.498641,22,22,r,Pkt:22,8,1011
1547255198.498641,22,22,r,Pkt:22,9,59568
1547255198.498641,22,22,r,Pkt:22,10,58153
1547255198.498641,22,22,r,Pkt:22,11,26286
1547255198.498641,22,22,r,Pkt:22,12,60495
1547255198.498641,22,22,r,Pkt:22,13,57308
1547255198.498641,22,22,r,Pkt:22,14,35045
1547255198.498641,22,22,r,Pkt:22,15,16314
1547255198.498641,22,22,r,Pkt:22,16,65131
1547255198.498641,22,22,r,Pkt:22,17,7624
1547255198.498641,22,22,r,Pkt:22,18,52833
1547255198.498641,22,22,r,Pkt:22,19,40326
1547255198.498641,22,22,r,Pkt:22,20,5703
1547255198.498641,22,22,r,Pkt:22,21,20084
1547255198.498641,22,22,r,Pkt:22,22,61341
1547255198.498641,22,22,r,Pkt:22,23,3090
1547255198.498641,22,22,r,Pkt:22,24,53219
1547255198.498641,22,22,r,Pkt:22,25,56800
1547255198.498641,22,22,r,Pkt:22,26,59545
1547255198.498641,22,22,r,Pkt:22,27,55134
1547255198.498641,22,22,r,Pkt:22,28,34623
1547255198.623176,22,22,r,Pkt:22,29,63500
1547255198.623176,22,22,r,Pkt:22,30,30037
1547255198.623176,22,22,r,Pkt:22,31,2922
1547255198.623176,22,22,r,Pkt:22,32,22619
1547255198.623176,22,22,r,Pkt:22,33,35064
1547255198.623176,22,22,r,Pkt:22,34,4561
1547255198.623176,22,22,r,Pkt:22,35,29750
1547255198.623176,22,22,r,Pkt:22,36,7991
1547255198.623176,22,22,r,Pkt:22,37,15524
1547255198.623176,22,22,r,Pkt:22,38,64013
1547255198.623176,22,22,r,Pkt:22,39,40386
1547255198.623176,22,22,r,Pkt:22,40,30675
1547255198.623176,22,22,r,Pkt:22,41,32528
1547255198.623176,22,22,r,Pkt:22,42,10761
1547255198.623176,22,22,r,Pkt:22,43,54286
1547255198.623176,22,22,r,Pkt:22,44,48687
1547255198.623176,22,22,r,Pkt:22,45,31804
1547255198.623176,22,22,r,Pkt:22,46,24005
1547255198.623176,22,22,r,Pkt:22,47,8986
1547255198.623176,22,22,r,Pkt:22,48,3659
1547255198.623176,22,22,r,Pkt:22,49,8232
1547255198.623176,22,22,r,Pkt:22,50,4417
1547255198.623176,22,22,r,Pkt:22,51,22246
1547255198.623176,22,22,r,Pkt:22,52,17447
1547255198.623176,22,22,r,Pkt:22,53,5844
1547255198.623176,22,22,r,Pkt:22,54,32893
1547255198.623176,22,22,r,Pkt:22,55,64370
1547255198.623176,22,22,r,Pkt:22,56,64451
1547255198.623176,22,22,r,Pkt:22,57,52288
1547255198.623176,22,22,r,Pkt:22,58,42873
1547255198.623176,22,22,r,Pkt:22,59,23742
1547255198.623176,22,22,r,Pkt:22,60,37151
1547255198.623176,22,22,r,Pkt:22,61,27756
1547255198.623176,22,22,r,Pkt:22,62,16949
1547255198.623176,22,22,r,Pkt:22,63,34506
1547255198.623176,22,22,r,Pkt:22,64,8251
1547255198.623176,22,22,r,Pkt:22,65,58200
1547255198.623176,22,22,r,Pkt:22,66,52401
1547255198.623176,22,22,r,Pkt:22,67,17814
1547255198.623176,22,22,r,Pkt:22,68,34071
1547255198.623176,22,22,r,Pkt:22,69,56580
1547255198.623176,22,22,r,Pkt:22,70,33517
1547255198.623176,22,22,r,Pkt:22,71,9506
1547255198.623176,22,22,r,Pkt:22,72,23475
1547255198.623176,22,22,r,Pkt:22,73,50544
1547255198.623176,22,22,r,Pkt:22,74,24809
1547255198.623176,22,22,r,Pkt:22,75,29038
1547255198.623176,22,22,r,Pkt:22,76,15
1547255198.623176,22,22,r,Pkt:22,77,51356
1547255198.623176,22,22,r,Pkt:22,78,8869
1547255198.623176,22,22,r,Pkt:22,79,13946
1547255198.623176,22,22,r,Pkt:22,80,36395
1547255198.623176,22,22,r,Pkt:22,81,53896
1547255198.623176,22,22,r,Pkt:22,82,17441
1547255198.623176,22,22,r,Pkt:22,83,16454
1547255198.623176,22,22,r,Pkt:22,84,57863
1547255198.623176,22,22,r,Pkt:22,85,36660
1547255198.623176,22,22,r,Pkt:22,86,349
1547255198.623176,22,22,r,Pkt:22,87,6866
1547255198.623176,22,22,r,Pkt:22,88,38819
1547255198.623176,22,22,r,Pkt:22,89,27296
1547255198.623176,22,22,r,Pkt:22,90,22105
1547255198.623176,22,22,r,Pkt:22,91,4638
1547255198.623176,22,22,r,Pkt:22,92,2815
1547255198.623176,22,22,r,Pkt:22,93,37068
1547255198.623176,22,22,r,Pkt:22,94,65301
1547255198.623176,22,22,r,Pkt:22,95,12842
1547255198.623176,22,22,r,Pkt:22,96,22555
1547255198.623176,22,22,r,Pkt:22,97,60856
1547255198.623176,22,22,r,Pkt:22,98,30609
1547255198.623176,22,22,r,Pkt:22,99,18166
1547255198.623176,22,22,r,Pkt:22,100,23287
1547255198.623176,22,22,r,Pkt:22,101,11620
1547255198.623176,22,22,r,Pkt:22,102,64461
1547255198.623176,22,22,r,Pkt:22,103,56450
1547255198.623176,22,22,r,Pkt:22,104,44947
1547255198.623176,22,22,r,Pkt:22,105,48080
1547255198.623176,22,22,r,Pkt:22,106,34761
1547255198.623176,22,22,r,Pkt:22,107,16078
1547255198.623176,22,22,r,Pkt:22,108,45551
1547255198.623176,22,22,r,Pkt:22,109,50428
1547255198.623176,22,22,r,Pkt:22,110,55173
1547255198.881967,22,22,r,Pkt:22,111,31194
1547255198.881967,22,22,r,Pkt:22,112,32267
1547255198.881967,22,22,r,Pkt:22,113,13544
1547255198.881967,22,22,r,Pkt:22,114,26369
1547255198.881967,22,22,r,Pkt:22,115,22950
1547255198.881967,22,22,r,Pkt:22,116,61415
1547255198.881967,22,22,r,Pkt:22,117,46996
1547255198.881967,22,22,r,Pkt:22,118,29245
1547255198.881967,22,22,r,Pkt:22,119,27186
1547255198.881967,22,22,r,Pkt:22,120,41859
1547255198.881967,22,22,r,Pkt:22,121,47360
1547255198.881967,22,22,r,Pkt:22,122,62777
1547255198.881967,22,22,r,Pkt:22,123,63358
1547255198.881967,22,22,r,Pkt:22,124,62687
1547255198.881967,22,22,r,Pkt:22,125,25900
1547255198.881967,22,22,r,Pkt:22,126,44021
1547255198.881967,22,22,r,Pkt:22,127,3466
1547255198.881967,22,22,r,Pkt:22,128,65531
1547255198.881967,22,22,r,Pkt:22,129,43032
1547255198.881967,22,22,r,Pkt:22,130,4721
1547255198.881967,22,22,r,Pkt:22,131,30806
1547255198.881967,22,22,r,Pkt:22,132,41175
1547255198.881967,22,22,r,Pkt:22,133,11716
1547255198.881967,22,22,r,Pkt:22,134,25773
1547255198.881967,22,22,r,Pkt:22,135,50146
1547255198.881967,22,22,r,Pkt:22,136,29555
1547255198.881967,22,22,r,Pkt:22,137,25136
1547255198.881967,22,22,r,Pkt:22,138,40617
1547255198.881967,22,22,r,Pkt:22,139,15406
1547255198.881967,22,22,r,Pkt:22,140,54223
1547255198.881967,22,22,r,Pkt:22,141,29020
1547255198.881967,22,22,r,Pkt:22,142,31845
1547255198.881967,22,22,r,Pkt:22,143,60730
1547255198.881967,22,22,r,Pkt:22,144,56811
1547255198.881967,22,22,r,Pkt:22,145,18248
1547255198.881967,22,22,r,Pkt:22,146,31201
1547255198.881967,22,22,r,Pkt:22,147,41734
1547255198.881967,22,22,r,Pkt:22,148,28103
1547255198.881967,22,22,r,Pkt:22,149,36852
1547255198.881967,22,22,r,Pkt:22,150,54045
1547255198.881967,22,22,r,Pkt:22,151,59794
1547255198.881967,22,22,r,Pkt:22,152,8035
1547255198.881967,22,22,r,Pkt:22,153,46944
1547255198.881967,22,22,r,Pkt:22,154,33817
1547255198.881967,22,22,r,Pkt:22,155,3294
1547255198.881967,22,22,r,Pkt:22,156,20159
1547255198.881967,22,22,r,Pkt:22,157,59788
1547255198.881967,22,22,r,Pkt:22,158,18645
1547255198.881967,22,22,r,Pkt:22,159,6378
1547255198.881967,22,22,r,Pkt:22,160,6107
1547255198.881967,22,22,r,Pkt:22,161,4728
1547255198.881967,22,22,r,Pkt:22,162,40273
1547255198.881967,22,22,r,Pkt:22,163,55734
1547255198.881967,22,22,r,Pkt:22,164,22199
1547255198.881967,22,22,r,Pkt:22,165,56868
1547255198.881967,22,22,r,Pkt:22,166,48525
1547255198.881967,22,22,r,Pkt:22,167,56130
1547255198.881967,22,22,r,Pkt:22,168,42835
1547255198.881967,22,22,r,Pkt:22,169,47248
1547255198.881967,22,22,r,Pkt:22,170,42377
1547255198.881967,22,22,r,Pkt:22,171,27022
1547255198.881967,22,22,r,Pkt:22,172,26031
1547255198.881967,22,22,r,Pkt:22,173,52668
1547255198.881967,22,22,r,Pkt:22,174,4421
1547255198.881967,22,22,r,Pkt:22,175,37018
1547255198.881967,22,22,r,Pkt:22,176,44491
1547255198.881967,22,22,r,Pkt:22,177,2472
1547255198.881967,22,22,r,Pkt:22,178,31937
1547255198.881967,22,22,r,Pkt:22,179,7270
1547255198.881967,22,22,r,Pkt:22,180,23463
1547255198.881967,22,22,r,Pkt:22,181,6228
1547255198.881967,22,22,r,Pkt:22,182,9213
1547255198.881967,22,22,r,Pkt:22,183,39154
1547255198.881967,22,22,r,Pkt:22,184,2883
1547255198.881967,22,22,r,Pkt:22,185,26048
1547255198.881967,22,22,r,Pkt:22,186,761
1547255198.881967,22,22,r,Pkt:22,187,21054
1547255198.881967,22,22,r,Pkt:22,188,6303
1547255198.881967,22,22,r,Pkt:22,189,7660
1547255198.881967,22,22,r,Pkt:22,190,54709
1547255198.881967,22,22,r,Pkt:22,191,21578
1547255198.881967,22,22,r,Pkt:22,192,40891
1547255198.881967,22,22,r,Pkt:22,193,11480
1547255198.881967,22,22,r,Pkt:22,194,6193
1547255198.881967,22,22,r,Pkt:22,195,27414
1547255198.881967,22,22,r,Pkt:22,196,31895
1547255198.881967,22,22,r,Pkt:22,197,16004
1547255198.881967,22,22,r,Pkt:22,198,1645
1547255198.881967,22,22,r,Pkt:22,199,8866
1547255198.881967,22,22,r,Pkt:22,200,19251
1547255198.881967,22,22,r,Pkt:28,1,56984
1547255198.881967,22,22,r,Pkt:28,2,18161
1547255198.881967,22,22,r,Pkt:28,3,53974
1547255198.881967,22,22,r,Pkt:28,4,10583
1547255198.881967,22,22,r,Pkt:6,1,56984
1547255198.881967,22,22,r,Pkt:6,2,18161
1547255198.881967,22,22,r,Pkt:6,3,53974
1547255198.881967,22,22,r,Pkt:6,4,10583
1547255198.881967,22,22,r,Pkt:6,5,19524
1547255198.881967,22,22,r,Pkt:6,6,24877
1547255198.881967,22,22,r,Pkt:6,7,18018
1547255198.881967,22,22,r,Pkt:6,8,1011
1547255199.145071,22,22,r,Pkt:6,9,59568
1547255199.145071,22,22,r,Pkt:6,10,58153
1547255199.145071,22,22,r,Pkt:6,11,26286
1547255199.145071,22,22,r,Pkt:6,12,60495
1547255199.145071,22,22,r,Pkt:6,13,57308
1547255199.145071,22,22,r,Pkt:6,14,35045
1547255199.145071,22,22,r,Pkt:6,15,16314
1547255199.145071,22,22,r,Pkt:6,16,65131
1547255199.145071,22,22,r,Pkt:28,5,19524
1547255199.145071,22,22,r,Pkt:28,6,24877
1547255199.145071,22,22,r,Pkt:28,7,18018
1547255199.145071,22,22,r,Pkt:28,8,1011
1547255199.145071,22,22,r,Pkt:6,17,7624
1547255199.145071,22,22,r,Pkt:6,18,52833
1547255199.145071,22,22,r,Pkt:6,19,40326
1547255199.145071,22,22,r,Pkt:6,20,5703
1547255199.145071,22,22,r,Pkt:28,9,59568
1547255199.145071,22,22,r,Pkt:28,10,58153
1547255199.145071,22,22,r,Pkt:28,11,26286
1547255199.145071,22,22,r,Pkt:28,12,60495
1547255199.223978,22,22,r,Pkt:6,21,20084
1547255199.223978,22,22,r,Pkt:6,22,61341
1547255199.223978,22,22,r,Pkt:6,23,3090
1547255199.223978,22,22,r,Pkt:6,24,53219
1547255199.223978,22,22,r,Pkt:28,13,57308
1547255199.223978,22,22,r,Pkt:28,14,35045
1547255199.223978,22,22,r,Pkt:28,15,16314
1547255199.223978,22,22,r,Pkt:28,16,65131
1547255199.223978,22,22,r,Pkt:6,25,56800
1547255199.223978,22,22,r,Pkt:6,26,59545
1547255199.223978,22,22,r,Pkt:6,27,55134
1547255199.223978,22,22,r,Pkt:6,28,34623
1547255199.304727,22,22,r,Pkt:6,29,63500
1547255199.304727,22,22,r,Pkt:6,30,30037
1547255199.304727,22,22,r,Pkt:6,31,2922
1547255199.304727,22,22,r,Pkt:6,32,22619
1547255199.304727,22,22,r,Pkt:28,17,7624
1547255199.304727,22,22,r,Pkt:28,18,52833
1547255199.304727,22,22,r,Pkt:28,19,40326
1547255199.304727,22,22,r,Pkt:28,20,5703
1547255199.304727,22,22,r,Pkt:6,33,35064
1547255199.304727,22,22,r,Pkt:6,34,4561
1547255199.304727,22,22,r,Pkt:6,35,29750
1547255199.304727,22,22,r,Pkt:6,36,7991
1547255199.373517,22,22,r,Pkt:6,33,35064
1547255199.373517,22,22,r,Pkt:6,34,4561
1547255199.373517,22,22,r,Pkt:6,35,29750
1547255199.373517,22,22,r,Pkt:6,36,7991
1547255199.373517,22,22,r,Pkt:6,33,35064
1547255199.373517,22,22,r,Pkt:6,34,4561
1547255199.373517,22,22,r,Pkt:6,35,29750
1547255199.373517,22,22,r,Pkt:6,36,7991
1547255199.373517,22,22,r,Pkt:6,37,15524
1547255199.373517,22,22,r,Pkt:6,38,64013
1547255199.373517,22,22,r,Pkt:6,39,40386
1547255199.373517,22,22,r,Pkt:6,40,30675
1547255199.434755,22,22,r,Pkt:6,41,32528
1547255199.434755,22,22,r,Pkt:6,42,10761
1547255199.434755,22,22,r,Pkt:6,43,54286
1547255199.434755,22,22,r,Pkt:6,44,48687
1547255199.434755,22,22,r,Pkt:6,45,31804
1547255199.434755,22,22,r,Pkt:6,46,24005
1547255199.434755,22,22,r,Pkt:6,47,8986
1547255199.434755,22,22,r,Pkt:6,48,3659
1547255199.434755,22,22,r,Pkt:6,45,31804
1547255199.434755,22,22,r,Pkt:6,46,24005
1547255199.434755,22,22,r,Pkt:6,47,8986
1547255199.434755,22,22,r,Pkt:6,48,3659
1547255199.504035,22,22,r,Pkt:6,49,8232
1547255199.504035,22,22,r,Pkt:6,50,4417
1547255199.504035,22,22,r,Pkt:6,51,22246
1547255199.504035,22,22,r,Pkt:6,52,17447
1547255199.544743,22,22,r,Pkt:28,21,20084
1547255199.544743,22,22,r,Pkt:28,22,61341
1547255199.544743,22,22,r,Pkt:28,23,3090
1547255199.544743,22,22,r,Pkt:28,24,53219
1547255199.612226,22,22,r,Pkt:6,53,5844
1547255199.612226,22,22,r,Pkt:6,54,32893
1547255199.660593,22,22,r,Pkt:6,55,64370
1547255199.660593,22,22,r,Pkt:6,56,64451
1547255199.660593,22,22,r,Pkt:6,57,52288
1547255199.660593,22,22,r,Pkt:6,58,42873
1547255199.660593,22,22,r,Pkt:6,59,23742
1547255199.660593,22,22,r,Pkt:6,60,37151
1547255199.708154,22,22,r,Pkt:6,57,52288
1547255199.708154,22,22,r,Pkt:6,58,42873
1547255199.708154,22,22,r,Pkt:6,59,23742
1547255199.708154,22,22,r,Pkt:6,60,37151
1547255199.708154,22,22,r,Pkt:28,25,56800
1547255199.708154,22,22,r,Pkt:28,26,59545
1547255199.708154,22,22,r,Pkt:28,27,55134
1547255199.708154,22,22,r,Pkt:28,28,34623
1547255199.765034,22,22,r,Pkt:6,61,27756
1547255199.765034,22,22,r,Pkt:6,62,16949
1547255199.765034,22,22,r,Pkt:6,63,34506
1547255199.765034,22,22,r,Pkt:6,64,8251
1547255199.851785,22,22,r,Pkt:28,29,63500
1547255199.851785,22,22,r,Pkt:28,30,30037
1547255199.851785,22,22,r,Pkt:28,31,2922
1547255199.851785,22,22,r,Pkt:28,32,22619
1547255199.892184,22,22,r,Pkt:6,65,58200
1547255199.892184,22,22,r,Pkt:6,66,52401
1547255199.892184,22,22,r,Pkt:6,67,17814
1547255199.934628,22,22,r,Pkt:6,68,34071
1547255199.934628,22,22,r,Pkt:6,69,56580
1547255199.934628,22,22,r,Pkt:6,70,33517
1547255199.934628,22,22,r,Pkt:6,71,9506
1547255199.934628,22,22,r,Pkt:6,72,23475
1547255199.934628,22,22,r,Pkt:6,73,50544
1547255199.934628,22,22,r,Pkt:6,74,24809
1547255199.934628,22,22,r,Pkt:6,75,29038
1547255199.934628,22,22,r,Pkt:6,76,15
1547255199.990890,22,22,r,Pkt:6,77,51356
1547255199.990890,22,22,r,Pkt:6,78,8869
1547255199.990890,22,22,r,Pkt:6,79,13946
1547255199.990890,22,22,r,Pkt:6,80,36395
1547255199.990890,22,22,r,Pkt:6,81,53896
1547255200.046477,22,22,r,Pkt:6,82,17441
1547255200.046477,22,22,r,Pkt:6,83,16454
1547255200.046477,22,22,r,Pkt:6,84,57863
1547255200.046477,22,22,r,Pkt:6,85,36660
1547255200.046477,22,22,r,Pkt:6,86,349
1547255200.046477,22,22,r,Pkt:6,87,6866
1547255200.046477,22,22,r,Pkt:6,88,38819
1547255200.046477,22,22,r,Pkt:6,89,27296
1547255200.046477,22,22,r,Pkt:6,90,22105
1547255200.046477,22,22,r,Pkt:6,91,4638
1547255200.100956,22,22,r,Pkt:6,92,2815
1547255200.100956,22,22,r,Pkt:28,33,35064
1547255200.100956,22,22,r,Pkt:28,34,4561
1547255200.100956,22,22,r,Pkt:28,35,29750
1547255200.100956,22,22,r,Pkt:28,36,7991
1547255200.146760,22,22,r,Pkt:6,93,37068
1547255200.146760,22,22,r,Pkt:6,94,65301
1547255200.146760,22,22,r,Pkt:6,95,12842
1547255200.146760,22,22,r,Pkt:6,96,22555
1547255200.146760,22,22,r,Pkt:6,97,60856
1547255200.146760,22,22,r,Pkt:6,98,30609
1547255200.146760,22,22,r,Pkt:6,99,18166
1547255200.146760,22,22,r,Pkt:6,100,23287
1547255200.146760,22,22,r,Pkt:6,97,60856
1547255200.216037,22,22,r,Pkt:6,98,30609
1547255200.216037,22,22,r,Pkt:6,99,18166
1547255200.216037,22,22,r,Pkt:6,100,23287
1547255200.216037,22,22,r,Pkt:6,101,11620
1547255200.216037,22,22,r,Pkt:6,102,64461
1547255200.216037,22,22,r,Pkt:6,103,56450
1547255200.216037,22,22,r,Pkt:6,104,44947
1547255200.216037,22,22,r,Pkt:6,105,48080
1547255200.216037,22,22,r,Pkt:6,106,34761
1547255200.216037,22,22,r,Pkt:6,107,16078
1547255200.216037,22,22,r,Pkt:6,108,45551
1547255200.287802,22,22,r,Pkt:28,37,15524
1547255200.287802,22,22,r,Pkt:28,38,64013
1547255200.287802,22,22,r,Pkt:28,39,40386
1547255200.287802,22,22,r,Pkt:28,40,30675
1547255200.287802,22,22,r,Pkt:6,109,50428
1547255200.287802,22,22,r,Pkt:6,110,55173
1547255200.287802,22,22,r,Pkt:6,111,31194
1547255200.287802,22,22,r,Pkt:6,112,32267
1547255200.287802,22,22,r,Pkt:6,113,13544
1547255200.287802,22,22,r,Pkt:6,114,26369
1547255200.287802,22,22,r,Pkt:6,115,22950
1547255200.287802,22,22,r,Pkt:6,116,61415
1547255200.287802,22,22,r,Pkt:6,117,46996
1547255200.287802,22,22,r,Pkt:6,118,29245
1547255200.287802,22,22,r,Pkt:6,119,27186
1547255200.287802,22,22,r,Pkt:6,120,41859
1547255200.370212,22,22,r,Pkt:16,1,56984
1547255200.370212,22,22,r,Pkt:16,2,18161
1547255200.370212,22,22,r,Pkt:16,3,53974
1547255200.370212,22,22,r,Pkt:16,4,10583
1547255200.370212,22,22,r,Pkt:16,5,19524
1547255200.370212,22,22,r,Pkt:16,6,24877
1547255200.370212,22,22,r,Pkt:16,7,18018
1547255200.370212,22,22,r,Pkt:16,8,1011
1547255200.370212,22,22,r,Pkt:28,41,32528
1547255200.370212,22,22,r,Pkt:28,42,10761
1547255200.370212,22,22,r,Pkt:28,43,54286
1547255200.370212,22,22,r,Pkt:28,44,48687
1547255200.370212,22,22,r,Pkt:16,5,19524
1547255200.370212,22,22,r,Pkt:16,6,24877
1547255200.370212,22,22,r,Pkt:16,7,18018
1547255200.370212,22,22,r,Pkt:16,8,1011
1547255200.608711,22,22,r,Pkt:16,9,59568
1547255200.608711,22,22,r,Pkt:16,10,58153
1547255200.608711,22,22,r,Pkt:16,11,26286
1547255200.608711,22,22,r,Pkt:16,12,60495
1547255200.608711,22,22,r,Pkt:3,1,56984
1547255200.608711,22,22,r,Pkt:3,2,18161
1547255200.608711,22,22,r,Pkt:3,3,53974
1547255200.608711,22,22,r,Pkt:3,4,10583
1547255200.608711,22,22,r,Pkt:3,1,56984
1547255200.608711,22,22,r,Pkt:3,2,18161
1547255200.608711,22,22,r,Pkt:3,3,53974
1547255200.608711,22,22,r,Pkt:3,4,10583
1547255200.608711,22,22,r,Pkt:16,13,57308
1547255200.608711,22,22,r,Pkt:16,14,35045
1547255200.608711,22,22,r,Pkt:16,15,16314
1547255200.608711,22,22,r,Pkt:16,16,65131
1547255200.608711,22,22,r,Pkt:3,1,56984
1547255200.608711,22,22,r,Pkt:3,2,18161
1547255200.608711,22,22,r,Pkt:3,3,53974
1547255200.608711,22,22,r,Pkt:3,4,10583
1547255200.608711,22,22,r,Pkt:16,17,7624
1547255200.608711,22,22,r,Pkt:16,18,52833
1547255200.608711,22,22,r,Pkt:16,19,40326
1547255200.608711,22,22,r,Pkt:16,20,5703
1547255200.608711,22,22,r,Pkt:3,1,56984
1547255200.608711,22,22,r,Pkt:3,2,18161
1547255200.608711,22,22,r,Pkt:3,3,53974
1547255200.608711,22,22,r,Pkt:3,4,10583
1547255200.608711,22,22,r,Pkt:16,21,20084
1547255200.608711,22,22,r,Pkt:16,22,61341
1547255200.608711,22,22,r,Pkt:16,23,3090
1547255200.608711,22,22,r,Pkt:16,24,53219
1547255200.608711,22,22,r,Pkt:16,25,56800
1547255200.608711,22,22,r,Pkt:16,26,59545
1547255200.608711,22,22,r,Pkt:16,27,55134
1547255200.608711,22,22,r,Pkt:16,28,34623
1547255200.912607,22,22,r,Pkt:16,29,63500
1547255200.912607,22,22,r,Pkt:16,30,30037
1547255200.912607,22,22,r,Pkt:16,31,2922
1547255200.912607,22,22,r,Pkt:16,32,22619
1547255200.912607,22,22,r,Pkt:28,45,31804
1547255200.912607,22,22,r,Pkt:28,46,24005
1547255200.912607,22,22,r,Pkt:28,47,8986
1547255200.912607,22,22,r,Pkt:28,48,3659
1547255200.912607,22,22,r,Pkt:3,1,56984
1547255200.912607,22,22,r,Pkt:3,2,18161
1547255200.912607,22,22,r,Pkt:3,3,53974
1547255200.912607,22,22,r,Pkt:3,4,10583
1547255200.912607,22,22,r,Pkt:16,33,35064
1547255200.912607,22,22,r,Pkt:16,34,4561
1547255200.912607,22,22,r,Pkt:16,35,29750
1547255200.912607,22,22,r,Pkt:16,36,7991
1547255200.912607,22,22,r,Pkt:28,49,8232
1547255200.912607,22,22,r,Pkt:28,50,4417
1547255200.912607,22,22,r,Pkt:28,51,22246
1547255200.912607,22,22,r,Pkt:28,52,17447
1547255200.912607,22,22,r,Pkt:16,33,35064
1547255200.912607,22,22,r,Pkt:16,34,4561
1547255200.912607,22,22,r,Pkt:16,35,29750
1547255200.912607,22,22,r,Pkt:16,36,7991
1547255200.912607,22,22,r,Pkt:16,37,15524
1547255200.912607,22,22,r,Pkt:16,38,64013
1547255200.912607,22,22,r,Pkt:16,39,40386
1547255200.912607,22,22,r,Pkt:16,40,30675
1547255200.912607,22,22,r,Pkt:16,41,32528
1547255200.912607,22,22,r,Pkt:16,42,10761
1547255200.912607,22,22,r,Pkt:16,43,54286
1547255200.912607,22,22,r,Pkt:16,44,48687
1547255200.912607,22,22,r,Pkt:16,45,31804
1547255200.912607,22,22,r,Pkt:16,46,24005
1547255200.912607,22,22,r,Pkt:16,47,8986
1547255200.912607,22,22,r,Pkt:16,48,3659
1547255200.912607,22,22,r,Pkt:16,49,8232
1547255200.912607,22,22,r,Pkt:16,50,4417
1547255200.912607,22,22,r,Pkt:16,51,22246
1547255201.042145,22,22,r,Pkt:16,52,17447
1547255201.042145,22,22,r,Pkt:16,53,5844
1547255201.042145,22,22,r,Pkt:16,54,32893
1547255201.042145,22,22,r,Pkt:16,55,64370
1547255201.042145,22,22,r,Pkt:16,56,64451
1547255201.042145,22,22,r,Pkt:16,57,52288
1547255201.042145,22,22,r,Pkt:16,58,42873
1547255201.042145,22,22,r,Pkt:16,59,23742
1547255201.042145,22,22,r,Pkt:16,60,37151
1547255201.042145,22,22,r,Pkt:28,53,5844
1547255201.042145,22,22,r,Pkt:28,54,32893
1547255201.042145,22,22,r,Pkt:28,55,64370
1547255201.042145,22,22,r,Pkt:28,56,64451
1547255201.042145,22,22,r,Pkt:16,61,27756
1547255201.042145,22,22,r,Pkt:16,62,16949
1547255201.042145,22,22,r,Pkt:16,63,34506
1547255201.042145,22,22,r,Pkt:16,64,8251
1547255201.115545,22,22,r,Pkt:16,65,58200
1547255201.115545,22,22,r,Pkt:16,66,52401
1547255201.115545,22,22,r,Pkt:16,67,17814
1547255201.115545,22,22,r,Pkt:16,68,34071
1547255201.161573,22,22,r,Pkt:16,69,56580
1547255201.161573,22,22,r,Pkt:16,70,33517
1547255201.161573,22,22,r,Pkt:16,71,9506
1547255201.161573,22,22,r,Pkt:16,72,23475
1547255201.203267,22,22,r,Pkt:16,73,50544
1547255201.203267,22,22,r,Pkt:16,74,24809
1547255201.203267,22,22,r,Pkt:16,75,29038
1547255201.203267,22,22,r,Pkt:16,76,15
1547255201.254173,22,22,r,Pkt:16,77,51356
1547255201.254173,22,22,r,Pkt:16,78,8869
1547255201.254173,22,22,r,Pkt:16,79,13946
1547255201.254173,22,22,r,Pkt:16,80,36395
1547255201.303560,22,22,r,Pkt:16,81,53896
1547255201.303560,22,22,r,Pkt:16,82,17441
1547255201.303560,22,22,r,Pkt:16,83,16454
1547255201.303560,22,22,r,Pkt:16,84,57863
1547255201.303560,22,22,r,Pkt:16,85,36660
1547255201.303560,22,22,r,Pkt:16,86,349
1547255201.303560,22,22,r,Pkt:16,87,6866
1547255201.303560,22,22,r,Pkt:16,88,38819
1547255201.359611,22,22,r,Pkt:16,89,27296
1547255201.359611,22,22,r,Pkt:16,90,22105
1547255201.359611,22,22,r,Pkt:16,91,4638
1547255201.359611,22,22,r,Pkt:16,92,2815
1547255201.398241,22,22,r,Pkt:16,93,37068
1547255201.398241,22,22,r,Pkt:16,94,65301
1547255201.398241,22,22,r,Pkt:16,95,12842
1547255201.398241,22,22,r,Pkt:16,96,22555
1547255201.398241,22,22,r,Pkt:16,97,60856
1547255201.398241,22,22,r,Pkt:16,98,30609
1547255201.398241,22,22,r,Pkt:16,99,18166
1547255201.398241,22,22,r,Pkt:16,100,23287
1547255201.454175,22,22,r,Pkt:16,101,11620
1547255201.454175,22,22,r,Pkt:16,102,64461
1547255201.454175,22,22,r,Pkt:16,103,56450
1547255201.454175,22,22,r,Pkt:16,104,44947
1547255201.454175,22,22,r,Pkt:16,105,48080
1547255201.454175,22,22,r,Pkt:16,106,34761
1547255201.454175,22,22,r,Pkt:16,107,16078
1547255201.454175,22,22,r,Pkt:16,108,45551
1547255201.498121,22,22,r,Pkt:16,109,50428
1547255201.498121,22,22,r,Pkt:16,110,55173
1547255201.498121,22,22,r,Pkt:16,111,31194
1547255201.498121,22,22,r,Pkt:16,112,32267
1547255201.552620,22,22,r,Pkt:16,113,13544
1547255201.552620,22,22,r,Pkt:16,114,26369
1547255201.552620,22,22,r,Pkt:16,115,22950
1547255201.552620,22,22,r,Pkt:16,116,61415
1547255201.601939,22,22,r,Pkt:16,117,46996
1547255201.601939,22,22,r,Pkt:16,118,29245
1547255201.601939,22,22,r,Pkt:16,119,27186
1547255201.601939,22,22,r,Pkt:16,120,41859
1547255201.601939,22,22,r,Pkt:16,121,47360
1547255201.601939,22,22,r,Pkt:16,122,62777
1547255201.601939,22,22,r,Pkt:16,123,63358
1547255201.601939,22,22,r,Pkt:16,124,62687
1547255201.601939,22,22,r,Pkt:16,125,25900
1547255201.601939,22,22,r,Pkt:16,126,44021
1547255201.601939,22,22,r,Pkt:16,127,3466
1547255201.601939,22,22,r,Pkt:16,128,65531
1547255201.664196,22,22,r,Pkt:18,1,56984
1547255201.664196,22,22,r,Pkt:18,2,18161
1547255201.664196,22,22,r,Pkt:18,3,53974
1547255201.664196,22,22,r,Pkt:18,4,10583
1547255201.664196,22,22,r,Pkt:16,129,43032
1547255201.664196,22,22,r,Pkt:16,130,4721
1547255201.664196,22,22,r,Pkt:16,131,30806
1547255201.664196,22,22,r,Pkt:16,132,41175
1547255201.664196,22,22,r,Pkt:28,57,52288
1547255201.664196,22,22,r,Pkt:28,58,42873
1547255201.664196,22,22,r,Pkt:28,59,23742
1547255201.664196,22,22,r,Pkt:28,60,37151
1547255201.732994,22,22,r,Pkt:16,133,11716
1547255201.732994,22,22,r,Pkt:16,134,25773
1547255201.732994,22,22,r,Pkt:16,135,50146
1547255201.732994,22,22,r,Pkt:16,136,29555
1547255201.732994,22,22,r,Pkt:16,137,25136
1547255201.732994,22,22,r,Pkt:16,138,40617
1547255201.732994,22,22,r,Pkt:16,139,15406
1547255201.732994,22,22,r,Pkt:16,140,54223
1547255201.790925,22,22,r,Pkt:16,141,29020
1547255201.790925,22,22,r,Pkt:16,142,31845
1547255201.790925,22,22,r,Pkt:16,143,60730
1547255201.790925,22,22,r,Pkt:16,144,56811
1547255201.790925,22,22,r,Pkt:28,61,27756
1547255201.790925,22,22,r,Pkt:28,62,16949
1547255201.790925,22,22,r,Pkt:28,63,34506
1547255201.790925,22,22,r,Pkt:28,64,8251
1547255201.856606,22,22,r,Pkt:16,145,18248
1547255201.856606,22,22,r,Pkt:16,146,31201
1547255201.856606,22,22,r,Pkt:16,147,41734
1547255201.856606,22,22,r,Pkt:16,148,28103
1547255201.856606,22,22,r,Pkt:16,149,36852
1547255201.856606,22,22,r,Pkt:16,150,54045
1547255201.856606,22,22,r,Pkt:16,151,59794
1547255201.856606,22,22,r,Pkt:16,152,8035
1547255201.856606,22,22,r,Pkt:16,153,46944
1547255201.856606,22,22,r,Pkt:16,154,33817
1547255201.856606,22,22,r,Pkt:16,155,3294
1547255201.856606,22,22,r,Pkt:16,156,20159
1547255201.917872,22,22,r,Pkt:16,157,59788
1547255201.917872,22,22,r,Pkt:16,158,18645
1547255201.917872,22,22,r,Pkt:16,159,6378
1547255201.917872,22,22,r,Pkt:16,160,6107
1547255201.917872,22,22,r,Pkt:16,161,4728
1547255201.917872,22,22,r,Pkt:16,162,40273
1547255201.917872,22,22,r,Pkt:16,163,55734
1547255201.917872,22,22,r,Pkt:16,164,22199
1547255201.992146,22,22,r,Pkt:16,165,56868
1547255201.992146,22,22,r,Pkt:16,166,48525
1547255201.992146,22,22,r,Pkt:16,167,56130
1547255201.992146,22,22,r,Pkt:16,168,42835
1547255201.992146,22,22,r,Pkt:16,165,56868
1547255201.992146,22,22,r,Pkt:16,166,48525
1547255201.992146,22,22,r,Pkt:16,167,56130
1547255201.992146,22,22,r,Pkt:16,168,42835
1547255202.041069,22,22,r,Pkt:28,65,58200
1547255202.041069,22,22,r,Pkt:28,66,52401
1547255202.041069,22,22,r,Pkt:28,67,17814
1547255202.041069,22,22,r,Pkt:28,68,34071
1547255202.041069,22,22,r,Pkt:16,169,47248
1547255202.041069,22,22,r,Pkt:16,170,42377
1547255202.041069,22,22,r,Pkt:16,171,27022
1547255202.041069,22,22,r,Pkt:16,172,26031
1547255202.104186,22,22,r,Pkt:18,5,19524
1547255202.104186,22,22,r,Pkt:18,6,24877
1547255202.104186,22,22,r,Pkt:18,7,18018
1547255202.104186,22,22,r,Pkt:18,8,1011
1547255202.104186,22,22,r,Pkt:18,9,59568
1547255202.104186,22,22,r,Pkt:18,10,58153
1547255202.104186,22,22,r,Pkt:18,11,26286
1547255202.104186,22,22,r,Pkt:18,12,60495
1547255202.164946,22,22,r,Pkt:3,5,19524
1547255202.164946,22,22,r,Pkt:3,6,24877
1547255202.164946,22,22,r,Pkt:3,7,18018
1547255202.164946,22,22,r,Pkt:3,8,1011
1547255202.222620,22,22,r,Pkt:16,173,52668
1547255202.222620,22,22,r,Pkt:16,174,4421
1547255202.222620,22,22,r,Pkt:16,175,37018
1547255202.222620,22,22,r,Pkt:16,176,44491
1547255202.271806,22,22,r,Pkt:16,173,52668
1547255202.271806,22,22,r,Pkt:16,174,4421
1547255202.271806,22,22,r,Pkt:16,175,37018
1547255202.271806,22,22,r,Pkt:16,176,44491
1547255202.271806,22,22,r,Pkt:16,177,2472
1547255202.271806,22,22,r,Pkt:16,178,31937
1547255202.271806,22,22,r,Pkt:16,179,7270
1547255202.271806,22,22,r,Pkt:16,180,23463
1547255202.271806,22,22,r,Pkt:28,69,56580
1547255202.271806,22,22,r,Pkt:28,70,33517
1547255202.271806,22,22,r,Pkt:28,71,9506
1547255202.271806,22,22,r,Pkt:28,72,23475
1547255202.323674,22,22,r,Pkt:16,181,6228
1547255202.323674,22,22,r,Pkt:16,182,9213
1547255202.323674,22,22,r,Pkt:16,183,39154
1547255202.323674,22,22,r,Pkt:16,184,2883
1547255202.374525,22,22,r,Pkt:16,185,26048
1547255202.374525,22,22,r,Pkt:16,186,761
1547255202.374525,22,22,r,Pkt:16,187,21054
1547255202.374525,22,22,r,Pkt:16,188,6303
1547255202.374525,22,22,r,Pkt:28,73,50544
1547255202.374525,22,22,r,Pkt:28,74,24809
1547255202.374525,22,22,r,Pkt:28,75,29038
1547255202.374525,22,22,r,Pkt:28,76,15
1547255202.452632,22,22,r,Pkt:16,189,7660
1547255202.452632,22,22,r,Pkt:16,190,54709
1547255202.452632,22,22,r,Pkt:16,191,21578
1547255202.452632,22,22,r,Pkt:16,192,40891
1547255202.452632,22,22,r,Pkt:16,193,11480
1547255202.452632,22,22,r,Pkt:16,194,6193
1547255202.452632,22,22,r,Pkt:16,195,27414
1547255202.452632,22,22,r,Pkt:16,196,31895
1547255202.504797,22,22,r,Pkt:28,77,51356
1547255202.504797,22,22,r,Pkt:28,78,8869
1547255202.504797,22,22,r,Pkt:28,79,13946
1547255202.504797,22,22,r,Pkt:28,80,36395
1547255202.504797,22,22,r,Pkt:16,193,11480
1547255202.504797,22,22,r,Pkt:16,194,6193
1547255202.504797,22,22,r,Pkt:16,195,27414
1547255202.504797,22,22,r,Pkt:16,196,31895
1547255202.571715,22,22,r,Pkt:28,81,53896
1547255202.571715,22,22,r,Pkt:28,82,17441
1547255202.571715,22,22,r,Pkt:28,83,16454
1547255202.571715,22,22,r,Pkt:28,84,57863
1547255202.571715,22,22,r,Pkt:18,13,57308
1547255202.571715,22,22,r,Pkt:18,14,35045
1547255202.571715,22,22,r,Pkt:18,15,16314
1547255202.571715,22,22,r,Pkt:18,16,65131
1547255202.632885,22,22,r,Pkt:16,197,16004
1547255202.632885,22,22,r,Pkt:16,198,1645
1547255202.632885,22,22,r,Pkt:16,199,8866
1547255202.632885,22,22,r,Pkt:16,200,19251
1547255202.632885,22,22,r,Pkt:18,17,7624
1547255202.681812,22,22,r,Pkt:18,18,52833
1547255202.681812,22,22,r,Pkt:18,19,40326
1547255202.681812,22,22,r,Pkt:18,20,5703
1547255202.681812,22,22,r,Pkt:28,85,36660
1547255202.681812,22,22,r,Pkt:28,86,349
1547255202.681812,22,22,r,Pkt:28,87,6866
1547255202.681812,22,22,r,Pkt:28,88,38819
1547255202.681812,22,22,r,Pkt:18,17,7624
1547255202.681812,22,22,r,Pkt:18,18,52833
1547255202.681812,22,22,r,Pkt:18,19,40326
1547255202.681812,22,22,r,Pkt:18,20,5703
1547255202.756042,22,22,r,Pkt:18,21,20084
1547255202.756042,22,22,r,Pkt:18,22,61341
1547255202.756042,22,22,r,Pkt:18,23,3090
1547255202.756042,22,22,r,Pkt:18,24,53219
1547255202.756042,22,22,r,Pkt:18,25,56800
1547255202.756042,22,22,r,Pkt:18,26,59545
1547255202.756042,22,22,r,Pkt:18,27,55134
1547255202.756042,22,22,r,Pkt:18,28,34623
1547255202.756042,22,22,r,Pkt:28,89,27296
1547255202.756042,22,22,r,Pkt:28,90,22105
1547255202.756042,22,22,r,Pkt:28,91,4638
1547255202.756042,22,22,r,Pkt:28,92,2815
1547255202.828690,22,22,r,Pkt:18,29,63500
1547255202.828690,22,22,r,Pkt:18,30,30037
1547255202.828690,22,22,r,Pkt:18,31,2922
1547255202.828690,22,22,r,Pkt:18,32,22619
1547255202.868038,22,22,r,Pkt:18,33,35064
1547255202.868038,22,22,r,Pkt:18,34,4561
1547255202.868038,22,22,r,Pkt:18,35,29750
1547255202.868038,22,22,r,Pkt:18,36,7991
1547255202.868038,22,22,r,Pkt:18,37,15524
1547255202.868038,22,22,r,Pkt:18,38,64013
1547255202.868038,22,22,r,Pkt:18,39,40386
1547255202.868038,22,22,r,Pkt:18,40,30675
1547255202.868038,22,22,r,Pkt:18,41,32528
1547255202.868038,22,22,r,Pkt:18,42,10761
1547255202.942642,22,22,r,Pkt:18,43,54286
1547255202.942642,22,22,r,Pkt:18,44,48687
1547255202.942642,22,22,r,Pkt:28,93,37068
1547255202.942642,22,22,r,Pkt:28,94,65301
1547255202.942642,22,22,r,Pkt:28,95,12842
1547255202.942642,22,22,r,Pkt:28,96,22555
1547255202.978240,22,22,r,Pkt:18,45,31804
1547255202.978240,22,22,r,Pkt:18,46,24005
1547255202.978240,22,22,r,Pkt:18,47,8986
1547255202.978240,22,22,r,Pkt:18,48,3659
1547255202.978240,22,22,r,Pkt:18,49,8232
1547255202.978240,22,22,r,Pkt:18,50,4417
1547255202.978240,22,22,r,Pkt:18,51,22246
1547255202.978240,22,22,r,Pkt:18,52,17447
1547255203.045830,22,22,r,Pkt:18,53,5844
1547255203.045830,22,22,r,Pkt:18,54,32893
1547255203.045830,22,22,r,Pkt:18,55,64370
1547255203.045830,22,22,r,Pkt:18,56,64451
1547255203.045830,22,22,r,Pkt:18,57,52288
1547255203.045830,22,22,r,Pkt:18,58,42873
1547255203.045830,22,22,r,Pkt:18,59,23742
1547255203.045830,22,22,r,Pkt:18,60,37151
1547255203.099594,22,22,r,Pkt:28,97,60856
1547255203.099594,22,22,r,Pkt:28,98,30609
1547255203.099594,22,22,r,Pkt:28,99,18166
1547255203.099594,22,22,r,Pkt:28,100,23287
1547255203.099594,22,22,r,Pkt:18,61,27756
1547255203.099594,22,22,r,Pkt:18,62,16949
1547255203.099594,22,22,r,Pkt:18,63,34506
1547255203.099594,22,22,r,Pkt:18,64,8251
1547255203.099594,22,22,r,Pkt:6,121,47360
1547255203.099594,22,22,r,Pkt:6,122,62777
1547255203.099594,22,22,r,Pkt:6,123,63358
1547255203.099594,22,22,r,Pkt:6,124,62687
1547255203.172087,22,22,r,Pkt:6,125,25900
1547255203.172087,22,22,r,Pkt:6,126,44021
1547255203.172087,22,22,r,Pkt:6,127,3466
1547255203.172087,22,22,r,Pkt:6,128,65531
1547255203.214263,22,22,r,Pkt:28,101,11620
1547255203.214263,22,22,r,Pkt:28,102,64461
1547255203.214263,22,22,r,Pkt:28,103,56450
1547255203.214263,22,22,r,Pkt:28,104,44947
1547255203.214263,22,22,r,Pkt:6,129,43032
1547255203.214263,22,22,r,Pkt:6,130,4721
1547255203.214263,22,22,r,Pkt:6,131,30806
1547255203.214263,22,22,r,Pkt:6,132,41175
1547255203.267815,22,22,r,Pkt:6,133,11716
1547255203.267815,22,22,r,Pkt:6,134,25773
1547255203.267815,22,22,r,Pkt:6,135,50146
1547255203.267815,22,22,r,Pkt:6,136,29555
1547255203.267815,22,22,r,Pkt:6,137,25136
1547255203.309878,22,22,r,Pkt:6,138,40617
1547255203.309878,22,22,r,Pkt:6,139,15406
1547255203.309878,22,22,r,Pkt:6,140,54223
1547255203.309878,22,22,r,Pkt:28,105,48080
1547255203.309878,22,22,r,Pkt:28,106,34761
1547255203.309878,22,22,r,Pkt:28,107,16078
1547255203.309878,22,22,r,Pkt:28,108,45551
1547255203.362226,22,22,r,Pkt:6,141,29020
1547255203.362226,22,22,r,Pkt:6,142,31845
1547255203.362226,22,22,r,Pkt:6,143,60730
1547255203.362226,22,22,r,Pkt:6,144,56811
1547255203.362226,22,22,r,Pkt:18,65,58200
1547255203.362226,22,22,r,Pkt:18,66,52401
1547255203.362226,22,22,r,Pkt:18,67,17814
1547255203.362226,22,22,r,Pkt:18,68,34071
1547255203.362226,22,22,r,Pkt:28,109,50428
1547255203.432627,22,22,r,Pkt:28,110,55173
1547255203.432627,22,22,r,Pkt:28,111,31194
1547255203.432627,22,22,r,Pkt:28,112,32267
1547255203.432627,22,22,r,Pkt:6,145,18248
1547255203.432627,22,22,r,Pkt:6,146,31201
1547255203.432627,22,22,r,Pkt:6,147,41734
1547255203.432627,22,22,r,Pkt:6,148,28103
1547255203.476190,22,22,r,Pkt:28,113,13544
1547255203.476190,22,22,r,Pkt:28,114,26369
1547255203.476190,22,22,r,Pkt:28,115,22950
1547255203.476190,22,22,r,Pkt:28,116,61415
1547255203.523271,22,22,r,Pkt:18,69,56580
1547255203.523271,22,22,r,Pkt:18,70,33517
1547255203.523271,22,22,r,Pkt:18,71,9506
1547255203.523271,22,22,r,Pkt:18,72,23475
1547255203.568672,22,22,r,Pkt:28,117,46996
1547255203.568672,22,22,r,Pkt:28,118,29245
1547255203.568672,22,22,r,Pkt:28,119,27186
1547255203.568672,22,22,r,Pkt:28,120,41859
1547255203.641805,22,22,r,Pkt:6,149,36852
1547255203.641805,22,22,r,Pkt:6,150,54045
1547255203.641805,22,22,r,Pkt:6,151,59794
1547255203.641805,22,22,r,Pkt:6,152,8035
1547255203.674791,22,22,r,Pkt:28,121,47360
1547255203.674791,22,22,r,Pkt:28,122,62777
1547255203.674791,22,22,r,Pkt:28,123,63358
1547255203.674791,22,22,r,Pkt:28,124,62687
1547255203.724235,22,22,r,Pkt:18,73,50544
1547255203.724235,22,22,r,Pkt:18,74,24809
1547255203.724235,22,22,r,Pkt:18,75,29038
1547255203.724235,22,22,r,Pkt:18,76,15
1547255203.767914,22,22,r,Pkt:28,125,25900
1547255203.767914,22,22,r,Pkt:28,126,44021
1547255203.767914,22,22,r,Pkt:28,127,3466
1547255203.767914,22,22,r,Pkt:28,128,65531
1547255203.822289,22,22,r,Pkt:6,153,46944
1547255203.822289,22,22,r,Pkt:6,154,33817
1547255203.822289,22,22,r,Pkt:6,155,3294
1547255203.822289,22,22,r,Pkt:6,156,20159
1547255203.822289,22,22,r,Pkt:6,157,59788
1547255203.822289,22,22,r,Pkt:6,158,18645
1547255203.868100,22,22,r,Pkt:6,159,6378
1547255203.868100,22,22,r,Pkt:6,160,6107
1547255203.868100,22,22,r,Pkt:28,129,43032
1547255203.868100,22,22,r,Pkt:28,130,4721
1547255203.868100,22,22,r,Pkt:28,131,30806
1547255203.868100,22,22,r,Pkt:28,132,41175
1547255203.917593,22,22,r,Pkt:6,161,4728
1547255203.917593,22,22,r,Pkt:6,162,40273
1547255203.917593,22,22,r,Pkt:6,163,55734
1547255203.917593,22,22,r,Pkt:6,164,22199
1547255203.917593,22,22,r,Pkt:6,165,56868
1547255203.917593,22,22,r,Pkt:6,166,48525
1547255203.917593,22,22,r,Pkt:6,167,56130
1547255203.917593,22,22,r,Pkt:6,168,42835
1547255203.982599,22,22,r,Pkt:28,133,11716
1547255203.982599,22,22,r,Pkt:28,134,25773
1547255203.982599,22,22,r,Pkt:28,135,50146
1547255203.982599,22,22,r,Pkt:28,136,29555
1547255203.982599,22,22,r,Pkt:18,77,51356
1547255203.982599,22,22,r,Pkt:18,78,8869
1547255203.982599,22,22,r,Pkt:18,79,13946
1547255203.982599,22,22,r,Pkt:18,80,36395
1547255204.040005,22,22,r,Pkt:18,77,51356
1547255204.040005,22,22,r,Pkt:18,78,8869
1547255204.040005,22,22,r,Pkt:18,79,13946
1547255204.040005,22,22,r,Pkt:18,80,36395
1547255204.040005,22,22,r,Pkt:18,77,51356
1547255204.040005,22,22,r,Pkt:18,78,8869
1547255204.040005,22,22,r,Pkt:18,79,13946
1547255204.040005,22,22,r,Pkt:18,80,36395
1547255204.040005,22,22,r,Pkt:18,81,53896
1547255204.040005,22,22,r,Pkt:18,82,17441
1547255204.040005,22,22,r,Pkt:18,83,16454
1547255204.040005,22,22,r,Pkt:18,84,57863
1547255204.110728,22,22,r,Pkt:28,137,25136
1547255204.110728,22,22,r,Pkt:28,138,40617
1547255204.110728,22,22,r,Pkt:28,139,15406
1547255204.110728,22,22,r,Pkt:28,140,54223
1547255204.110728,22,22,r,Pkt:6,169,47248
1547255204.110728,22,22,r,Pkt:6,170,42377
1547255204.110728,22,22,r,Pkt:6,171,27022
1547255204.110728,22,22,r,Pkt:6,172,26031
1547255204.174616,22,22,r,Pkt:6,169,47248
1547255204.174616,22,22,r,Pkt:6,170,42377
1547255204.174616,22,22,r,Pkt:6,171,27022
1547255204.174616,22,22,r,Pkt:6,172,26031
1547255204.174616,22,22,r,Pkt:18,85,36660
1547255204.174616,22,22,r,Pkt:18,86,349
1547255204.174616,22,22,r,Pkt:18,87,6866
1547255204.174616,22,22,r,Pkt:18,88,38819
1547255204.174616,22,22,r,Pkt:28,141,29020
1547255204.174616,22,22,r,Pkt:28,142,31845
1547255204.174616,22,22,r,Pkt:28,143,60730
1547255204.174616,22,22,r,Pkt:28,144,56811
1547255204.236782,22,22,r,Pkt:6,173,52668
1547255204.236782,22,22,r,Pkt:6,174,4421
1547255204.236782,22,22,r,Pkt:6,175,37018
1547255204.236782,22,22,r,Pkt:6,176,44491
1547255204.302181,22,22,r,Pkt:6,177,2472
1547255204.302181,22,22,r,Pkt:6,178,31937
1547255204.338577,22,22,r,Pkt:6,179,7270
1547255204.338577,22,22,r,Pkt:6,180,23463
1547255204.338577,22,22,r,Pkt:6,181,6228
1547255204.338577,22,22,r,Pkt:6,182,9213
1547255204.338577,22,22,r,Pkt:6,183,39154
1547255204.338577,22,22,r,Pkt:6,184,2883
1547255204.338577,22,22,r,Pkt:6,185,26048
1547255204.404778,22,22,r,Pkt:6,186,761
1547255204.404778,22,22,r,Pkt:6,187,21054
1547255204.404778,22,22,r,Pkt:6,188,6303
1547255204.404778,22,22,r,Pkt:3,5,19524
1547255204.404778,22,22,r,Pkt:3,6,24877
1547255204.404778,22,22,r,Pkt:3,7,18018
1547255204.404778,22,22,r,Pkt:3,8,1011
1547255204.404778,22,22,r,Pkt:28,145,18248
1547255204.404778,22,22,r,Pkt:28,146,31201
1547255204.404778,22,22,r,Pkt:28,147,41734
1547255204.404778,22,22,r,Pkt:28,148,28103
1547255204.404778,22,22,r,Pkt:6,189,7660
1547255204.404778,22,22,r,Pkt:6,190,54709
1547255204.404778,22,22,r,Pkt:6,191,21578
1547255204.404778,22,22,r,Pkt:6,192,40891
1547255204.472903,22,22,r,Pkt:6,193,11480
1547255204.472903,22,22,r,Pkt:6,194,6193
1547255204.472903,22,22,r,Pkt:6,195,27414
1547255204.472903,22,22,r,Pkt:6,196,31895
1547255204.527246,22,22,r,Pkt:3,5,19524
1547255204.527246,22,22,r,Pkt:3,6,24877
1547255204.527246,22,22,r,Pkt:3,7,18018
1547255204.527246,22,22,r,Pkt:3,8,1011
1547255204.527246,22,22,r,Pkt:18,89,27296
1547255204.527246,22,22,r,Pkt:18,90,22105
1547255204.527246,22,22,r,Pkt:18,91,4638
1547255204.527246,22,22,r,Pkt:18,92,2815
1547255204.527246,22,22,r,Pkt:6,197,16004
1547255204.527246,22,22,r,Pkt:6,198,1645
1547255204.527246,22,22,r,Pkt:6,199,8866
1547255204.527246,22,22,r,Pkt:6,200,19251
1547255204.527246,22,22,r,Pkt:18,93,37068
1547255204.527246,22,22,r,Pkt:18,94,65301
1547255204.527246,22,22,r,Pkt:18,95,12842
1547255204.527246,22,22,r,Pkt:18,96,22555
1547255204.613035,22,22,r,Pkt:18,97,60856
1547255204.613035,22,22,r,Pkt:18,98,30609
1547255204.613035,22,22,r,Pkt:18,99,18166
1547255204.613035,22,22,r,Pkt:18,100,23287
1547255204.613035,22,22,r,Pkt:18,101,11620
1547255204.613035,22,22,r,Pkt:18,102,64461
1547255204.613035,22,22,r,Pkt:18,103,56450
1547255204.613035,22,22,r,Pkt:18,104,44947
1547255204.613035,22,22,r,Pkt:28,149,36852
1547255204.671648,22,22,r,Pkt:28,150,54045
1547255204.671648,22,22,r,Pkt:28,151,59794
1547255204.671648,22,22,r,Pkt:28,152,8035
1547255204.671648,22,22,r,Pkt:18,105,48080
1547255204.671648,22,22,r,Pkt:18,106,34761
1547255204.671648,22,22,r,Pkt:18,107,16078
1547255204.671648,22,22,r,Pkt:18,108,45551
1547255204.671648,22,22,r,Pkt:18,109,50428
1547255204.671648,22,22,r,Pkt:18,110,55173
1547255204.671648,22,22,r,Pkt:18,111,31194
1547255204.671648,22,22,r,Pkt:18,112,32267
1547255204.733279,22,22,r,Pkt:18,113,13544
1547255204.733279,22,22,r,Pkt:18,114,26369
1547255204.733279,22,22,r,Pkt:18,115,22950
1547255204.733279,22,22,r,Pkt:18,116,61415
1547255204.733279,22,22,r,Pkt:28,153,46944
1547255204.733279,22,22,r,Pkt:28,154,33817
1547255204.733279,22,22,r,Pkt:28,155,3294
1547255204.733279,22,22,r,Pkt:28,156,20159
1547255204.733279,22,22,r,Pkt:18,117,46996
1547255204.733279,22,22,r,Pkt:18,118,29245
1547255204.733279,22,22,r,Pkt:18,119,27186
1547255204.733279,22,22,r,Pkt:18,120,41859
1547255204.733279,22,22,r,Pkt:18,121,47360
1547255204.733279,22,22,r,Pkt:18,122,62777
1547255204.733279,22,22,r,Pkt:18,123,63358
1547255204.733279,22,22,r,Pkt:18,124,62687
1547255204.815733,22,22,r,Pkt:18,125,25900
1547255204.815733,22,22,r,Pkt:18,126,44021
1547255204.815733,22,22,r,Pkt:18,127,3466
1547255204.815733,22,22,r,Pkt:18,128,65531
1547255204.815733,22,22,r,Pkt:18,129,43032
1547255204.815733,22,22,r,Pkt:18,130,4721
1547255204.815733,22,22,r,Pkt:18,131,30806
1547255204.815733,22,22,r,Pkt:18,132,41175
1547255204.815733,22,22,r,Pkt:18,133,11716
1547255204.815733,22,22,r,Pkt:18,134,25773
1547255204.815733,22,22,r,Pkt:18,135,50146
1547255204.815733,22,22,r,Pkt:18,136,29555
1547255204.815733,22,22,r,Pkt:18,137,25136
1547255204.815733,22,22,r,Pkt:18,138,40617
1547255204.815733,22,22,r,Pkt:18,139,15406
1547255204.815733,22,22,r,Pkt:18,140,54223
1547255204.815733,22,22,r,Pkt:18,141,29020
1547255204.815733,22,22,r,Pkt:18,142,31845
1547255204.815733,22,22,r,Pkt:18,143,60730
1547255204.894788,22,22,r,Pkt:18,144,56811
1547255204.894788,22,22,r,Pkt:18,145,18248
1547255204.894788,22,22,r,Pkt:18,146,31201
1547255204.894788,22,22,r,Pkt:18,147,41734
1547255204.894788,22,22,r,Pkt:18,148,28103
1547255204.894788,22,22,r,Pkt:28,157,59788
1547255204.894788,22,22,r,Pkt:28,158,18645
1547255204.894788,22,22,r,Pkt:28,159,6378
1547255204.894788,22,22,r,Pkt:28,160,6107
1547255205.071744,22,22,r,Pkt:18,149,36852
1547255205.071744,22,22,r,Pkt:18,150,54045
1547255205.071744,22,22,r,Pkt:18,151,59794
1547255205.071744,22,22,r,Pkt:18,152,8035
1547255205.186873,22,22,r,Pkt:28,161,4728
1547255205.186873,22,22,r,Pkt:28,162,40273
1547255205.186873,22,22,r,Pkt:28,163,55734
1547255205.186873,22,22,r,Pkt:28,164,22199
1547255205.186873,22,22,r,Pkt:18,153,46944
1547255205.186873,22,22,r,Pkt:18,154,33817
1547255205.186873,22,22,r,Pkt:18,155,3294
1547255205.186873,22,22,r,Pkt:18,156,20159
1547255205.390259,22,22,r,Pkt:18,157,59788
1547255205.390259,22,22,r,Pkt:18,158,18645
1547255205.390259,22,22,r,Pkt:18,159,6378
1547255205.390259,22,22,r,Pkt:18,160,6107
1547255205.390259,22,22,r,Pkt:28,165,56868
1547255205.390259,22,22,r,Pkt:28,166,48525
1547255205.390259,22,22,r,Pkt:28,167,56130
1547255205.390259,22,22,r,Pkt:28,168,42835
1547255205.466335,22,22,r,Pkt:28,169,47248
1547255205.466335,22,22,r,Pkt:28,170,42377
1547255205.466335,22,22,r,Pkt:28,171,27022
1547255205.466335,22,22,r,Pkt:28,172,26031
1547255205.522106,22,22,r,Pkt:28,173,52668
1547255205.522106,22,22,r,Pkt:28,174,4421
1547255205.522106,22,22,r,Pkt:28,175,37018
1547255205.522106,22,22,r,Pkt:28,176,44491
1547255205.612354,22,22,r,Pkt:18,161,4728
1547255205.612354,22,22,r,Pkt:18,162,40273
1547255205.612354,22,22,r,Pkt:18,163,55734
1547255205.642606,22,22,r,Pkt:18,164,22199
1547255205.642606,22,22,r,Pkt:28,177,2472
1547255205.642606,22,22,r,Pkt:28,178,31937
1547255205.642606,22,22,r,Pkt:28,179,7270
1547255205.642606,22,22,r,Pkt:28,180,23463
1547255205.761893,22,22,r,Pkt:28,181,6228
1547255205.761893,22,22,r,Pkt:28,182,9213
1547255205.761893,22,22,r,Pkt:28,183,39154
1547255205.761893,22,22,r,Pkt:28,184,2883
1547255205.796931,22,22,r,Pkt:18,165,56868
1547255205.796931,22,22,r,Pkt:18,166,48525
1547255205.796931,22,22,r,Pkt:18,167,56130
1547255205.796931,22,22,r,Pkt:18,168,42835
1547255205.862251,22,22,r,Pkt:18,169,47248
1547255205.862251,22,22,r,Pkt:18,170,42377
1547255205.896272,22,22,r,Pkt:18,171,27022
1547255205.896272,22,22,r,Pkt:18,172,26031
1547255205.896272,22,22,r,Pkt:28,185,26048
1547255205.896272,22,22,r,Pkt:28,186,761
1547255205.896272,22,22,r,Pkt:28,187,21054
1547255205.896272,22,22,r,Pkt:28,188,6303
1547255205.950895,22,22,r,Pkt:3,5,19524
1547255205.950895,22,22,r,Pkt:3,6,24877
1547255205.950895,22,22,r,Pkt:3,7,18018
1547255205.950895,22,22,r,Pkt:3,8,1011
1547255205.993935,22,22,r,Pkt:28,189,7660
1547255205.993935,22,22,r,Pkt:28,190,54709
1547255205.993935,22,22,r,Pkt:28,191,21578
1547255205.993935,22,22,r,Pkt:28,192,40891
1547255206.063774,22,22,r,Pkt:28,193,11480
1547255206.063774,22,22,r,Pkt:28,194,6193
1547255206.063774,22,22,r,Pkt:28,195,27414
1547255206.107882,22,22,r,Pkt:28,196,31895
1547255206.107882,22,22,r,Pkt:18,173,52668
1547255206.107882,22,22,r,Pkt:18,174,4421
1547255206.107882,22,22,r,Pkt:18,175,37018
1547255206.107882,22,22,r,Pkt:18,176,44491
1547255206.148672,22,22,r,Pkt:28,197,16004
1547255206.148672,22,22,r,Pkt:28,198,1645
1547255206.148672,22,22,r,Pkt:28,199,8866
1547255206.148672,22,22,r,Pkt:28,200,19251
1547255206.193311,22,22,r,Pkt:18,177,2472
1547255206.193311,22,22,r,Pkt:18,178,31937
1547255206.193311,22,22,r,Pkt:18,179,7270
1547255206.193311,22,22,r,Pkt:18,180,23463
1547255206.372169,22,22,r,Pkt:18,181,6228
1547255206.372169,22,22,r,Pkt:18,182,9213
1547255206.372169,22,22,r,Pkt:18,183,39154
1547255206.414141,22,22,r,Pkt:18,184,2883
1547255206.484911,22,22,r,Pkt:18,185,26048
1547255206.484911,22,22,r,Pkt:18,186,761
1547255206.484911,22,22,r,Pkt:18,187,21054
1547255206.484911,22,22,r,Pkt:18,188,6303
1547255206.583008,22,22,r,Pkt:18,189,7660
1547255206.583008,22,22,r,Pkt:18,190,54709
1547255206.583008,22,22,r,Pkt:18,191,21578
1547255206.583008,22,22,r,Pkt:18,192,40891
1547255206.622327,22,22,r,Pkt:18,193,11480
1547255206.622327,22,22,r,Pkt:18,194,6193
1547255206.664164,22,22,r,Pkt:18,195,27414
1547255206.664164,22,22,r,Pkt:18,196,31895
1547255206.766026,22,22,r,Pkt:18,197,16004
1547255206.766026,22,22,r,Pkt:18,198,1645
1547255206.766026,22,22,r,Pkt:18,199,8866
1547255206.766026,22,22,r,Pkt:18,200,19251
1547255207.041796,22,22,r,Pkt:3,5,19524
1547255207.041796,22,22,r,Pkt:3,6,24877
1547255207.041796,22,22,r,Pkt:3,7,18018
1547255207.041796,22,22,r,Pkt:3,8,1011
1547255207.351934,22,22,r,Pkt:3,9,59568
1547255207.351934,22,22,r,Pkt:3,10,58153
1547255207.351934,22,22,r,Pkt:3,11,26286
1547255207.351934,22,22,r,Pkt:3,12,60495
1547255207.472316,22,22,r,Pkt:3,13,57308
1547255207.472316,22,22,r,Pkt:3,14,35045
1547255207.472316,22,22,r,Pkt:3,15,16314
1547255207.472316,22,22,r,Pkt:3,16,65131
1547255207.670664,22,22,r,Pkt:3,13,57308
1547255207.670664,22,22,r,Pkt:3,14,35045
1547255207.670664,22,22,r,Pkt:3,15,16314
1547255207.670664,22,22,r,Pkt:3,16,65131
1547255207.753833,22,22,r,Pkt:3,17,7624
1547255207.753833,22,22,r,Pkt:3,18,52833
1547255207.753833,22,22,r,Pkt:3,19,40326
1547255207.753833,22,22,r,Pkt:3,20,5703
1547255207.821400,22,22,r,Pkt:3,17,7624
1547255207.821400,22,22,r,Pkt:3,18,52833
1547255207.857717,22,22,r,Pkt:3,19,40326
1547255207.857717,22,22,r,Pkt:3,20,5703
1547255207.991020,22,22,r,Pkt:3,21,20084
1547255207.991020,22,22,r,Pkt:3,22,61341
1547255207.991020,22,22,r,Pkt:3,23,3090
1547255207.991020,22,22,r,Pkt:3,24,53219
1547255208.640465,22,22,r,Pkt:3,21,20084
1547255208.640465,22,22,r,Pkt:3,22,61341
1547255208.640465,22,22,r,Pkt:3,23,3090
1547255208.640465,22,22,r,Pkt:3,24,53219
1547255208.743860,22,22,r,Pkt:3,21,20084
1547255208.743860,22,22,r,Pkt:3,22,61341
1547255208.743860,22,22,r,Pkt:3,23,3090
1547255208.743860,22,22,r,Pkt:3,24,53219
1547255208.831403,22,22,r,Pkt:3,21,20084
1547255208.831403,22,22,r,Pkt:3,22,61341
1547255208.868031,22,22,r,Pkt:3,23,3090
1547255208.868031,22,22,r,Pkt:3,24,53219
1547255208.920906,22,22,r,Pkt:3,25,56800
1547255208.920906,22,22,r,Pkt:3,26,59545
1547255208.957351,22,22,r,Pkt:3,27,55134
1547255208.957351,22,22,r,Pkt:3,28,34623
1547255209.060758,22,22,r,Pkt:3,25,56800
1547255209.060758,22,22,r,Pkt:3,26,59545
1547255209.060758,22,22,r,Pkt:3,27,55134
1547255209.060758,22,22,r,Pkt:3,28,34623
1547255209.210680,22,22,r,Pkt:3,29,63500
1547255209.210680,22,22,r,Pkt:3,30,30037
1547255209.210680,22,22,r,Pkt:3,31,2922
1547255209.210680,22,22,r,Pkt:3,32,22619
1547255209.502095,22,22,r,Pkt:3,29,63500
1547255209.502095,22,22,r,Pkt:3,30,30037
1547255209.502095,22,22,r,Pkt:3,31,2922
1547255209.543699,22,22,r,Pkt:3,32,22619
1547255209.730735,22,22,r,Pkt:3,29,63500
1547255209.730735,22,22,r,Pkt:3,30,30037
1547255209.730735,22,22,r,Pkt:3,31,2922
1547255209.730735,22,22,r,Pkt:3,32,22619
1547255209.840480,22,22,r,Pkt:3,33,35064
1547255209.840480,22,22,r,Pkt:3,34,4561
1547255209.840480,22,22,r,Pkt:3,35,29750
1547255209.840480,22,22,r,Pkt:3,36,7991
1547255210.060702,22,22,r,Pkt:3,37,15524
1547255210.060702,22,22,r,Pkt:3,38,64013
1547255210.060702,22,22,r,Pkt:3,39,40386
1547255210.060702,22,22,r,Pkt:3,40,30675
1547255210.284467,22,22,r,Pkt:3,41,32528
1547255210.284467,22,22,r,Pkt:3,42,10761
1547255210.284467,22,22,r,Pkt:3,43,54286
1547255210.284467,22,22,r,Pkt:3,44,48687
1547255210.450505,22,22,r,Pkt:3,41,32528
1547255210.450505,22,22,r,Pkt:3,42,10761
1547255210.450505,22,22,r,Pkt:3,43,54286
1547255210.450505,22,22,r,Pkt:3,44,48687
1547255210.510889,22,22,r,Pkt:3,45,31804
1547255210.510889,22,22,r,Pkt:3,46,24005
1547255210.510889,22,22,r,Pkt:3,47,8986
1547255210.510889,22,22,r,Pkt:3,48,3659
1547255210.599288,22,22,r,Pkt:3,45,31804
1547255210.599288,22,22,r,Pkt:3,46,24005
1547255210.599288,22,22,r,Pkt:3,47,8986
1547255210.599288,22,22,r,Pkt:3,48,3659
1547255210.680840,22,22,r,Pkt:3,45,31804
1547255210.680840,22,22,r,Pkt:3,46,24005
1547255210.680840,22,22,r,Pkt:3,47,8986
1547255210.680840,22,22,r,Pkt:3,48,3659
1547255210.760509,22,22,r,Pkt:3,45,31804
1547255210.760509,22,22,r,Pkt:3,46,24005
1547255210.760509,22,22,r,Pkt:3,47,8986
1547255210.760509,22,22,r,Pkt:3,48,3659
1547255210.930525,22,22,r,Pkt:3,49,8232
1547255210.930525,22,22,r,Pkt:3,50,4417
1547255210.930525,22,22,r,Pkt:3,51,22246
1547255210.930525,22,22,r,Pkt:3,52,17447
1547255211.290766,22,22,r,Pkt:3,49,8232
1547255211.290766,22,22,r,Pkt:3,50,4417
1547255211.290766,22,22,r,Pkt:3,51,22246
1547255211.290766,22,22,r,Pkt:3,52,17447
1547255211.420725,22,22,r,Pkt:3,49,8232
1547255211.420725,22,22,r,Pkt:3,50,4417
1547255211.420725,22,22,r,Pkt:3,51,22246
1547255211.420725,22,22,r,Pkt:3,52,17447
1547255211.611984,22,22,r,Pkt:3,49,8232
1547255211.611984,22,22,r,Pkt:3,50,4417
1547255211.611984,22,22,r,Pkt:3,51,22246
1547255211.611984,22,22,r,Pkt:3,52,17447
1547255211.654109,22,22,r,Pkt:3,49,8232
1547255211.654109,22,22,r,Pkt:3,50,4417
1547255211.654109,22,22,r,Pkt:3,51,22246
1547255211.654109,22,22,r,Pkt:3,52,17447
1547255211.730532,22,22,r,Pkt:3,49,8232
1547255211.730532,22,22,r,Pkt:3,50,4417
1547255211.730532,22,22,r,Pkt:3,51,22246
1547255211.730532,22,22,r,Pkt:3,52,17447
1547255211.821465,22,22,r,Pkt:3,49,8232
1547255211.821465,22,22,r,Pkt:3,50,4417
1547255211.857419,22,22,r,Pkt:3,51,22246
1547255211.857419,22,22,r,Pkt:3,52,17447
1547255211.930325,22,22,r,Pkt:3,53,5844
1547255211.930325,22,22,r,Pkt:3,54,32893
1547255211.930325,22,22,r,Pkt:3,55,64370
1547255211.930325,22,22,r,Pkt:3,56,64451
1547255212.011553,22,22,r,Pkt:3,53,5844
1547255212.011553,22,22,r,Pkt:3,54,32893
1547255212.011553,22,22,r,Pkt:3,55,64370
1547255212.054028,22,22,r,Pkt:3,56,64451
1547255212.181436,22,22,r,Pkt:3,53,5844
1547255212.181436,22,22,r,Pkt:3,54,32893
1547255212.218473,22,22,r,Pkt:3,55,64370
1547255212.218473,22,22,r,Pkt:3,56,64451
1547255212.253813,22,22,r,Pkt:3,53,5844
1547255212.253813,22,22,r,Pkt:3,54,32893
1547255212.253813,22,22,r,Pkt:3,55,64370
1547255212.253813,22,22,r,Pkt:3,56,64451
1547255212.791382,22,22,r,Pkt:3,53,5844
1547255212.791382,22,22,r,Pkt:3,54,32893
1547255212.791382,22,22,r,Pkt:3,55,64370
1547255212.791382,22,22,r,Pkt:3,56,64451
1547255213.035263,22,22,r,Pkt:3,53,5844
1547255213.035263,22,22,r,Pkt:3,54,32893
1547255213.035263,22,22,r,Pkt:3,55,64370
1547255213.035263,22,22,r,Pkt:3,56,64451
1547255213.274792,22,22,r,Pkt:3,53,5844
1547255213.274792,22,22,r,Pkt:3,54,32893
1547255213.342920,22,22,r,Pkt:3,55,64370
1547255213.342920,22,22,r,Pkt:3,56,64451
1547255213.472512,22,22,r,Pkt:3,57,52288
1547255213.472512,22,22,r,Pkt:3,58,42873
1547255213.472512,22,22,r,Pkt:3,59,23742
1547255213.472512,22,22,r,Pkt:3,60,37151
1547255214.171598,22,22,r,Pkt:3,61,27756
1547255214.171598,22,22,r,Pkt:3,62,16949
1547255214.171598,22,22,r,Pkt:3,63,34506
1547255214.213473,22,22,r,Pkt:3,64,8251
1547255214.280205,22,22,r,Pkt:3,61,27756
1547255214.280205,22,22,r,Pkt:3,62,16949
1547255214.280205,22,22,r,Pkt:3,63,34506
1547255214.280205,22,22,r,Pkt:3,64,8251
1547255214.330328,22,22,r,Pkt:3,65,58200
1547255214.330328,22,22,r,Pkt:3,66,52401
1547255214.330328,22,22,r,Pkt:3,67,17814
1547255214.330328,22,22,r,Pkt:3,68,34071
1547255214.460539,22,22,r,Pkt:3,69,56580
1547255214.460539,22,22,r,Pkt:3,70,33517
1547255214.460539,22,22,r,Pkt:3,71,9506
1547255214.460539,22,22,r,Pkt:3,72,23475
1547255214.841579,22,22,r,Pkt:3,69,56580
1547255214.841579,22,22,r,Pkt:3,70,33517
1547255214.841579,22,22,r,Pkt:3,71,9506
1547255214.877017,22,22,r,Pkt:3,72,23475
1547255214.921030,22,22,r,Pkt:3,69,56580
1547255214.954092,22,22,r,Pkt:3,70,33517
1547255214.954092,22,22,r,Pkt:3,71,9506
1547255214.954092,22,22,r,Pkt:3,72,23475
1547255215.073607,22,22,r,Pkt:3,73,50544
1547255215.073607,22,22,r,Pkt:3,74,24809
1547255215.073607,22,22,r,Pkt:3,75,29038
1547255215.073607,22,22,r,Pkt:3,76,15
1547255215.240827,22,22,r,Pkt:3,73,50544
1547255215.240827,22,22,r,Pkt:3,74,24809
1547255215.240827,22,22,r,Pkt:3,75,29038
1547255215.240827,22,22,r,Pkt:3,76,15
1547255215.422060,22,22,r,Pkt:3,73,50544
1547255215.422060,22,22,r,Pkt:3,74,24809
1547255215.422060,22,22,r,Pkt:3,75,29038
1547255215.422060,22,22,r,Pkt:3,76,15
1547255215.750503,22,22,r,Pkt:3,73,50544
1547255215.750503,22,22,r,Pkt:3,74,24809
1547255215.750503,22,22,r,Pkt:3,75,29038
1547255215.750503,22,22,r,Pkt:3,76,15
1547255215.850502,22,22,r,Pkt:3,77,51356
1547255215.850502,22,22,r,Pkt:3,78,8869
1547255215.850502,22,22,r,Pkt:3,79,13946
1547255215.850502,22,22,r,Pkt:3,80,36395
1547255215.980555,22,22,r,Pkt:3,81,53896
1547255215.980555,22,22,r,Pkt:3,82,17441
1547255215.980555,22,22,r,Pkt:3,83,16454
1547255215.980555,22,22,r,Pkt:3,84,57863
1547255216.140579,22,22,r,Pkt:3,85,36660
1547255216.140579,22,22,r,Pkt:3,86,349
1547255216.140579,22,22,r,Pkt:3,87,6866
1547255216.140579,22,22,r,Pkt:3,88,38819
1547255216.210588,22,22,r,Pkt:3,85,36660
1547255216.210588,22,22,r,Pkt:3,86,349
1547255216.210588,22,22,r,Pkt:3,87,6866
1547255216.210588,22,22,r,Pkt:3,88,38819
1547255216.431534,22,22,r,Pkt:3,89,27296
1547255216.431534,22,22,r,Pkt:3,90,22105
1547255216.469053,22,22,r,Pkt:3,91,4638
1547255216.469053,22,22,r,Pkt:3,92,2815
1547255216.640585,22,22,r,Pkt:3,89,27296
1547255216.640585,22,22,r,Pkt:3,90,22105
1547255216.640585,22,22,r,Pkt:3,91,4638
1547255216.640585,22,22,r,Pkt:3,92,2815
1547255216.710982,22,22,r,Pkt:3,89,27296
1547255216.710982,22,22,r,Pkt:3,90,22105
1547255216.710982,22,22,r,Pkt:3,91,4638
1547255216.710982,22,22,r,Pkt:3,92,2815
1547255216.812186,22,22,r,Pkt:3,89,27296
1547255216.812186,22,22,r,Pkt:3,90,22105
1547255216.812186,22,22,r,Pkt:3,91,4638
1547255216.812186,22,22,r,Pkt:3,92,2815
1547255216.855536,22,22,r,Pkt:3,89,27296
1547255216.855536,22,22,r,Pkt:3,90,22105
1547255216.855536,22,22,r,Pkt:3,91,4638
1547255216.855536,22,22,r,Pkt:3,92,2815
1547255216.911341,22,22,r,Pkt:3,93,37068
1547255216.911341,22,22,r,Pkt:3,94,65301
1547255216.911341,22,22,r,Pkt:3,95,12842
1547255216.911341,22,22,r,Pkt:3,96,22555
1547255217.030590,22,22,r,Pkt:3,93,37068
1547255217.030590,22,22,r,Pkt:3,94,65301
1547255217.030590,22,22,r,Pkt:3,95,12842
1547255217.030590,22,22,r,Pkt:3,96,22555
1547255217.120575,22,22,r,Pkt:3,93,37068
1547255217.120575,22,22,r,Pkt:3,94,65301
1547255217.120575,22,22,r,Pkt:3,95,12842
1547255217.120575,22,22,r,Pkt:3,96,22555
1547255217.200535,22,22,r,Pkt:3,93,37068
1547255217.200535,22,22,r,Pkt:3,94,65301
1547255217.200535,22,22,r,Pkt:3,95,12842
1547255217.200535,22,22,r,Pkt:3,96,22555
1547255217.430510,22,22,r,Pkt:3,93,37068
1547255217.430510,22,22,r,Pkt:3,94,65301
1547255217.430510,22,22,r,Pkt:3,95,12842
1547255217.430510,22,22,r,Pkt:3,96,22555
1547255217.491564,22,22,r,Pkt:3,93,37068
1547255217.491564,22,22,r,Pkt:3,94,65301
1547255217.528151,22,22,r,Pkt:3,95,12842
1547255217.528151,22,22,r,Pkt:3,96,22555
1547255217.565951,22,22,r,Pkt:3,93,37068
1547255217.565951,22,22,r,Pkt:3,94,65301
1547255217.565951,22,22,r,Pkt:3,95,12842
1547255217.565951,22,22,r,Pkt:3,96,22555
1547255217.661317,22,22,r,Pkt:3,97,60856
1547255217.661317,22,22,r,Pkt:3,98,30609
1547255217.661317,22,22,r,Pkt:3,99,18166
1547255217.661317,22,22,r,Pkt:3,100,23287
1547255217.771384,22,22,r,Pkt:3,97,60856
1547255217.771384,22,22,r,Pkt:3,98,30609
1547255217.771384,22,22,r,Pkt:3,99,18166
1547255217.813918,22,22,r,Pkt:3,100,23287
1547255217.813918,22,22,r,Pkt:3,97,60856
1547255217.813918,22,22,r,Pkt:3,98,30609
1547255217.813918,22,22,r,Pkt:3,99,18166
1547255217.857619,22,22,r,Pkt:3,100,23287
1547255217.930634,22,22,r,Pkt:3,97,60856
1547255217.930634,22,22,r,Pkt:3,98,30609
1547255217.930634,22,22,r,Pkt:3,99,18166
1547255217.930634,22,22,r,Pkt:3,100,23287
1547255218.240595,22,22,r,Pkt:3,97,60856
1547255218.240595,22,22,r,Pkt:3,98,30609
1547255218.240595,22,22,r,Pkt:3,99,18166
1547255218.240595,22,22,r,Pkt:3,100,23287
1547255218.311446,22,22,r,Pkt:3,101,11620
1547255218.311446,22,22,r,Pkt:3,102,64461
1547255218.311446,22,22,r,Pkt:3,103,56450
1547255218.356189,22,22,r,Pkt:3,104,44947
1547255218.420273,22,22,r,Pkt:3,101,11620
1547255218.420273,22,22,r,Pkt:3,102,64461
1547255218.420273,22,22,r,Pkt:3,103,56450
1547255218.420273,22,22,r,Pkt:3,104,44947
1547255218.501028,22,22,r,Pkt:3,101,11620
1547255218.501028,22,22,r,Pkt:3,102,64461
1547255218.501028,22,22,r,Pkt:3,103,56450
1547255218.501028,22,22,r,Pkt:3,104,44947
1547255218.552140,22,22,r,Pkt:3,105,48080
1547255218.552140,22,22,r,Pkt:3,106,34761
1547255218.552140,22,22,r,Pkt:3,107,16078
1547255218.605139,22,22,r,Pkt:3,108,45551
1547255218.681026,22,22,r,Pkt:3,109,50428
1547255218.681026,22,22,r,Pkt:3,110,55173
1547255218.681026,22,22,r,Pkt:3,111,31194
1547255218.722944,22,22,r,Pkt:3,112,32267
1547255218.770281,22,22,r,Pkt:3,109,50428
1547255218.770281,22,22,r,Pkt:3,110,55173
1547255218.770281,22,22,r,Pkt:3,111,31194
1547255218.770281,22,22,r,Pkt:3,112,32267
1547255218.850531,22,22,r,Pkt:3,109,50428
1547255218.850531,22,22,r,Pkt:3,110,55173
1547255218.850531,22,22,r,Pkt:3,111,31194
1547255218.850531,22,22,r,Pkt:3,112,32267
1547255218.920619,22,22,r,Pkt:3,109,50428
1547255218.920619,22,22,r,Pkt:3,110,55173
1547255218.920619,22,22,r,Pkt:3,111,31194
1547255218.920619,22,22,r,Pkt:3,112,32267
1547255218.971432,22,22,r,Pkt:3,113,13544
1547255218.971432,22,22,r,Pkt:3,114,26369
1547255219.008106,22,22,r,Pkt:3,115,22950
1547255219.008106,22,22,r,Pkt:3,116,61415
1547255219.071412,22,22,r,Pkt:3,117,46996
1547255219.071412,22,22,r,Pkt:3,118,29245
1547255219.107675,22,22,r,Pkt:3,119,27186
1547255219.107675,22,22,r,Pkt:3,120,41859
1547255219.154159,22,22,r,Pkt:3,117,46996
1547255219.154159,22,22,r,Pkt:3,118,29245
1547255219.154159,22,22,r,Pkt:3,119,27186
1547255219.154159,22,22,r,Pkt:3,120,41859
1547255219.210632,22,22,r,Pkt:33,1,56984
1547255219.210632,22,22,r,Pkt:33,2,18161
1547255219.210632,22,22,r,Pkt:33,3,53974
1547255219.210632,22,22,r,Pkt:33,4,10583
1547255219.294099,22,22,r,Pkt:33,1,56984
1547255219.294099,22,22,r,Pkt:33,2,18161
1547255219.294099,22,22,r,Pkt:33,3,53974
1547255219.294099,22,22,r,Pkt:33,4,10583
1547255219.360599,22,22,r,Pkt:33,5,19524
1547255219.360599,22,22,r,Pkt:33,6,24877
1547255219.360599,22,22,r,Pkt:33,7,18018
1547255219.360599,22,22,r,Pkt:33,8,1011
1547255219.460563,22,22,r,Pkt:10,1,56984
1547255219.460563,22,22,r,Pkt:10,2,18161
1547255219.460563,22,22,r,Pkt:10,3,53974
1547255219.460563,22,22,r,Pkt:10,4,10583
1547255219.555747,22,22,r,Pkt:10,1,56984
1547255219.555747,22,22,r,Pkt:10,2,18161
1547255219.555747,22,22,r,Pkt:10,3,53974
1547255219.555747,22,22,r,Pkt:10,4,10583
1547255219.638456,22,22,r,Pkt:33,9,59568
1547255219.638456,22,22,r,Pkt:33,10,58153
1547255219.638456,22,22,r,Pkt:33,11,26286
1547255219.638456,22,22,r,Pkt:33,12,60495
1547255219.638456,22,22,r,Pkt:33,9,59568
1547255219.638456,22,22,r,Pkt:33,10,58153
1547255219.638456,22,22,r,Pkt:33,11,26286
1547255219.638456,22,22,r,Pkt:33,12,60495
1547255219.751040,22,22,r,Pkt:33,9,59568
1547255219.751040,22,22,r,Pkt:33,10,58153
1547255219.751040,22,22,r,Pkt:33,11,26286
1547255219.751040,22,22,r,Pkt:33,12,60495
1547255219.830538,22,22,r,Pkt:33,13,57308
1547255219.830538,22,22,r,Pkt:33,14,35045
1547255219.830538,22,22,r,Pkt:33,15,16314
1547255219.830538,22,22,r,Pkt:33,16,65131
1547255219.950649,22,22,r,Pkt:33,13,57308
1547255219.950649,22,22,r,Pkt:33,14,35045
1547255219.950649,22,22,r,Pkt:33,15,16314
1547255219.950649,22,22,r,Pkt:33,16,65131
1547255220.091471,22,22,r,Pkt:33,13,57308
1547255220.091471,22,22,r,Pkt:33,14,35045
1547255220.091471,22,22,r,Pkt:33,15,16314
1547255220.137299,22,22,r,Pkt:33,16,65131
1547255220.202318,22,22,r,Pkt:33,13,57308
1547255220.202318,22,22,r,Pkt:33,14,35045
1547255220.256587,22,22,r,Pkt:33,15,16314
1547255220.256587,22,22,r,Pkt:33,16,65131
1547255220.431742,22,22,r,Pkt:33,13,57308
1547255220.431742,22,22,r,Pkt:33,14,35045
1547255220.431742,22,22,r,Pkt:33,15,16314
1547255220.431742,22,22,r,Pkt:33,16,65131
1547255220.501717,22,22,r,Pkt:33,13,57308
1547255220.529370,22,22,r,Pkt:33,14,35045
1547255220.529370,22,22,r,Pkt:33,15,16314
1547255220.529370,22,22,r,Pkt:33,16,65131
1547255220.621505,22,22,r,Pkt:33,13,57308
1547255220.621505,22,22,r,Pkt:33,14,35045
1547255220.652570,22,22,r,Pkt:33,15,16314
1547255220.652570,22,22,r,Pkt:33,16,65131
1547255220.771385,22,22,r,Pkt:33,13,57308
1547255220.771385,22,22,r,Pkt:33,14,35045
1547255220.771385,22,22,r,Pkt:33,15,16314
1547255220.771385,22,22,r,Pkt:33,16,65131
1547255220.842171,22,22,r,Pkt:33,17,7624
1547255220.842171,22,22,r,Pkt:33,18,52833
1547255220.842171,22,22,r,Pkt:33,19,40326
1547255220.883708,22,22,r,Pkt:33,20,5703
1547255220.996141,22,22,r,Pkt:33,17,7624
1547255220.996141,22,22,r,Pkt:33,18,52833
1547255220.996141,22,22,r,Pkt:33,19,40326
1547255220.996141,22,22,r,Pkt:33,20,5703
1547255221.212285,22,22,r,Pkt:10,5,19524
1547255221.248454,22,22,r,Pkt:10,6,24877
1547255221.248454,22,22,r,Pkt:10,7,18018
1547255221.248454,22,22,r,Pkt:10,8,1011
1547255221.341048,22,22,r,Pkt:33,21,20084
1547255221.341048,22,22,r,Pkt:33,22,61341
1547255221.341048,22,22,r,Pkt:33,23,3090
1547255221.341048,22,22,r,Pkt:33,24,53219
1547255221.460701,22,22,r,Pkt:33,21,20084
1547255221.460701,22,22,r,Pkt:33,22,61341
1547255221.460701,22,22,r,Pkt:33,23,3090
1547255221.460701,22,22,r,Pkt:33,24,53219
1547255221.611437,22,22,r,Pkt:33,25,56800
1547255221.611437,22,22,r,Pkt:33,26,59545
1547255221.648437,22,22,r,Pkt:33,27,55134
1547255221.648437,22,22,r,Pkt:33,28,34623
1547255221.694179,22,22,r,Pkt:33,29,63500
1547255221.694179,22,22,r,Pkt:33,30,30037
1547255221.694179,22,22,r,Pkt:33,31,2922
1547255221.694179,22,22,r,Pkt:33,32,22619
1547255221.769511,22,22,r,Pkt:33,29,63500
1547255221.769511,22,22,r,Pkt:33,30,30037
1547255221.769511,22,22,r,Pkt:33,31,2922
1547255221.769511,22,22,r,Pkt:33,32,22619
1547255221.834201,22,22,r,Pkt:33,29,63500
1547255221.834201,22,22,r,Pkt:33,30,30037
1547255221.834201,22,22,r,Pkt:33,31,2922
1547255221.834201,22,22,r,Pkt:33,32,22619
1547255221.940696,22,22,r,Pkt:33,29,63500
1547255221.940696,22,22,r,Pkt:33,30,30037
1547255221.940696,22,22,r,Pkt:33,31,2922
1547255221.940696,22,22,r,Pkt:33,32,22619
1547255222.051062,22,22,r,Pkt:10,9,59568
1547255222.051062,22,22,r,Pkt:10,10,58153
1547255222.051062,22,22,r,Pkt:10,11,26286
1547255222.051062,22,22,r,Pkt:10,12,60495
1547255222.120320,22,22,r,Pkt:10,9,59568
1547255222.120320,22,22,r,Pkt:10,10,58153
1547255222.120320,22,22,r,Pkt:10,11,26286
1547255222.120320,22,22,r,Pkt:10,12,60495
1547255222.200748,22,22,r,Pkt:10,9,59568
1547255222.200748,22,22,r,Pkt:10,10,58153
1547255222.200748,22,22,r,Pkt:10,11,26286
1547255222.200748,22,22,r,Pkt:10,12,60495
1547255222.341552,22,22,r,Pkt:10,9,59568
1547255222.341552,22,22,r,Pkt:10,10,58153
1547255222.341552,22,22,r,Pkt:10,11,26286
1547255222.412156,22,22,r,Pkt:10,12,60495
1547255222.456707,22,22,r,Pkt:33,33,35064
1547255222.456707,22,22,r,Pkt:33,34,4561
1547255222.456707,22,22,r,Pkt:33,35,29750
1547255222.456707,22,22,r,Pkt:33,36,7991
1547255222.771075,22,22,r,Pkt:33,33,35064
1547255222.771075,22,22,r,Pkt:33,34,4561
1547255222.771075,22,22,r,Pkt:33,35,29750
1547255222.771075,22,22,r,Pkt:33,36,7991
1547255222.851330,22,22,r,Pkt:33,37,15524
1547255222.880052,22,22,r,Pkt:33,38,64013
1547255222.880052,22,22,r,Pkt:33,39,40386
1547255222.880052,22,22,r,Pkt:33,40,30675
1547255222.918812,22,22,r,Pkt:33,41,32528
1547255222.918812,22,22,r,Pkt:33,42,10761
1547255222.918812,22,22,r,Pkt:33,43,54286
1547255222.918812,22,22,r,Pkt:33,44,48687
1547255222.972537,22,22,r,Pkt:33,45,31804
1547255222.972537,22,22,r,Pkt:33,46,24005
1547255222.972537,22,22,r,Pkt:33,47,8986
1547255222.972537,22,22,r,Pkt:33,48,3659
1547255223.140435,22,22,r,Pkt:33,49,8232
1547255223.140435,22,22,r,Pkt:33,50,4417
1547255223.140435,22,22,r,Pkt:33,51,22246
1547255223.140435,22,22,r,Pkt:33,52,17447
1547255223.251558,22,22,r,Pkt:33,49,8232
1547255223.251558,22,22,r,Pkt:33,50,4417
1547255223.251558,22,22,r,Pkt:33,51,22246
1547255223.288523,22,22,r,Pkt:33,52,17447
1547255223.350353,22,22,r,Pkt:33,49,8232
1547255223.350353,22,22,r,Pkt:33,50,4417
1547255223.350353,22,22,r,Pkt:33,51,22246
1547255223.350353,22,22,r,Pkt:33,52,17447
1547255223.470438,22,22,r,Pkt:33,53,5844
1547255223.470438,22,22,r,Pkt:33,54,32893
1547255223.470438,22,22,r,Pkt:33,55,64370
1547255223.470438,22,22,r,Pkt:33,56,64451
1547255223.650669,22,22,r,Pkt:33,53,5844
1547255223.650669,22,22,r,Pkt:33,54,32893
1547255223.650669,22,22,r,Pkt:33,55,64370
1547255223.650669,22,22,r,Pkt:33,56,64451
1547255223.841471,22,22,r,Pkt:33,57,52288
1547255223.841471,22,22,r,Pkt:33,58,42873
1547255223.878443,22,22,r,Pkt:33,59,23742
1547255223.878443,22,22,r,Pkt:33,60,37151
1547255223.878443,22,22,r,Pkt:10,13,57308
1547255223.878443,22,22,r,Pkt:10,14,35045
1547255223.878443,22,22,r,Pkt:10,15,16314
1547255223.878443,22,22,r,Pkt:10,16,65131
1547255223.970494,22,22,r,Pkt:33,61,27756
1547255223.970494,22,22,r,Pkt:33,62,16949
1547255223.970494,22,22,r,Pkt:33,63,34506
1547255223.970494,22,22,r,Pkt:33,64,8251
1547255224.101469,22,22,r,Pkt:33,61,27756
1547255224.101469,22,22,r,Pkt:33,62,16949
1547255224.101469,22,22,r,Pkt:33,63,34506
1547255224.143599,22,22,r,Pkt:33,64,8251
1547255224.181061,22,22,r,Pkt:33,61,27756
1547255224.211266,22,22,r,Pkt:33,62,16949
1547255224.211266,22,22,r,Pkt:33,63,34506
1547255224.211266,22,22,r,Pkt:33,64,8251
1547255224.252068,22,22,r,Pkt:33,65,58200
1547255224.252068,22,22,r,Pkt:33,66,52401
1547255224.252068,22,22,r,Pkt:33,67,17814
1547255224.252068,22,22,r,Pkt:33,68,34071
1547255224.341286,22,22,r,Pkt:33,69,56580
1547255224.341286,22,22,r,Pkt:33,70,33517
1547255224.341286,22,22,r,Pkt:33,71,9506
1547255224.341286,22,22,r,Pkt:33,72,23475
1547255224.492660,22,22,r,Pkt:33,69,56580
1547255224.492660,22,22,r,Pkt:33,70,33517
1547255224.492660,22,22,r,Pkt:33,71,9506
1547255224.492660,22,22,r,Pkt:33,72,23475
1547255224.651530,22,22,r,Pkt:10,17,7624
1547255224.651530,22,22,r,Pkt:10,18,52833
1547255224.687320,22,22,r,Pkt:10,19,40326
1547255224.687320,22,22,r,Pkt:10,20,5703
1547255224.750507,22,22,r,Pkt:33,73,50544
1547255224.750507,22,22,r,Pkt:33,74,24809
1547255224.750507,22,22,r,Pkt:33,75,29038
1547255224.750507,22,22,r,Pkt:33,76,15
1547255224.917771,22,22,r,Pkt:33,73,50544
1547255224.917771,22,22,r,Pkt:33,74,24809
1547255224.917771,22,22,r,Pkt:33,75,29038
1547255224.917771,22,22,r,Pkt:33,76,15
1547255185.397473,6,6,r,[INFO: CC430     ] MCU: CC430F5147, Reset Source: nRST, Compile date: Dec 10 2018
1547255185.397473,6,6,r,[INFO: RF1A      ] RF module configured (0dBm, 869.0MHz, 30b)
1547255185.397473,6,6,r,[INFO: Main      ] Starting Contiki-NG
1547255185.397473,6,6,r,[INFO: Main      ]  Net: nullnet
1547255185.397473,6,6,r,[INFO: Main      ]  MAC: nullmac
1547255185.397473,6,6,r,[INFO: Main      ] Link-layer address 0000.0000.0000.0000
1547255185.397473,6,6,r,[INFO: CC430     ] Node started. Node ID is set to 6. Platform DPP1
1547255185.373594,3,3,r,[INFO: CC430     ] MCU: CC430F5147, Reset Source: nRST, Compile date: Dec 10 2018
1547255185.435534,3,3,r,[INFO: RF1A      ] RF module configured (0dBm, 869.0MHz, 30b)
1547255185.435534,3,3,r,[INFO: Main      ] Starting Contiki-NG
1547255185.435534,3,3,r,[INFO: Main      ]  Net: nullnet
1547255185.435534,3,3,r,[INFO: Main      ]  MAC: nullmac
1547255185.435534,3,3,r,[INFO: Main      ] Link-layer address 0000.0000.0000.0000
1547255185.435534,3,3,r,[INFO: CC430     ] Node started. Node ID is set to 3. Platform DPP1
1547255185.385723,31,31,r,[INFO: CC430     ] MCU: CC430F5147, Reset Source: nRST, Compile date: Dec 10 2018
1547255185.450351,31,31,r,[INFO: RF1A      ] RF module configured (0dBm, 869.0MHz, 30b)
1547255185.450351,31,31,r,[INFO: Main      ] Starting Contiki-NG
1547255185.450351,31,31,r,[INFO: Main      ]  Net: nullnet
1547255185.450351,31,31,r,[INFO: Main      ]  MAC: nullmac
1547255185.450351,31,31,r,[INFO: Main      ] Link-layer address 0000.0000.0000.0000
1547255185.450351,31,31,r,[INFO: CC430     ] Node started. Node ID is set to 31. Platform DPP1
1547255185.430722,8,8,r,[INFO: CC430     ] MCU: CC430F5147, Reset Source: nRST, Compile date: Dec 10 2018
1547255185.430722,8,8,r,[INFO: RF1A      ] RF module configured (0dBm, 869.0MHz, 30b)
1547255185.430722,8,8,r,[INFO: Main      ] Starting Contiki-NG
1547255185.430722,8,8,r,[INFO: Main      ]  Net: nullnet
1547255185.430722,8,8,r,[INFO: Main      ]  MAC: nullmac
1547255185.430722,8,8,r,[INFO: Main      ] Link-layer address 0000.0000.0000.0000
1547255185.430722,8,8,r,[INFO: CC430     ] Node started. Node ID is set to 8. Platform DPP1
1547255185.421506,15,15,r,[INFO: CC430     ] MCU: CC430F5147, Reset Source: nRST, Compile date: Dec 10 2018
1547255185.421506,15,15,r,[INFO: RF1A      ] RF module configured (0dBm, 869.0MHz, 30b)
1547255185.421506,15,15,r,[INFO: Main      ] Starting Contiki-NG
1547255185.421506,15,15,r,[INFO: Main      ]  Net: nullnet
1547255185.421506,15,15,r,[INFO: Main      ]  MAC: nullmac
1547255185.421506,15,15,r,[INFO: Main      ] Link-layer address 0000.0000.0000.0000
1547255185.421506,15,15,r,[INFO: CC430     ] Node started. Node ID is set to 15. Platform DPP1
1547255185.422286,18,18,r,[INFO: CC430     ] MCU: CC430F5147, Reset Source: nRST, Compile date: Dec 10 2018
1547255185.422286,18,18,r,[INFO: RF1A      ] RF module configured (0dBm, 869.0MHz, 30b)
1547255185.422286,18,18,r,[INFO: Main      ] Starting Contiki-NG
1547255185.422286,18,18,r,[INFO: Main      ]  Net: nullnet
1547255185.422286,18,18,r,[INFO: Main      ]  MAC: nullmac
1547255185.422286,18,18,r,[INFO: Main      ] Link-layer address 0000.0000.0000.0000
1547255185.422286,18,18,r,[INFO: CC430     ] Node started. Node ID is set to 18. Platform DPP1
1547255185.409702,10,10,r,[INFO: CC430     ] MCU: CC430F5147, Reset Source: nRST, Compile date: Dec 10 2018
1547255185.409702,10,10,r,[INFO: RF1A      ] RF module configured (0dBm, 869.0MHz, 30b)
1547255185.409702,10,10,r,[INFO: Main      ] Starting Contiki-NG
1547255185.409702,10,10,r,[INFO: Main      ]  Net: nullnet
1547255185.409702,10,10,r,[INFO: Main      ]  MAC: nullmac
1547255185.409702,10,10,r,[INFO: Main      ] Link-layer address 0000.0000.0000.0000
1547255185.409702,10,10,r,[INFO: CC430     ] Node started. Node ID is set to 10. Platform DPP1
1547255185.427978,16,16,r,[INFO: CC430     ] MCU: CC430F5147, Reset Source: nRST, Compile date: Dec 10 2018
1547255185.427978,16,16,r,[INFO: RF1A      ] RF module configured (0dBm, 869.0MHz, 30b)
1547255185.427978,16,16,r,[INFO: Main      ] Starting Contiki-NG
1547255185.427978,16,16,r,[INFO: Main      ]  Net: nullnet
1547255185.427978,16,16,r,[INFO: Main      ]  MAC: nullmac
1547255185.427978,16,16,r,[INFO: Main      ] Link-layer address 0000.0000.0000.0000
1547255185.427978,16,16,r,[INFO: CC430     ] Node started. Node ID is set to 16. Platform DPP1
