33: 64 (64 ok) packets
3: 120 (120 ok) packets
6: 200 (200 ok) packets
10: 16 (16 ok) packets
16: 200 (200 ok) packets
18: 200 (200 ok) packets
22: 200 (200 ok) packets
28: 200 (200 ok) packets
Data Yield: 40.00 % (0.40)
Average Current Drain: 6.33 mA (0.75)
Performance Metric: 0.57
