<?xml version="1.0" encoding="UTF-8" standalone="no"?>
<!-- Created with Inkscape (http://www.inkscape.org/) -->

<svg
   width="115.47282mm"
   height="85.042816mm"
   viewBox="0 0 115.47282 85.042816"
   version="1.1"
   id="svg5"
   sodipodi:docname="ipyopt-3.svg"
   inkscape:version="1.2 (dc2aedaf03, 2022-05-15)"
   xml:space="preserve"
   xmlns:inkscape="http://www.inkscape.org/namespaces/inkscape"
   xmlns:sodipodi="http://sodipodi.sourceforge.net/DTD/sodipodi-0.dtd"
   xmlns:xlink="http://www.w3.org/1999/xlink"
   xmlns="http://www.w3.org/2000/svg"
   xmlns:svg="http://www.w3.org/2000/svg"><sodipodi:namedview
   id="namedview7"
   pagecolor="#ffffff"
   bordercolor="#666666"
   borderopacity="1.0"
   inkscape:showpageshadow="2"
   inkscape:pageopacity="0.0"
   inkscape:pagecheckerboard="0"
   inkscape:deskcolor="#d1d1d1"
   inkscape:document-units="mm"
   showgrid="false"
   inkscape:zoom="3.3638608"
   inkscape:cx="191.00077"
   inkscape:cy="222.06626"
   inkscape:window-width="1920"
   inkscape:window-height="1011"
   inkscape:window-x="0"
   inkscape:window-y="0"
   inkscape:window-maximized="1"
   inkscape:current-layer="layer1" /><defs
   id="defs2"><radialGradient
     cx="15.115"
     cy="63.965"
     r="12.289"
     fx="15.115"
     fy="63.965"
     id="rg1"
     xlink:href="#lg4"
     gradientUnits="userSpaceOnUse"
     gradientTransform="matrix(1.6,0,0,0.551754,-0.183975,4.83575)" /><linearGradient
     id="lg4"><stop
       stop-color="#000"
       offset="0"
       id="stop4682" /><stop
       stop-color="#000"
       stop-opacity="0"
       offset="1"
       id="stop4684" /></linearGradient><linearGradient
     x1="119.191"
     y1="89.129997"
     x2="116.965"
     y2="169.27901"
     id="lg8"
     xlink:href="#lg3"
     gradientUnits="userSpaceOnUse"
     gradientTransform="matrix(0.353878,0,0,0.353878,-16.3897,-17.997)" /><linearGradient
     id="lg3"><stop
       stop-color="#ffe253"
       offset="0"
       id="stop4677" /><stop
       stop-color="#ffca1c"
       offset="1"
       id="stop4679" /></linearGradient><linearGradient
     x1="94.693001"
     y1="112.511"
     x2="94.693001"
     y2="64.053001"
     id="lg7"
     xlink:href="#lg2"
     gradientUnits="userSpaceOnUse"
     gradientTransform="matrix(0.353878,0,0,0.353878,-6.29697,-7.94537)" /><linearGradient
     id="lg2"><stop
       stop-color="#fff"
       offset="0"
       id="stop4672" /><stop
       stop-color="#fff"
       stop-opacity="0.165"
       offset="1"
       id="stop4674" /></linearGradient><linearGradient
     x1="59.728001"
     y1="102"
     x2="142.62"
     y2="102"
     id="lg6"
     xlink:href="#lg1"
     gradientUnits="userSpaceOnUse"
     gradientTransform="matrix(0.353878,0,0,0.353878,-17.3795,-19.412)" /><linearGradient
     id="lg1"><stop
       stop-color="#3778ae"
       offset="0"
       id="stop4667" /><stop
       stop-color="#366c99"
       offset="1"
       id="stop4669" /></linearGradient><linearGradient
     x1="94.693001"
     y1="112.511"
     x2="94.693001"
     y2="64.053001"
     id="lg5"
     xlink:href="#lg2"
     gradientUnits="userSpaceOnUse"
     gradientTransform="matrix(0.353878,0,0,0.353878,-17.3795,-19.412)" /></defs>
  <style
   id="style">
    /* <![CDATA[ */
    .code {
      font-family:'Liberation Mono';
      -inkscape-font-specification:'Liberation Mono';
      fill:#e6e6e6;
    }
    .code-keyword {
      fill:#007020;
    }
    .code-const {
      fill:#d4aa00;
    }
    .code-type {
      fill:#ff5555;
    }
    .code-punctuation {
      fill:#939393;
    }
      /* ]]> */
  </style>
<g
   inkscape:label="Layer 1"
   inkscape:groupmode="layer"
   id="layer1"
   transform="translate(-6.0567722,-19.854496)"><g
     id="g28407"><rect
       style="fill:none;stroke:#e6e6e6;stroke-width:0.5;stroke-linecap:square;stroke-miterlimit:10;stroke-dasharray:none;stop-color:#000000"
       id="rect231"
       width="51.421989"
       height="19.604992"
       x="6.3067722"
       y="68.469505" /><text
       xml:space="preserve"
       style="font-style:normal;font-variant:normal;font-weight:normal;font-stretch:normal;font-size:3.40883px;line-height:1.25;font-family:'Liberation Mono';-inkscape-font-specification:'Liberation Mono';letter-spacing:0px;word-spacing:0px;fill-opacity:1;stroke-width:0.264583"
       x="7.5246425"
       y="72.555252"
       id="text998"
       transform="scale(1.0054786,0.9945513)"
       class="code"><tspan
         sodipodi:role="line"
         id="tspan996"
         class="code-keyword"
         style="font-style:normal;font-variant:normal;font-weight:normal;font-stretch:normal;font-family:'Liberation Mono';-inkscape-font-specification:'Liberation Mono';fill-opacity:1;stroke-width:0.264583"
         x="7.5246425"
         y="72.555252">class</tspan><tspan
         id="tspan5421"> TNLP</tspan></text><path
       style="fill:none;stroke:#e6e6e6;stroke-width:0.264583px;stroke-linecap:butt;stroke-linejoin:miter;stroke-opacity:1"
       d="M 6.1448429,73.50497 H 57.728758"
       id="path3370"
       sodipodi:nodetypes="cc" /><text
       xml:space="preserve"
       style="font-style:normal;font-variant:normal;font-weight:normal;font-stretch:normal;font-size:3.40883px;line-height:1.25;font-family:'Liberation Mono';-inkscape-font-specification:'Liberation Mono';letter-spacing:0px;word-spacing:0px;fill-opacity:1;stroke-width:0.264583"
       x="7.5246425"
       y="77.993408"
       id="text4102"
       transform="scale(1.0054786,0.9945513)"
       class="code"><tspan
         sodipodi:role="line"
         id="tspan4100"
         x="7.5246425"
         y="77.993408"
         class="code-keyword">virtual </tspan><tspan
         id="tspan7615"
         class="code-type">bool</tspan><tspan
         id="tspan5212"> eval_f</tspan><tspan
         id="tspan21471"
         class="code-punctuation">(...)</tspan></text><text
       xml:space="preserve"
       style="font-style:normal;font-variant:normal;font-weight:normal;font-stretch:normal;font-size:3.40883px;line-height:1.25;font-family:'Liberation Mono';-inkscape-font-specification:'Liberation Mono';letter-spacing:0px;word-spacing:0px;fill-opacity:1;stroke-width:0.264583"
       x="7.5246425"
       y="82.743935"
       id="text5427"
       transform="scale(1.0054786,0.9945513)"
       class="code"><tspan
         sodipodi:role="line"
         id="tspan5425"
         x="7.5246425"
         y="82.743935"
         class="code-keyword">virtual </tspan><tspan
         id="tspan7617"
         class="code-type">bool</tspan><tspan
         id="tspan5423"> eval_g</tspan><tspan
         id="tspan21469"
         class="code-punctuation">(...)</tspan></text><text
       xml:space="preserve"
       style="font-style:normal;font-variant:normal;font-weight:normal;font-stretch:normal;font-size:3.40883px;line-height:1.25;font-family:'Liberation Mono';-inkscape-font-specification:'Liberation Mono';letter-spacing:0px;word-spacing:0px;fill-opacity:1;stroke-width:0.264583"
       x="7.5246425"
       y="86.733421"
       id="text6159"
       transform="scale(1.0054786,0.9945513)"
       class="code"><tspan
         id="tspan6155">...</tspan></text></g><text
     xml:space="preserve"
     style="font-style:normal;font-variant:normal;font-weight:normal;font-stretch:normal;font-size:4.70853px;line-height:1.25;font-family:'Liberation Mono';-inkscape-font-specification:'Liberation Mono';letter-spacing:0px;word-spacing:0px;fill:#007020;fill-opacity:1;stroke-width:0.264583"
     x="32.757965"
     y="98.752052"
     id="text10547"
     transform="scale(1.0043751,0.99564396)"><tspan
       sodipodi:role="line"
       id="tspan10545"
       style="font-style:normal;font-variant:normal;font-weight:normal;font-stretch:normal;font-family:'Liberation Mono';-inkscape-font-specification:'Liberation Mono';fill:#007020;fill-opacity:1;stroke-width:0.264583"
       x="32.757965"
       y="98.752052" /></text><g
     id="g28426"><rect
       style="fill:none;stroke:#e6e6e6;stroke-width:0.5;stroke-linecap:square;stroke-miterlimit:10;stroke-dasharray:none;stop-color:#000000"
       id="rect10523"
       width="72.705032"
       height="19.604992"
       x="6.3067722"
       y="44.514904" /><text
       xml:space="preserve"
       style="font-style:normal;font-variant:normal;font-weight:normal;font-stretch:normal;font-size:3.40883px;line-height:1.25;font-family:'Liberation Mono';-inkscape-font-specification:'Liberation Mono';letter-spacing:0px;word-spacing:0px;fill-opacity:1;stroke-width:0.264583"
       x="7.5246425"
       y="48.469421"
       id="text10529"
       transform="scale(1.0054786,0.9945513)"
       class="code"><tspan
         sodipodi:role="line"
         id="tspan10527"
         style="font-style:normal;font-variant:normal;font-weight:normal;font-stretch:normal;font-family:'Liberation Mono';-inkscape-font-specification:'Liberation Mono';fill-opacity:1;stroke-width:0.264583"
         x="7.5246425"
         y="48.469421"
         class="code-keyword">class</tspan><tspan
         id="tspan10525"> IpoptApplication</tspan></text><path
       style="fill:none;stroke:#e6e6e6;stroke-width:0.264583px;stroke-linecap:butt;stroke-linejoin:miter;stroke-opacity:1"
       d="M 6.1448429,49.550374 H 79.011805"
       id="path10531"
       sodipodi:nodetypes="cc" /><text
       xml:space="preserve"
       style="font-style:normal;font-variant:normal;font-weight:normal;font-stretch:normal;font-size:3.40883px;line-height:1.25;font-family:'Liberation Mono';-inkscape-font-specification:'Liberation Mono';letter-spacing:0px;word-spacing:0px;fill-opacity:1;stroke-width:0.264583"
       x="7.5246425"
       y="53.907581"
       id="text10539"
       transform="scale(1.0054786,0.9945513)"
       class="code"><tspan
         sodipodi:role="line"
         id="tspan10537"
         style="font-style:normal;font-variant:normal;font-weight:normal;font-stretch:normal;font-family:'Liberation Mono';-inkscape-font-specification:'Liberation Mono';fill-opacity:1;stroke-width:0.264583"
         x="7.5246425"
         y="53.907581"
         class="code-keyword">...</tspan><tspan
         id="tspan17825"> OptimizeTNLP</tspan><tspan
         id="tspan20011"
         class="punctuation">(</tspan><tspan
         id="tspan21517"
         class="code-const">const</tspan><tspan
         id="tspan17821"> TNLP </tspan><tspan
         id="tspan20015"
         class="code-punctuation">&amp;</tspan><tspan
         id="tspan18555">tnlp</tspan><tspan
         id="tspan20013"
         class="code-punctuation">)</tspan></text><text
       xml:space="preserve"
       style="font-style:normal;font-variant:normal;font-weight:normal;font-stretch:normal;font-size:3.40883px;line-height:1.25;font-family:'Liberation Mono';-inkscape-font-specification:'Liberation Mono';letter-spacing:0px;word-spacing:0px;fill-opacity:1;stroke-width:0.264583"
       x="7.5246425"
       y="59.448372"
       id="text10553"
       transform="scale(1.0054786,0.9945513)"
       class="code"><tspan
         id="tspan10549">...</tspan></text></g><g
     id="g3458"
     transform="matrix(0.17445847,0,0,0.17445847,106.07902,-7.2435797)"
     style="stroke-width:5.73203"><path
       id="path3415"
       style="opacity:1;vector-effect:none;fill:#669ad3;fill-opacity:1;stroke:none;stroke-width:5.73201;stroke-linecap:butt;stroke-linejoin:miter;stroke-miterlimit:4;stroke-dasharray:none;stroke-dashoffset:0;stroke-opacity:1;stop-color:#000000;stop-opacity:1"
       d="m -716.05029,685.17317 c -4.80881,-2.77635 -10.60808,-2.12692 -15.18158,0.51357 l -114.63732,66.18536 c -5.2676,3.04122 -7.60435,8.38907 -7.60439,13.67005 l -10e-4,131.84175 c 2e-5,5.55273 3.46203,10.25034 8.03554,12.89087 l 114.63689,66.18611 c 5.26757,3.04125 11.06577,2.3884 15.64078,-0.24945 l 114.63798,-66.09768 c 5.23228,-3.01682 7.60522,-8.30103 7.60523,-13.58209 l 3.8e-4,-131.48758 c 2e-5,-6.08251 -3.46289,-10.78012 -8.0364,-13.42062 z"
       transform="scale(0.26458333)"
       sodipodi:nodetypes="sssscssssssss" /><path
       id="path3430"
       style="fill:#004481;fill-opacity:1;stroke:none;stroke-width:5.73201px;stroke-linecap:butt;stroke-linejoin:miter;stroke-opacity:1"
       d="m -594.54297,758.24219 -255.58594,148.08593 c 1.30419,1.5785 2.91077,2.92034 4.68946,3.94727 l 114.63672,66.18555 c 5.26757,3.04125 11.06561,2.38785 15.64062,-0.25 l 114.63867,-66.09766 c 5.23228,-3.01682 7.60546,-8.30097 7.60547,-13.58203 V 765.04492 c 10e-6,-2.52283 -0.60138,-4.80436 -1.625,-6.80273 z"
       transform="scale(0.26458333)" /><path
       id="path3434"
       style="opacity:1;vector-effect:none;fill:#ffffff;fill-opacity:1;stroke:none;stroke-width:5.73201;stroke-linecap:butt;stroke-linejoin:miter;stroke-miterlimit:4;stroke-dasharray:none;stroke-dashoffset:0;stroke-opacity:1;stop-color:#000000;stop-opacity:1"
       d="m -724.15625,745.00391 a 87.612067,87.612067 0 0 0 -87.61328,87.61132 87.612067,87.612067 0 0 0 87.61328,87.61329 87.612067,87.612067 0 0 0 87.61133,-87.61329 87.612067,87.612067 0 0 0 -87.61133,-87.61132 z m -0.0918,44.83984 a 42.771239,42.771239 0 0 1 0.0918,0 42.771239,42.771239 0 0 1 42.77148,42.77148 42.771239,42.771239 0 0 1 -42.77148,42.77149 42.771239,42.771239 0 0 1 -42.77148,-42.77149 42.771239,42.771239 0 0 1 42.67968,-42.77148 z"
       transform="scale(0.26458333)" /><path
       id="path3432"
       style="fill:#00599d;fill-opacity:1;stroke:none;stroke-width:5.73201px;stroke-linecap:butt;stroke-linejoin:miter;stroke-opacity:1"
       d="m -594.5918,758.14648 -128.25586,74.46875 126.72461,73.66211 c 2.17636,-2.82498 3.20507,-6.28424 3.20508,-9.74609 V 765.04492 c 10e-6,-2.56303 -0.62008,-4.8775 -1.67383,-6.89844 z"
       transform="scale(0.26458333)" /><path
       id="rect3439"
       style="opacity:1;vector-effect:none;fill:#ffffff;fill-opacity:1;stroke:none;stroke-width:5.73201;stroke-linecap:butt;stroke-linejoin:miter;stroke-miterlimit:4;stroke-dasharray:none;stroke-dashoffset:0;stroke-opacity:1;stop-color:#000000;stop-opacity:1"
       d="m -618.81055,817.54297 v 9.80469 h -9.80468 v 9.69726 h 9.80468 v 9.80469 h 9.69727 v -9.80469 h 9.80469 v -9.69726 h -9.80469 v -9.80469 z"
       transform="scale(0.26458333)" /><path
       id="path3444"
       style="opacity:1;vector-effect:none;fill:#ffffff;fill-opacity:1;stroke:none;stroke-width:1.5166;stroke-linecap:butt;stroke-linejoin:miter;stroke-miterlimit:4;stroke-dasharray:none;stroke-dashoffset:0;stroke-opacity:1;stop-color:#000000;stop-opacity:1"
       d="m -173.32533,216.30824 v 2.59416 h -2.59415 v 2.56573 h 2.59415 v 2.59416 h 2.56574 v -2.59416 h 2.59415 v -2.56573 h -2.59415 v -2.59416 z" /></g><g
     transform="matrix(0.30551807,0,0,0.30590857,98.004295,24.581503)"
     id="g4750"
     style="stroke-width:1.6316"><path
       style="fill:url(#rg1);stroke-width:1.6316"
       d="m 43.6618,40.1289 a 19.6618,6.7805 0 0 1 -39.3236,0 19.6618,6.7805 0 1 1 39.3236,0 z"
       fill="url(#rg1)"
       id="path4694" /><path
       style="fill:url(#lg8);stroke-width:1.6316"
       d="m 34.0804,37.5795 c 0,2.7319 -2.371,4.1156 -4.7774,4.8057 -3.6202,1.0404 -6.5255,0.8811 -9.5511,0 -2.5268,-0.7362 -4.7774,-2.2402 -4.7774,-4.8057 v -9.0132 c 0,-2.594 2.1621,-4.8092 4.7774,-4.8092 l 9.3984,-0.6111 c 3.1814,0 5.2606,-1.9858 5.2606,-5.245 l 0.8655,-4.3569 h 3.5813 c 2.7814,0 4.0909,2.0667 4.7774,4.8056 0.9555,3.8043 0.9978,6.6495 0,9.615 -0.9661,2.8805 -2,4.8056 -4.7774,4.8056 h -4.7773 -9.5512 v -0.02 c 8.2424,0.02 9.5512,-3.3164 9.5512,4.8281 z"
       fill="url(#lg8)"
       id="path4696" /><path
       d="m 28.1104,38.1776 c 0,-0.9944 0.8033,-1.8013 1.7906,-1.8013 1,0 1.7906,0.8069 1.7906,1.8013 0,0.9979 -0.7997,1.8047 -1.7906,1.8047 -0.9873,0 -1.7906,-0.8068 -1.7906,-1.8047 z"
       fill="#ffffff"
       id="path4698"
       style="stroke-width:2.25792" /><path
       style="fill:url(#lg7);stroke-width:2.25792"
       d="m 35.2662,13.5436 v 4.2265 C 31.8551,23.767 25.375,23.7787 19.939,23.7787 l -2.017,0.2052 c -2.8342,2.4364 -2.9244,6.3463 -2.9223,9.7756 6.2502,-6.9742 12.9174,-7.5004 16.2436,-7.4854 6.6377,0.029 9.7638,-1.6029 12.9339,-5.1939 -0.016,-0.07 0.016,-0.132 0,-0.2037 -0.1222,-0.8 -0.3362,-1.6544 -0.5601,-2.546 -0.3218,-1.2839 -0.7428,-2.4141 -1.4257,-3.2589 -0.016,-0.016 -0.038,-0.034 -0.051,-0.05 0,0 -0.042,0 -0.05,0 -0.023,-0.028 -0.028,-0.075 -0.05,-0.1011 -0.047,-0.034 -0.052,-0.07 -0.101,-0.101 -0.016,-0.016 -0.039,0.016 -0.05,0 C 41.1653,14.3502 40.2858,14 39.3942,13.8519 38.5861,13.7183 37.775,13.6165 36.95,13.5464 h -0.5092 -1.1711 z"
       opacity="0.837"
       fill="url(#lg7)"
       id="path4700" /><path
       d="m 34.559,37.579 c 0,2.732 -2.8497,4.116 -5.256,4.806 -3.62,1.04 -6.525,0.881 -9.551,0 -2.527,-0.736 -4.801,-2.24 -4.805,-4.805 l -0.016,-9.258 c -0.01,-3.073 2.302,-5.01 4.849,-5 l 8.4667,0.015 c 3.25,0 6.41,-3.3 6.401,-6.55 V 13.55 h 4.21 c 2.7814,0 4.09,2.067 4.777,4.806 0.956,3.804 1,6.649 0,9.615 -0.966,2.88 -2,5.1476 -4.777,5.148 h -4.3 -10.03 v -0.02 l 10.03,0.034 z"
       fill="none"
       stroke="#bb9400"
       stroke-width="2.65951"
       id="path4702" /><path
       d="m 35.4653,14.3584 v 2.3933 c 0,3.7245 -3.4965,7.3757 -7.4809,7.3757 h -8.2491 c -2.8506,0 -4.0184,2.1569 -4.0042,4.4379 l 0.056,9.0129 c 0.01,1.0446 0.4,1.8235 1.148,2.4951 0.748,0.6715 1.8726,1.183 3.0553,1.5277 2.9164,0.8492 5.576,1.0022 9.0638,0 1.1327,-0.3248 2.6394,-0.9401 3.3976,-1.5964 0.7581,-0.6565 1.3077,-1.2961 1.3077,-2.4264 v -3.6298 h -10.052 v -1.6795 l 15.1743,0.05 c 1.2008,0 1.788,-0.4724 2.3844,-1.1633 0.5964,-0.691 1.1149,-2.0469 1.5874,-3.456 0.9456,-2.8096 0.9336,-5.4491 0,-9.1658 -0.3252,-1.2978 -0.7976,-2.3461 -1.4257,-3.0552 -0.628,-0.7091 -1.357,-1.1202 -2.5461,-1.1202 z m 1.6294,1.6294 h 1.7867 c 0.5202,0 1.1993,0.4194 1.324,0.5602 0.3625,0.4093 0.78,1.2386 1.0694,2.3932 0.8895,3.5416 0.8915,5.7515 0.05,8.2491 -0.4517,1.347 -0.9205,2.6142 -1.2729,3 -0.3184,0.3395 -1,0.5093 -1.1713,0.5093 l -4.7865,-0.051 H 22.0768 v 4.9384 h 10.052 v 2 c 0,0.727 -0.9733,1.1789 -1.1408,1.3239 -0.4872,0.4219 -1.3508,0.8359 -2.3423,1.1202 -3.223,0.9264 -5.5,0.7859 -8.1984,0 -1.0211,-0.2975 -1.9061,-0.7339 -2.4069,-1.1595 -0.5008,-0.4256 -0.5316,-0.7741 -0.6238,-1.285 l -0.056,-9.0129 c -0.013,-2.0224 0.6457,-2.8084 2.3748,-2.8084 h 8.2491 c 4.9233,0 9.1103,-4.3502 9.1103,-9.0052 1e-4,-0.2574 -10e-5,-0.5149 -10e-5,-0.7723 z"
       opacity="0.384"
       fill="#ffffff"
       id="path4704"
       style="stroke-width:2.25792" /><path
       style="fill:url(#lg6);stroke-width:1.6316"
       d="m 13.9847,7.3199 c 0,-2.7319 0.7324,-4.2182 4.7772,-4.926 2.7462,-0.4813 6.2673,-0.5414 9.5513,0 2.5939,0.4282 4.7774,2.3604 4.7774,4.926 v 9.0134 c 0,2.6434 -2.1198,4.8091 -4.7774,4.8091 l -8.6621,0.4788 c -3.2414,0 -6.589,2.8321 -6.589,5.957 l -0.2736,3.777 h -3.284 c -2.7779,0 -4.3951,-2.0029 -5.0745,-4.8056 -0.9166,-3.7651 -0.8776,-6.0088 0,-9.6147 0.7608,-3.1461 3.192,-4.8058 5.7,-4.8058 h 3.5848 c 0,0 8.9448,-0.035 0,-0.032 V 7.32 v 0 z"
       fill="url(#lg6)"
       id="path4706" /><path
       d="m 16.3733,6.7218 c 0,-1 0.8,-1.8048 1.7906,-1.8048 0.9873,0 1.7907,0.8068 1.7907,1.8048 0,0.9944 -0.8034,1.8012 -1.7907,1.8012 -0.9908,0 -1.7906,-0.8068 -1.7906,-1.8012 z"
       fill="#ffffff"
       id="path4708"
       style="stroke-width:2.25792" /><path
       style="fill:url(#lg5);stroke-width:2.25792"
       d="M 22.7173,1.9955 C 21.3039,2.0297 19.9469,2.1923 18.7455,2.4028 14.7007,3.1106 14.01,4.6102 14.01,7.3421 l -0.2952,4.787 -3.3203,-3e-4 c -2.7779,0 -5.1968,1.6406 -5.9576,4.7864 -0.5165,2.1225 -0.7504,3.7842 -0.6621,5.5504 6.2924,-7.1319 13.0442,-7.6531 16.3965,-7.638 6.6376,0.029 9.7637,-1.6029 12.9338,-5.1939 V 7.3423 c 0,-2.5655 -2.1926,-4.511 -4.7865,-4.9392 C 26.4714,2.0983 24.5345,1.9515 22.7173,1.9955 Z"
       opacity="0.377"
       fill="url(#lg5)"
       id="path4710" /><path
       d="m 18.696,2.6271 c 3.6201,-1.0404 6.5255,-0.8811 9.551,0 2.5268,0.7361 4.7787,2.24 4.7774,4.8057 v 9.7315 c 0,1.3662 -1.9746,4.5293 -4.7726,4.5293 H 19.353 c -2.4983,0 -5.997,2.7217 -5.997,5.981 v 3.7937 h -4.21 c -2.7815,0 -4.0909,-2.0667 -4.7774,-4.8058 -0.9555,-3.8041 -1,-6.6493 0,-9.6148 0.9661,-2.8806 2,-5.1477 4.7774,-5.1477 h 4.2985 10.03 v 0.019 l -10.03,-0.034 0.019,-4.8733 c -0.026,-1.9965 2.4146,-3.5524 5.2323,-4.3845 z"
       fill="none"
       stroke="#274e70"
       stroke-width="2.65951"
       id="path4712" /><path
       d="m 12.5337,30.6538 v -2.796 c 0,-3.7246 3.3953,-7.0287 7.0461,-7.0287 h 8.6839 c 2.1549,0 4.024,-2.2411 4.0042,-4.3821 L 32.1845,7.434 C 32.1748,6.3895 31.8123,5.6105 31.0642,4.9389 30.3163,4.2673 29.1916,3.7558 28.009,3.4113 c -2.9166,-0.8494 -5.5762,-1.0023 -9.0639,0 -1.1326,0.3248 -2.6396,0.94 -3.3976,1.5964 -0.7582,0.6564 -1.3076,1.296 -1.3076,2.4263 v 3.6298 h 10.0519 v 1.6804 L 9.1175,12.6932 c -1.2,0 -1.788,0.4724 -2.3844,1.1634 -0.5964,0.6908 -1.1149,2.0467 -1.5874,3.4559 -0.9456,2.8096 -0.9335,5.449 0,9.1657 0.3252,1.2978 0.7976,2.3461 1.4258,3.0552 0.628,0.7092 1.357,1.1203 2.546,1.1203 h 3.4162 z M 10.9042,29.0243 H 9.1175 c -0.52,0 -1.2,-0.4194 -1.3239,-0.56 C 7.431,28.0549 7.0135,27.2255 6.7241,26.0709 5.8346,22.5294 5.8327,20.3196 6.6736,17.8218 7.1253,16.475 7.5941,15.2077 7.9466,14.8319 8.265,14.4926 8.9375,14.3227 9.1178,14.3227 l 16.8038,0.051 V 9.4343 H 15.8697 v -2 c 0,-0.727 0.9732,-1.1789 1.1407,-1.3239 0.4873,-0.4219 1.3509,-0.8359 2.3424,-1.12 3.2229,-0.9262 5.5,-0.7858 8.1983,0 1.0212,0.2975 1.9061,0.7339 2.3932,1.1712 0.1733,0.1352 0.2646,0.2973 0.4078,0.4582 0.1987,0.237 0.1552,0.55023 0.2011,0.8147 v 9.013 c 0,1.2357 -1.0565,2.7527 -2.2913,2.7527 H 19.578 c -4.5897,0 -8.6756,4.0029 -8.6756,8.6581 0,0.3875 0,1.166 0,1.166 z"
       opacity="0.165"
       fill="#ffffff"
       id="path4714"
       style="stroke-width:2.25792" /></g><path
     style="font-variation-settings:normal;opacity:1;vector-effect:none;fill:none;fill-opacity:1;stroke:#e6e6e6;stroke-width:0.264583px;stroke-linecap:butt;stroke-linejoin:miter;stroke-miterlimit:4;stroke-dasharray:none;stroke-dashoffset:0;stroke-opacity:1;-inkscape-stroke:none;stop-color:#000000;stop-opacity:1"
     d="m 88.563555,19.854496 0,48.615009"
     id="path23341"
     sodipodi:nodetypes="cc" /><g
     id="g28387"
     transform="translate(0,-0.4213638)"><rect
       style="font-variation-settings:normal;opacity:1;vector-effect:none;fill:none;fill-opacity:1;stroke:#e6e6e6;stroke-width:0.5;stroke-linecap:square;stroke-linejoin:miter;stroke-miterlimit:10;stroke-dasharray:none;stroke-dashoffset:0;stroke-opacity:1;-inkscape-stroke:none;stop-color:#000000;stop-opacity:1"
       id="rect27721"
       width="51.421989"
       height="19.604992"
       x="63.30579"
       y="68.890869" /><text
       xml:space="preserve"
       style="font-style:normal;font-variant:normal;font-weight:normal;font-stretch:normal;font-size:3.40883px;line-height:1.25;font-family:'Liberation Mono';-inkscape-font-specification:'Liberation Mono';letter-spacing:0px;word-spacing:0px;fill-opacity:1;stroke-width:0.264583"
       x="64.213089"
       y="72.978928"
       id="text27727"
       transform="scale(1.0054786,0.99455126)"
       class="code"><tspan
         sodipodi:role="line"
         id="tspan27725"
         x="64.213089"
         y="72.978928"
         class="code-keyword">class</tspan><tspan
         id="tspan27723"> PyTNLP : TNLP</tspan></text><path
       style="font-variation-settings:normal;opacity:1;vector-effect:none;fill:none;fill-opacity:1;stroke:#e6e6e6;stroke-width:0.264583px;stroke-linecap:butt;stroke-linejoin:miter;stroke-miterlimit:4;stroke-dasharray:none;stroke-dashoffset:0;stroke-opacity:1;-inkscape-stroke:none;stop-color:#000000;stop-opacity:1"
       d="M 63.143857,73.926337 H 114.72778"
       id="path27729"
       sodipodi:nodetypes="cc" /><text
       xml:space="preserve"
       style="font-style:normal;font-variant:normal;font-weight:normal;font-stretch:normal;font-size:3.40883px;line-height:1.25;font-family:'Liberation Mono';-inkscape-font-specification:'Liberation Mono';letter-spacing:0px;word-spacing:0px;fill-opacity:1;stroke-width:0.264583"
       x="64.213089"
       y="78.417084"
       id="text27739"
       transform="scale(1.0054786,0.99455126)"
       class="code"><tspan
         sodipodi:role="line"
         id="tspan27737"
         x="64.213089"
         y="78.417084"
         class="code-keyword">virtual </tspan><tspan
         id="tspan27731"
         class="code-type">bool</tspan><tspan
         id="tspan27735"> eval_f</tspan><tspan
         id="tspan27733"
         class="code-punctuation">(...)</tspan></text><text
       xml:space="preserve"
       style="font-style:normal;font-variant:normal;font-weight:normal;font-stretch:normal;font-size:3.40883px;line-height:1.25;font-family:'Liberation Mono';-inkscape-font-specification:'Liberation Mono';letter-spacing:0px;word-spacing:0px;fill-opacity:1;stroke-width:0.264583"
       x="64.213089"
       y="83.167603"
       id="text27749"
       transform="scale(1.0054786,0.99455126)"
       class="code"><tspan
         sodipodi:role="line"
         id="tspan27747"
         x="64.213089"
         y="83.167603"
         class="code-keyword">virtual </tspan><tspan
         id="tspan27741"
         class="code-type">bool</tspan><tspan
         id="tspan27745"> eval_g</tspan><tspan
         id="tspan27743"
         class="code-punctuation">(...)</tspan></text><text
       xml:space="preserve"
       style="font-style:normal;font-variant:normal;font-weight:normal;font-stretch:normal;font-size:3.40883px;line-height:1.25;font-family:'Liberation Mono';-inkscape-font-specification:'Liberation Mono';letter-spacing:0px;word-spacing:0px;fill-opacity:1;stroke-width:0.264583"
       x="64.213089"
       y="87.157097"
       id="text27755"
       transform="scale(1.0054786,0.99455126)"
       class="code"><tspan
         id="tspan27751">...</tspan></text></g><path
     id="path28109"
     style="fill:#ffdd55;stroke:none;stroke-width:0.264583px;stroke-linecap:butt;stroke-linejoin:miter;stroke-opacity:1"
     d="m 59.547928,75.135465 -2.695443,1.556495 2.695443,1.555977 v -1.079521 h 1.994144 v 1.079521 l 2.695442,-1.555977 -2.695442,-1.556495 v 1.080038 h -1.994144 z"
     sodipodi:nodetypes="ccccccccccc" /><path
     id="path28245"
     style="fill:#ffdd55;stroke:none;stroke-width:0.264583px;stroke-linecap:butt;stroke-linejoin:miter;stroke-opacity:1"
     d="m 41.578856,72.62456 1.556495,2.695443 1.555977,-2.695443 H 43.611807 V 58.854546 h 1.079521 l -1.555977,-2.695442 -1.556495,2.695442 h 1.080038 V 72.62456 Z"
     sodipodi:nodetypes="ccccccccccc" /><g
     inkscape:label="Layer 1"
     id="layer1-8"
     transform="matrix(0.63877227,0,0,0.63877227,57.528687,-0.2503366)"
     style="stroke-width:1.5655"><path
       id="path1702"
       style="opacity:1;fill:#666666;fill-opacity:1;stroke:none;stroke-width:0.344387;stop-color:#000000"
       d="m 85.217174,93.013788 a 11.960393,11.960393 0 0 0 -1.074353,0.05374 l -0.171565,2.32854 a 9.6638031,9.6638031 0 0 0 -4.645712,1.924431 l -1.7663,-1.524455 a 11.960393,11.960393 0 0 0 -1.519804,1.520321 l 1.523938,1.7663 a 9.6638031,9.6638031 0 0 0 -1.923397,4.645195 l -2.329057,0.17157 a 11.960393,11.960393 0 0 0 -0.05426,1.07487 11.960393,11.960393 0 0 0 0.05374,1.07487 l 2.329573,0.17105 a 9.6638031,9.6638031 0 0 0 1.923914,4.64571 l -1.524455,1.7663 a 11.960393,11.960393 0 0 0 1.519804,1.52032 l 1.7663,-1.52446 a 9.6638031,9.6638031 0 0 0 4.645712,1.92392 l 0.171565,2.32905 a 11.960393,11.960393 0 0 0 1.074353,0.0537 11.960393,11.960393 0 0 0 1.07487,-0.0543 l 0.171566,-2.32906 a 9.6638031,9.6638031 0 0 0 4.645711,-1.9234 l 1.765784,1.52394 a 11.960393,11.960393 0 0 0 1.52032,-1.52032 l -1.523938,-1.76578 a 9.6638031,9.6638031 0 0 0 1.923397,-4.64571 l 2.329057,-0.17105 a 11.960393,11.960393 0 0 0 0.05374,-1.07487 11.960393,11.960393 0 0 0 -0.05426,-1.07487 l -2.322855,-0.17105 a 9.6638031,9.6638031 0 0 0 -1.926498,-4.648816 l 1.521354,-1.762683 a 11.960393,11.960393 0 0 0 -1.52032,-1.52032 l -1.762683,1.521354 a 9.6638031,9.6638031 0 0 0 -4.649329,-1.927014 l -0.171049,-2.322856 a 11.960393,11.960393 0 0 0 -1.07487,-0.05426 z m 0,5.106665 a 6.8538942,6.8538942 0 0 1 6.853846,6.853847 6.8538942,6.8538942 0 0 1 -6.853846,6.85384 6.8538942,6.8538942 0 0 1 -6.853845,-6.85384 6.8538942,6.8538942 0 0 1 6.853845,-6.853847 z" /><g
       id="g1311"
       transform="matrix(0.62339765,0,0,0.62339765,31.77007,39.315798)"
       style="stroke-width:1.5655"><g
         id="g1306"
         transform="translate(27.086996,1.7642494)"
         style="stroke-width:1.5655"><path
           id="path4702-4"
           style="opacity:1;fill:#ffd43b;fill-opacity:1;stroke:none;stroke-width:1.5655"
           d="m 63.609208,99.069662 v 1.554428 c 0,2.20689 -1.480656,3.21111 -2.765722,3.20911 l -4.396115,-0.006 c -1.098899,-0.001 -2.236789,1.04301 -2.234489,2.36885 l 0.0067,3.99407 c 0.0025,1.43197 1.125604,2.04154 2.215886,2.35903 1.305539,0.38017 2.592661,0.5756 4.231783,0.0527 1.028944,-0.32824 2.401461,-0.80975 2.400887,-2.41225 l -5.17e-4,-1.55753 -4.429704,-0.015 v -0.58342 h 6.040459 c 1.396577,0 1.994198,-0.11718 2.694925,-1.88981 0.496455,-1.25588 0.596631,-2.98322 0.184485,-4.62452 -0.29672,-1.18165 -0.932145,-2.449468 -2.132169,-2.449468 z m -2.505273,10.680488 a 0.82913679,0.82913679 0 0 1 0.829406,0.82889 0.82913679,0.82913679 0 0 1 -0.829406,0.82889 0.82913679,0.82913679 0 0 1 -0.82889,-0.82889 0.82913679,0.82913679 0 0 1 0.82889,-0.82889 z" /><path
           id="use555"
           style="fill:#306998;fill-opacity:1;stroke:none;stroke-width:1.5655"
           d="m 53.68713,108.04886 v -1.55443 c 0,-2.20689 1.480656,-3.21111 2.765722,-3.20911 l 4.396115,0.006 c 1.098899,0.001 2.236789,-1.04301 2.234489,-2.36885 l -0.0067,-3.99407 c -0.0025,-1.43197 -1.125604,-2.04154 -2.215886,-2.35903 -1.305539,-0.38017 -2.592661,-0.5756 -4.231783,-0.0527 -1.028944,0.32824 -2.401461,0.80975 -2.400887,2.41225 l 5.17e-4,1.55753 4.429704,0.015 v 0.58342 h -6.040459 c -1.396577,0 -1.994198,0.11718 -2.694925,1.88981 -0.496455,1.25588 -0.596631,2.98322 -0.184485,4.62452 0.29672,1.18165 0.932145,2.44947 2.132169,2.44947 z m 2.505273,-10.68049 a 0.82913679,0.82913679 0 0 1 -0.829406,-0.82889 0.82913679,0.82913679 0 0 1 0.829406,-0.82889 0.82913679,0.82913679 0 0 1 0.82889,0.82889 0.82913679,0.82913679 0 0 1 -0.82889,0.82889 z" /></g></g></g><rect
     style="font-variation-settings:normal;opacity:1;vector-effect:none;fill:none;fill-opacity:1;stroke:#e6e6e6;stroke-width:0.5;stroke-linecap:square;stroke-linejoin:miter;stroke-miterlimit:10;stroke-dasharray:none;stroke-dashoffset:0;stroke-opacity:1;-inkscape-stroke:none;stop-color:#000000;stop-opacity:1"
     id="rect1874"
     width="34.649326"
     height="5.2301865"
     x="64.680367"
     y="93.811089"
     ry="2.6150932" /><text
     xml:space="preserve"
     style="font-style:normal;font-variant:normal;font-weight:normal;font-stretch:normal;font-size:3.40883px;line-height:1.25;font-family:'Liberation Mono';-inkscape-font-specification:'Liberation Mono';letter-spacing:0px;word-spacing:0px;fill:#e6e6e6;fill-opacity:1;stroke-width:0.264583"
     x="67.251884"
     y="98.227905"
     id="text4102-6"
     transform="scale(1.0054786,0.99455126)"
     class="code"><tspan
       id="tspan7615-2"
       class="code-type">void *</tspan><tspan
       id="tspan5212-9"> f</tspan></text><path
     style="font-variation-settings:normal;opacity:1;vector-effect:none;fill:none;fill-opacity:1;stroke:#e6e6e6;stroke-width:0.264583px;stroke-linecap:butt;stroke-linejoin:miter;stroke-miterlimit:4;stroke-dasharray:none;stroke-dashoffset:0;stroke-opacity:1;-inkscape-stroke:none;stop-color:#000000;stop-opacity:1"
     d="m 88.563555,88.074497 0,16.822813"
     id="path2136"
     sodipodi:nodetypes="cc" /><text
     xml:space="preserve"
     style="font-style:normal;font-variant:normal;font-weight:normal;font-stretch:normal;font-size:3.40883px;line-height:1.25;font-family:'Liberation Mono';-inkscape-font-specification:'Liberation Mono';letter-spacing:0px;word-spacing:0px;fill:#e6e6e6;fill-opacity:1;stroke-width:0.264583"
     x="94.657425"
     y="98.249542"
     id="text2540"
     transform="scale(1.0054786,0.99455126)"
     class="code"><tspan
       id="tspan2538">f</tspan></text><path
     id="path2662"
     style="fill:#ffdd55;stroke:none;stroke-width:0.264583px;stroke-linecap:butt;stroke-linejoin:miter;stroke-opacity:1"
     d="m 76.183037,91.977191 1.556495,2.695443 1.555977,-2.695443 h -1.079521 v -1.994144 h 1.079521 l -1.555977,-2.695442 -1.556495,2.695442 h 1.080038 v 1.994144 z"
     sodipodi:nodetypes="ccccccccccc" /><text
     xml:space="preserve"
     style="font-style:normal;font-variant:normal;font-weight:normal;font-stretch:normal;font-size:3.14416px;line-height:1.25;font-family:'Liberation Mono';-inkscape-font-specification:'Liberation Mono';letter-spacing:0px;word-spacing:0px;stroke-width:0.264583;fill:#e6e6e6;fill-opacity:1"
     x="65.155388"
     y="102.59633"
     id="text2666"><tspan
       sodipodi:role="line"
       id="tspan2664"
       style="font-style:normal;font-variant:normal;font-weight:normal;font-stretch:normal;font-size:3.14416px;font-family:'Liberation Mono';-inkscape-font-specification:'Liberation Mono';stroke-width:0.264583;fill:#e6e6e6;fill-opacity:1"
       x="65.155388"
       y="102.59633">PyCapsule</tspan></text></g></svg>
