<?xml version="1.0" encoding="UTF-8" standalone="no"?>
<!-- Created with Inkscape (http://www.inkscape.org/) -->

<svg
   width="147.05139mm"
   height="31.01786mm"
   viewBox="0 0 147.05139 31.017861"
   version="1.1"
   id="svg43295"
   inkscape:version="1.1 (c68e22c387, 2021-05-23)"
   sodipodi:docname="conflict.svg"
   xmlns:inkscape="http://www.inkscape.org/namespaces/inkscape"
   xmlns:sodipodi="http://sodipodi.sourceforge.net/DTD/sodipodi-0.dtd"
   xmlns="http://www.w3.org/2000/svg"
   xmlns:svg="http://www.w3.org/2000/svg">
  <sodipodi:namedview
     id="namedview43297"
     pagecolor="#ffffff"
     bordercolor="#666666"
     borderopacity="1.0"
     inkscape:pageshadow="2"
     inkscape:pageopacity="0.0"
     inkscape:pagecheckerboard="0"
     inkscape:document-units="mm"
     showgrid="false"
     inkscape:zoom="1.1172963"
     inkscape:cx="282.3781"
     inkscape:cy="31.325621"
     inkscape:window-width="1280"
     inkscape:window-height="651"
     inkscape:window-x="0"
     inkscape:window-y="32"
     inkscape:window-maximized="1"
     inkscape:current-layer="layer1"
     inkscape:snap-global="true"
     fit-margin-top="0"
     fit-margin-left="0"
     fit-margin-right="0"
     fit-margin-bottom="0" />
  <defs
     id="defs43292" />
  <g
     inkscape:label="Layer 1"
     inkscape:groupmode="layer"
     id="layer1"
     transform="translate(57.042122,-139.24617)">
    <path
       style="fill:none;stroke:#b3b3b3;stroke-width:1;stroke-linecap:butt;stroke-linejoin:miter;stroke-miterlimit:4;stroke-dasharray:4, 8;stroke-dashoffset:0;stroke-opacity:1"
       d="M 90.009277,146.64371 H 61.307168"
       id="path3179"
       sodipodi:nodetypes="cc" />
    <path
       style="fill:none;stroke:#b3b3b3;stroke-width:1;stroke-linecap:butt;stroke-linejoin:miter;stroke-miterlimit:4;stroke-dasharray:4, 8;stroke-dashoffset:0;stroke-opacity:1"
       d="M 90.009277,162.78571 H 76.373021 m -46.583549,0 H 4.4116731"
       id="path99796"
       sodipodi:nodetypes="cccc" />
    <rect
       style="fill:#b3e3ff;fill-opacity:1;stroke:#000000;stroke-width:1;stroke-miterlimit:4;stroke-dasharray:none;stroke-opacity:1;paint-order:fill stroke;stop-color:#000000"
       id="rect44150"
       width="47.581066"
       height="13.956627"
       x="-56.542122"
       y="139.74617" />
    <text
       xml:space="preserve"
       style="font-size:10.5833px;line-height:1.25;font-family:'Liberation Sans';-inkscape-font-specification:'Liberation Sans';letter-spacing:0px;word-spacing:0px;stroke-width:0.264583"
       x="-53.905586"
       y="150.50719"
       id="text50125"><tspan
         sodipodi:role="line"
         id="tspan50123"
         style="stroke-width:0.264583"
         x="-53.905586"
         y="150.50719">main</tspan></text>
    <rect
       style="fill:#b18be8;fill-opacity:1;stroke:#000000;stroke-width:1;stroke-miterlimit:4;stroke-dasharray:none;stroke-opacity:1;paint-order:fill stroke;stop-color:#000000"
       id="rect50513"
       width="47.581066"
       height="13.956627"
       x="-56.542122"
       y="155.8074" />
    <text
       xml:space="preserve"
       style="font-size:10.5833px;line-height:1.25;font-family:'Liberation Sans';-inkscape-font-specification:'Liberation Sans';letter-spacing:0px;word-spacing:0px;stroke-width:0.264583"
       x="-53.905586"
       y="166.56842"
       id="text50517"><tspan
         sodipodi:role="line"
         id="tspan50515"
         style="stroke-width:0.264583"
         x="-53.905586"
         y="166.56842">feature</tspan></text>
    <path
       style="fill:none;stroke:#000000;stroke-width:1;stroke-linecap:butt;stroke-linejoin:miter;stroke-miterlimit:4;stroke-dasharray:none;stroke-opacity:1"
       d="M 46.669793,146.72448 H 6.1696946"
       id="path72794"
       sodipodi:nodetypes="cc" />
    <path
       id="path100791"
       style="fill:none;stroke:#000000;stroke-width:1;stroke-linecap:butt;stroke-linejoin:miter;stroke-miterlimit:4;stroke-dasharray:none;stroke-opacity:1"
       d="M 65.270643,162.85543 H 45.4835 c -20.77045,0 0.676224,-16.4706 -26.133093,-16.13095"
       sodipodi:nodetypes="csc" />
    <circle
       style="fill:#b18be8;fill-opacity:1;stroke:#000000;stroke-width:1;stroke-miterlimit:4;stroke-dasharray:none;paint-order:fill stroke;stop-color:#000000"
       id="circle101265"
       cx="50.942364"
       cy="162.90607"
       r="3.7168486" />
    <circle
       style="fill:#b18be8;fill-opacity:1;stroke:#000000;stroke-width:1;stroke-miterlimit:4;stroke-dasharray:none;paint-order:fill stroke;stop-color:#000000"
       id="circle101267"
       cx="63.686413"
       cy="162.90607"
       r="3.7168486" />
    <circle
       style="fill:#b3e3ff;fill-opacity:1;stroke:#000000;stroke-width:1;stroke-miterlimit:4;stroke-dasharray:none;paint-order:fill stroke;stop-color:#000000"
       id="path65219"
       cx="5.5132403"
       cy="146.64609"
       r="3.7168486" />
    <circle
       style="fill:#b3e3ff;fill-opacity:1;stroke:#000000;stroke-width:1;stroke-miterlimit:4;stroke-dasharray:none;paint-order:fill stroke;stop-color:#000000"
       id="circle68347"
       cx="18.560255"
       cy="146.64609"
       r="3.7168486" />
    <circle
       style="fill:#b3e3ff;fill-opacity:1;stroke:#000000;stroke-width:1;stroke-miterlimit:4;stroke-dasharray:none;paint-order:fill stroke;stop-color:#000000"
       id="circle100129"
       cx="46.471798"
       cy="146.64609"
       r="3.7168486" />
    <path
       style="fill:#ff7f2a;stroke:none;stroke-width:0.264583px;stroke-linecap:butt;stroke-linejoin:miter;stroke-opacity:1"
       d="m 46.669793,146.72448 0.238652,11.00707 2.84608,-2.69627 1.303192,8.18968 -0.05399,-11.85319 -2.777928,3.05838 z"
       id="path1236"
       sodipodi:nodetypes="ccccccc" />
  </g>
</svg>
