order,surname,firstname,legi,Administration_Office,Direction,E-mail
1,Daecher,Antje,84-537-845,PHYS,Physics BSc,adaecher@student.ethz.ch
2,Strauss,Susanne,55-253-446,CHAB-IN,Interdisc.Sc (Phys Chem),sstrauss@student.ethz.ch
3,Schröder,Jens Thorsten,84-775-899,PHYS,Physics (Mobility),jtschroeder@student.ethz.ch