0 0.0000 127.0000 133.8326
1 4.0402 128.0000 133.8071
2 6.0603 129.0000 133.8744
3 8.0804 130.0000 133.8489
4 10.1005 131.0000 133.8490
5 12.1206 132.0000 133.8235
6 16.1608 133.0000 133.8237
7 20.2010 134.0000 133.8239
8 24.2412 135.0000 133.8239
9 28.2814 136.0000 133.8239
10 32.3216 137.0000 133.8236
11 36.3618 138.0000 133.8235
12 40.4020 139.0000 133.8234
13 44.4422 140.0000 133.8235
14 48.4824 141.0000 133.8222
15 52.5226 142.0000 133.8243
16 56.5628 143.0000 133.8248
17 60.6030 144.0000 133.8253
18 64.6432 145.0000 133.8257
19 68.6834 146.0000 133.8261
20 72.7236 147.0000 133.8265
21 76.7638 148.0000 133.8268
22 80.8040 149.0000 133.8271
23 84.8442 150.0000 133.8274
24 88.8844 151.0000 133.8276
25 92.9246 152.0000 133.8279
26 96.9648 153.0000 133.8281
27 101.0050 154.0000 133.1701
28 105.0452 155.0000 131.7359
29 109.0854 156.0000 130.2985
30 113.1256 157.0000 128.8478
31 117.1658 158.0000 127.3855
32 121.2060 159.0000 125.9129
33 125.2462 160.0000 124.4312
34 129.2864 161.0000 122.9419
35 133.3266 162.0000 121.4464
36 137.3668 163.0000 119.9463
37 141.4070 164.0000 118.4431
38 145.4472 165.0000 116.9382
39 149.4874 166.0000 115.4328
40 153.5276 167.0000 113.9283
41 157.5678 168.0000 112.4255
42 161.6080 169.0000 110.9258
43 165.6482 170.0000 109.4300
44 169.6884 171.0000 107.9391
45 173.7286 172.0000 106.4543
46 177.7688 173.0000 104.9764
47 181.8090 174.0000 103.5065
48 185.8492 175.0000 102.0454
49 189.8894 176.0000 100.5942
50 193.9296 177.0000 99.1538
51 197.9699 178.0000 97.7252
52 202.0101 179.0000 96.3093
53 206.0503 180.0000 94.9072
54 210.0905 181.0000 93.5198
55 214.1307 182.0000 92.1484
56 218.1709 183.0000 90.7939
57 222.2111 184.0000 89.4574
58 226.2513 185.0000 88.1403
59 230.2915 186.0000 86.8436
60 234.3317 187.0000 85.5686
61 238.3719 188.0000 84.3168
62 242.4121 189.0000 83.0894
63 246.4523 190.0000 81.8879
64 250.4925 191.0000 80.7137
65 254.5327 192.0000 79.5685
66 258.5729 193.0000 78.4539
67 262.6131 194.0000 77.3714
68 266.6533 195.0000 76.3229
69 270.6935 196.0000 75.3101
70 274.7337 197.0000 74.3348
71 278.7739 198.0000 73.3988
72 282.8141 199.0000 72.5041
73 286.8543 200.0000 71.6524
74 290.8945 201.0000 70.8458
75 294.9347 202.0000 70.0859
76 298.9749 203.0000 69.2862
77 303.0151 204.0000 69.2861
78 307.0553 205.0000 69.2860
79 311.0955 206.0000 69.2858
80 315.1357 207.0000 69.2856
81 319.1759 208.0000 69.2854
82 323.2161 209.0000 69.2851
83 327.2563 210.0000 69.2849
84 331.2965 211.0000 69.2846
85 335.3367 212.0000 69.2843
86 339.3769 213.0000 69.2840
87 343.4171 214.0000 69.2837
88 347.4573 215.0000 69.2833
89 351.4975 216.0000 69.2829
90 355.5377 217.0000 69.2824
91 359.5779 218.0000 69.2819
92 363.6181 219.0000 69.2814
93 367.6583 220.0000 69.2807
94 371.6985 221.0000 69.2800
95 375.7387 222.0000 69.2792
96 379.7789 223.0000 69.2784
97 383.8191 224.0000 69.2775
98 387.8593 225.0000 69.2766
99 391.8995 226.0000 69.2759
100 395.9397 227.0000 69.2754
101 395.9397 0.0000 69.3049
102 399.9720 1.0000 69.3905
103 404.0042 2.0000 69.5692
104 408.0365 3.0000 69.8339
105 412.0687 4.0000 70.1773
106 416.1010 5.0000 70.5953
107 420.1332 6.0000 71.0858
108 424.1655 7.0000 71.6481
109 428.1978 8.0000 72.2820
110 432.2300 9.0000 72.9875
111 436.2623 10.0000 73.7644
112 440.2945 11.0000 74.6119
113 444.3268 12.0000 75.5283
114 448.3591 13.0000 76.5103
115 452.3913 14.0000 77.5523
116 456.4236 15.0000 78.6470
117 460.4558 16.0000 79.7877
118 464.4881 17.0000 80.9675
119 468.5203 18.0000 82.1801
120 472.5526 19.0000 83.4189
121 476.5849 20.0000 84.6771
122 480.6171 21.0000 85.9480
123 484.6494 22.0000 87.2243
124 488.6816 23.0000 88.4985
125 492.7139 24.0000 89.7630
126 496.7462 25.0000 91.0099
127 500.7784 26.0000 92.2316
128 504.8107 27.0000 93.4209
129 508.8429 28.0000 94.5708
130 512.8752 29.0000 95.6755
131 516.9074 30.0000 96.7301
132 520.9397 31.0000 97.7310
133 524.9720 32.0000 98.6759
134 529.0042 33.0000 99.5639
135 533.0365 34.0000 100.3956
136 537.0687 35.0000 101.1728
137 541.1010 36.0000 101.8984
138 545.1332 37.0000 102.5762
139 549.1655 38.0000 103.2107
140 553.1978 39.0000 103.8068
141 557.2300 40.0000 104.3695
142 561.2623 41.0000 104.9038
143 565.2945 42.0000 105.4143
144 569.3268 43.0000 105.9055
145 573.3591 44.0000 106.3811
146 577.3913 45.0000 106.8446
147 581.4236 46.0000 107.2987
148 585.4558 47.0000 107.7457
149 589.4881 48.0000 108.1874
150 593.5203 49.0000 108.6251
151 597.5526 50.0000 109.0597
152 601.5849 51.0000 109.4919
153 605.6171 52.0000 109.9218
154 609.6494 53.0000 110.3498
155 613.6816 54.0000 110.7755
156 617.7139 55.0000 111.1990
157 621.7462 56.0000 111.6199
158 625.7784 57.0000 112.0380
159 629.8107 58.0000 112.4530
160 633.8429 59.0000 112.8646
161 637.8752 60.0000 113.2726
162 641.9074 61.0000 113.6769
163 645.9397 62.0000 114.0774
164 649.9720 63.0000 114.4739
165 654.0042 64.0000 114.8664
166 658.0365 65.0000 115.2550
167 662.0687 66.0000 115.6397
168 666.1010 67.0000 116.0205
169 670.1332 68.0000 116.3976
170 674.1655 69.0000 116.7711
171 678.1978 70.0000 117.1410
172 682.2300 71.0000 117.5075
173 686.2623 72.0000 117.8707
174 690.2945 73.0000 118.2307
175 694.3268 74.0000 118.5876
176 698.3591 75.0000 118.9414
177 702.3913 76.0000 119.2923
178 706.4236 77.0000 119.6403
179 710.4558 78.0000 119.9856
180 714.4881 79.0000 120.3281
181 718.5203 80.0000 120.6679
182 722.5526 81.0000 121.0050
183 726.5849 82.0000 121.3397
184 730.6171 83.0000 121.6718
185 734.6494 84.0000 122.0014
186 738.6816 85.0000 122.3286
187 742.7139 86.0000 122.6534
188 746.7462 87.0000 122.9760
189 750.7784 88.0000 123.2963
190 754.8107 89.0000 123.6143
191 758.8429 90.0000 123.9303
192 762.8752 91.0000 124.2441
193 766.9074 92.0000 124.5559
194 770.9397 93.0000 124.8656
195 774.9720 94.0000 125.1735
196 779.0042 95.0000 125.4794
197 783.0365 96.0000 125.7835
198 787.0687 97.0000 126.0858
199 791.1010 98.0000 126.3863
200 795.1332 99.0000 126.6851
201 799.1655 100.0000 126.9822
202 803.1978 101.0000 127.2777
203 807.2300 102.0000 127.5715
204 811.2623 103.0000 127.8637
205 815.2945 104.0000 128.1543
206 819.3268 105.0000 128.4434
207 823.3591 106.0000 128.7310
208 827.3913 107.0000 129.0171
209 831.4236 108.0000 129.3017
210 835.4558 109.0000 129.5850
211 839.4881 110.0000 129.8668
212 843.5203 111.0000 130.1473
213 847.5526 112.0000 130.4265
214 851.5849 113.0000 130.7043
215 855.6171 114.0000 130.9809
216 859.6494 115.0000 131.2561
217 863.6816 116.0000 131.5301
218 867.7139 117.0000 131.8029
219 871.7462 118.0000 132.0745
220 875.7784 119.0000 132.3449
221 879.8107 120.0000 132.6141
222 883.8429 121.0000 132.8822
223 887.8752 122.0000 133.1492
224 891.9074 123.0000 133.4151
225 895.9397 124.0000 133.6798
226 897.9598 125.0000 133.6543
227 899.9799 126.0000 133.7203
