substance_id,iupac_name,smiles,cas,inchi,family,Scheme,a11_mu2,a2,a12_alpha,n_points,MAD,MARD/percent,T_crit/K
2,acetamide,CC(=N)O,60-35-5,"InChI=1S/C2H5NO/c1-2(3)4/h1H3,(H2,3,4)",other,P,18.943,0.1248,0.0,7,1.77,3.14,819.47
3,acetonitrile,CC#N,75-05-8,InChI=1S/C2H3N/c1-2-3/h1H3,other,All,4.592,0.1269,32.702,64,0.52,1.8,538.15
4,propan-2-one,CC(C)=O,67-64-1,InChI=1S/C3H6O/c1-3(2)4/h1-2H3,ketones,P,9.145,0.2089,0.0,52,0.43,2.35,521.38
5,"ethane-1,2-diamine",NCCN,107-15-3,InChI=1S/C2H8N2/c3-1-2-4/h1-4H2,other,P,5.288,0.0,0.0,2,1.14,8.08,613.74
6,"1,2-dibromoethane",BrCCBr,106-93-4,InChI=1S/C2H4Br2/c3-1-2-4/h1-2H2,other,All,1.485,1.0,18.821,16,0.07,1.48,656.98
7,bromoethane,CCBr,74-96-4,"InChI=1S/C2H5Br/c1-2-3/h2H2,1H3",other,All,3.291,0.2635,12.649,21,0.07,0.74,511.77
8,"ethane-1,2-diol",OCCO,107-21-1,"InChI=1S/C2H6O2/c3-1-2-4/h3-4H,1-2H2",other,P,10.011,0.1323,0.0,32,0.92,2.46,754.41
9,iodoethane,CCI,75-03-6,"InChI=1S/C2H5I/c1-2-3/h2H2,1H3",other,P,5.122,0.534,0.0,8,0.06,0.77,576.84
11,ethanol,CCO,64-17-5,"InChI=1S/C2H6O/c1-2-3/h3H,2H2,1H3",n-alcohols,P,7.379,0.147,0.0,63,0.49,3.31,532.99
12,ethoxyethane,CCOCC,60-29-7,"InChI=1S/C4H10O/c1-3-5-4-2/h3-4H2,1-2H3",ethers,All,2.63,0.0626,5.436,89,0.12,3.01,476.73
13,oxirane,C1CO1,75-21-8,InChI=1S/C2H4O/c1-2-3-1/h1-2H2,other,P,3.673,0.12,0.0,1,0.0,0.0,477.68
14,prop-2-en-1-ol,C=CCO,107-18-6,"InChI=1S/C3H6O/c1-2-3-4/h2,4H,1,3H2",other,All,5.642,0.1116,13.167,19,1.12,3.82,569.53
15,formic acid,O=CO,64-18-6,"InChI=1S/CH2O2/c2-1-3/h1H,(H,2,3)",other,P,8.223,0.1217,0.0,6,0.02,0.04,639.29
17,aniline,Nc1ccccc1,62-53-3,"InChI=1S/C6H7N/c7-6-4-2-1-3-5-6/h1-5H,7H2",other,All,2.418,0.0,15.279,25,0.25,4.04,725.4
18,anisole,COc1ccccc1,100-66-3,"InChI=1S/C7H8O/c1-8-7-5-3-2-4-6-7/h2-6H,1H3",other,All,2.977,1.0,9.293,26,0.09,2.17,659.44
19,2-methylpyridine,Cc1ccccn1,109-06-8,"InChI=1S/C6H7N/c1-6-4-2-3-5-7-6/h2-5H,1H3",other,P,7.288,0.3796,0.0,5,0.14,1.46,633.52
20,"2,6,6-trimethylbicyclo[3.1.1]hept-2-ene",CC1=CCC2CC1C2(C)C,80-56-8,"InChI=1S/C10H16/c1-7-4-5-8-6-9(7)10(8,2)3/h4,8-9H,5-6H2,1-3H3",other,NP,0.0,0.0,22.668,2,0.2,8.02,643.71
21,ethyl acetate,CCOC(C)=O,141-78-6,"InChI=1S/C4H8O2/c1-3-6-4(2)5/h3H2,1-2H3",esters,All,3.243,0.5256,12.18,32,0.1,1.68,536.16
22,butan-2-ol,CCC(C)O,78-92-2,"InChI=1S/C4H10O/c1-3-4(2)5/h4-5H,3H2,1-2H3",other,P,7.844,0.0,0.0,63,0.95,9.41,549.7
23,"butane-2,3-diol",CC(O)C(C)O,513-85-9,"InChI=1S/C4H10O2/c1-3(5)4(2)6/h3-6H,1-2H3",other,P,11.562,0.2036,0.0,34,0.25,1.31,624.27
24,phenylmethanol,OCc1ccccc1,100-51-6,"InChI=1S/C7H8O/c8-6-7-4-2-1-3-5-7/h1-5,8H,6H2",other,P,7.706,0.0,0.0,23,0.53,4.65,752.5
25,ethylbenzene,CCc1ccccc1,100-41-4,"InChI=1S/C8H10/c1-2-8-6-4-3-5-7-8/h3-7H,2H2,1H3",aromatics,NP,0.0,0.0,16.799,15,0.02,0.86,632.35
26,bromobenzene,Brc1ccccc1,108-86-1,InChI=1S/C6H5Br/c7-6-4-2-1-3-5-6/h1-5H,other,P,4.961,0.8405,0.0,22,0.09,1.64,684.27
27,chlorobenzene,Clc1ccccc1,108-90-7,InChI=1S/C6H5Cl/c7-6-4-2-1-3-5-6/h1-5H,other,All,3.262,0.5826,11.256,60,0.06,1.12,646.77
28,"1,4-dichlorobenzene",Clc1ccc(Cl)cc1,106-46-7,InChI=1S/C6H4Cl2/c7-5-1-2-6(8)4-3-5/h1-4H,other,NP,0.0,0.0,18.183,2,0.2,7.61,702.37
29,benzonitrile,N#Cc1ccccc1,100-47-0,InChI=1S/C7H5N/c8-6-7-4-2-1-3-5-7/h1-5H,other,All,11.601,0.2047,28.784,31,0.22,0.99,715.0
30,nitrobenzene,O=[N+]([O-])c1ccccc1,98-95-3,InChI=1S/C6H5NO2/c8-7(9)6-4-2-1-3-5-6/h1-5H,other,P,17.44,0.161,0.0,67,0.56,1.75,747.53
31,benzene,c1ccccc1,71-43-2,InChI=1S/C6H6/c1-2-4-6-5-3-1/h1-6H,aromatics,All,0.048,1.0,11.236,143,0.01,0.39,571.73
32,formonitrile,C#N,74-90-8,InChI=1S/CHN/c1-2/h1H,other,P,10.103,0.0,0.0,32,10.23,7.23,466.61
34,"6,6-dimethyl-2-methylidenebicyclo[3.1.1]heptane",C=C1CCC2CC1C2(C)C,127-91-3,"InChI=1S/C10H16/c1-7-4-5-8-6-9(7)10(8,2)3/h8-9H,1,4-6H2,2-3H3",other,NP,0.0,0.0,23.918,2,0.1,3.72,663.14
36,1-bromobutane,CCCCBr,109-65-9,"InChI=1S/C4H9Br/c1-2-3-4-5/h2-4H2,1H3",other,All,3.768,0.373,15.575,17,0.01,0.21,584.65
37,molecular bromine,BrBr,7726-95-6,InChI=1S/Br2/c1-2,other,NP,0.0,0.0,9.77,5,0.03,0.87,582.16
38,2-butoxyethanol,CCCCOCCO,111-76-2,"InChI=1S/C6H14O2/c1-2-3-5-8-6-4-7/h7H,2-6H2,1H3",other,P,8.015,0.0,0.0,9,0.51,5.28,652.92
39,butan-1-ol,CCCCO,71-36-3,"InChI=1S/C4H10O/c1-2-3-4-5/h5H,2-4H2,1H3",n-alcohols,P,8.211,0.0144,0.0,80,0.53,4.51,578.19
40,butan-2-one,CCC(C)=O,78-93-3,"InChI=1S/C4H8O/c1-3-4(2)5/h3H2,1-2H3",ketones,All,8.65,0.2233,12.039,23,0.33,1.75,546.06
41,butane,CCCC,106-97-8,"InChI=1S/C4H10/c1-3-4-2/h3-4H2,1-2H3",n-alkanes,NP,0.0,0.0,8.494,42,0.0,0.12,432.93
43,2-chloroethanol,OCCCl,107-07-3,"InChI=1S/C2H5ClO/c3-1-2-4/h4H,1-2H2",other,P,8.171,0.12,0.0,1,0.0,0.0,628.07
44,1-chloro-2-methylpropane,CC(C)CCl,513-36-0,"InChI=1S/C4H9Cl/c1-4(2)3-5/h4H,3H2,1-2H3",other,All,1.288,0.0,29.719,17,0.13,1.62,539.74
46,1-chlorobutane,CCCCCl,109-69-3,"InChI=1S/C4H9Cl/c1-2-3-4-5/h2-4H2,1H3",other,P,5.772,0.3971,0.0,17,0.21,3.44,549.52
47,chloroform,ClC(Cl)Cl,67-66-3,InChI=1S/CHCl3/c2-1(3)4/h1H,other,All,2.109,0.5196,7.1,59,0.1,1.93,545.09
49,3-methylphenol,Cc1cccc(O)c1,108-39-4,"InChI=1S/C7H8O/c1-6-3-2-4-7(8)5-6/h2-5,8H,1H3",other,P,7.216,0.0,0.0,16,0.52,6.86,720.12
50,cyclohexane,C1CCCCC1,110-82-7,InChI=1S/C6H12/c1-2-4-6-5-3-1/h1-6H2,cycloalkanes,All,0.073,0.9999,11.068,51,0.01,0.35,561.17
51,cyclopentane,C1CCCC1,287-92-3,InChI=1S/C5H10/c1-2-4-5-3-1/h1-5H2,cycloalkanes,All,0.0,1.0,9.545,12,0.0,0.16,521.77
52,cyclohexene,C1=CCCCC1,110-83-8,"InChI=1S/C6H10/c1-2-4-6-5-3-1/h1-2H,3-6H2",other,NP,0.0,0.0,12.466,4,0.01,0.31,569.79
53,methylcyclohexane,CC1CCCCC1,108-87-2,"InChI=1S/C7H14/c1-7-5-3-2-4-6-7/h7H,2-6H2,1H3",other,NP,0.0,0.0,13.772,3,0.03,1.6,582.15
56,1-chloro-2-(2-chloroethoxy)ethane,ClCCOCCCl,111-44-4,InChI=1S/C4H8Cl2O/c5-1-3-7-4-2-6/h1-4H2,other,P,11.453,0.0,0.0,2,0.35,1.76,687.69
57,1-butoxybutane,CCCCOCCCC,142-96-1,"InChI=1S/C8H18O/c1-3-5-7-9-8-6-4-2/h3-8H2,1-2H3",ethers,All,2.115,0.0,14.861,18,0.03,1.0,596.79
60,decane,CCCCCCCCCC,124-18-5,"InChI=1S/C10H22/c1-3-5-7-9-10-8-6-4-2/h3-10H2,1-2H3",n-alkanes,NP,0.0,0.0,20.234,17,0.01,0.59,631.72
61,n-ethylethanamine,CCNCC,109-89-7,"InChI=1S/C4H11N/c1-3-5-4-2/h5H,3-4H2,1-2H3",other,P,2.89,0.0,0.0,15,0.17,4.66,508.7
63,"n,n-dimethylaniline",CN(C)c1ccccc1,121-69-7,"InChI=1S/C8H11N/c1-9(2)8-6-4-3-5-7-8/h3-7H,1-2H3",other,P,5.771,1.0,0.0,9,0.09,1.92,707.32
65,"1,2-dibromopropane",CC(Br)CBr,78-75-1,"InChI=1S/C3H6Br2/c1-3(5)2-4/h3H,2H2,1H3",other,P,3.451,0.12,0.0,1,0.0,0.0,658.83
67,"1,1-dichloroethane",CC(Cl)Cl,75-34-3,"InChI=1S/C2H4Cl2/c1-2(3)4/h2H,1H3",other,P,6.306,0.3331,0.0,5,0.35,3.38,529.02
68,"1,2-dichloroethane",ClCCCl,107-06-2,InChI=1S/C2H4Cl2/c3-1-2-4/h1-2H2,other,All,3.376,0.0,13.62,24,0.18,1.83,578.98
69,"(e)-1,2-dichloroethene",ClC=CCl,156-60-5,InChI=1S/C2H2Cl2/c3-1-2-4/h1-2H/b2-1+,other,NP,0.0,0.0,9.298,1,0.06,2.5,528.41
70,dichloromethane,ClCCl,75-09-2,InChI=1S/CH2Cl2/c2-1-3/h1H2,other,All,3.332,0.286,5.966,17,0.17,1.81,516.69
71,"1,2-dichloropropane",CC(Cl)CCl,78-87-5,"InChI=1S/C3H6Cl2/c1-3(5)2-4/h3H,2H2,1H3",other,P,6.466,0.4218,0.0,11,0.21,2.5,591.35
72,"n,n-dimethylformamide",CN(C)C=O,68-12-2,"InChI=1S/C3H7NO/c1-4(2)3-5/h3H,1-2H3",other,All,9.373,0.1361,29.535,73,0.38,1.05,671.87
74,"2,4-dimethylpentane",CC(C)CC(C)C,108-08-7,"InChI=1S/C7H16/c1-6(2)5-7(3)4/h6-7H,5H2,1-4H3",branched alkanes,NP,0.0,0.0,14.232,6,0.01,0.28,530.66
75,"1,4-dioxane",C1COCCO1,123-91-1,InChI=1S/C4H8O2/c1-2-6-4-3-5-1/h1-4H2,other,NP,0.0,0.0,10.493,33,0.02,0.87,598.1
77,"2,6-dimethylpyridine",Cc1cccc(C)n1,108-48-5,"InChI=1S/C7H9N/c1-6-4-3-5-7(2)8-6/h3-5H,1-2H3",other,P,6.247,0.3351,0.0,3,0.02,0.26,639.56
78,dodecane,CCCCCCCCCCCC,112-40-3,"InChI=1S/C12H26/c1-3-5-7-9-11-12-10-8-6-4-2/h3-12H2,1-2H3",n-alkanes,All,0.16,1.0,23.227,22,0.01,0.3,669.05
79,benzaldehyde,O=Cc1ccccc1,100-52-7,InChI=1S/C7H6O/c8-6-7-4-2-1-3-5-7/h1-6H,aldehydes,P,10.317,0.1844,0.0,8,0.57,3.25,702.23
80,butyl acetate,CCCCOC(C)=O,123-86-4,"InChI=1S/C6H12O2/c1-3-4-5-8-6(2)7/h3-5H2,1-2H3",esters,All,4.785,0.7119,5.315,24,0.08,1.57,590.09
81,cyclohexyl acetate,CC(=O)OC1CCCCC1,622-45-7,"InChI=1S/C8H14O2/c1-7(9)10-8-5-3-2-4-6-8/h8H,2-6H2,1H3",esters,All,3.946,0.8597,25.377,7,0.0,0.01,657.45
82,methyl acetate,COC(C)=O,79-20-9,InChI=1S/C3H6O2/c1-3(4)5-2/h1-2H3,esters,P,4.531,0.56,0.0,15,0.11,1.58,519.73
85,furan-2-carbaldehyde,O=Cc1ccco1,98-01-1,InChI=1S/C5H4O2/c6-4-5-2-1-3-7-5/h1-4H,other,P,15.204,0.1333,0.0,6,2.73,6.42,676.12
86,n-propylpropan-1-amine,CCCNCCC,142-84-7,"InChI=1S/C6H15N/c1-3-5-7-6-4-2/h7H,3-6H2,1-2H3",other,All,1.201,1.0,17.101,16,0.1,3.21,554.11
87,bromane,Br,10035-10-6,InChI=1S/BrH/h1H,other,P,1.359,0.5708,0.0,7,0.16,2.35,366.87
89,hexane,CCCCCC,110-54-3,"InChI=1S/C6H14/c1-3-5-6-4-2/h3-6H2,1-2H3",n-alkanes,NP,0.0,0.0,12.441,73,0.02,1.03,519.53
90,fluorane,F,7664-39-3,InChI=1S/FH/h1H,other,P,4.603,0.0573,0.0,5,2.91,2.39,563.08
91,heptane,CCCCCCC,142-82-5,"InChI=1S/C7H16/c1-3-5-7-6-4-2/h3-7H2,1-2H3",n-alkanes,NP,0.0,0.0,14.378,28,0.01,0.67,552.57
92,heptan-2-one,CCCCCC(C)=O,110-43-0,"InChI=1S/C7H14O/c1-3-4-5-6-7(2)8/h3-6H2,1-2H3",ketones,P,11.628,0.3045,0.0,11,0.21,2.1,626.34
93,hydrazine,NN,302-01-2,InChI=1S/H4N2/c1-2/h1-2H2,other,P,7.214,0.1473,0.0,5,0.03,0.06,668.91
94,2-methylbutane,CCC(C)C,78-78-4,"InChI=1S/C5H12/c1-4-5(2)3/h5H,4H2,1-3H3",branched alkanes,NP,0.0,0.0,10.452,10,0.01,0.45,469.1
95,propan-2-ol,CC(C)O,67-63-0,"InChI=1S/C3H8O/c1-3(2)4/h3-4H,1-2H3",other,All,7.868,0.128,0.0,49,0.95,8.69,524.84
96,2-propan-2-yloxypropane,CC(C)OC(C)C,108-20-3,"InChI=1S/C6H14O/c1-5(2)7-6(3)4/h5-6H,1-4H3",ethers,P,4.412,0.4821,0.0,5,0.04,1.03,505.01
97,"2,2,4-trimethylpentane",CC(C)CC(C)(C)C,540-84-1,"InChI=1S/C8H18/c1-7(2)6-8(3,4)5/h7H,6H2,1-5H3",branched alkanes,NP,0.0,0.0,16.339,22,0.0,0.21,554.11
98,"2-methylbuta-1,3-diene",C=CC(=C)C,78-79-5,"InChI=1S/C5H8/c1-4-5(2)3/h4H,1-2H2,3H3",alkenes,All,0.096,1.0,11.082,5,0.0,0.05,485.47
99,iodomethane,CI,74-88-4,InChI=1S/CH3I/c1-2/h1H3,other,P,3.825,0.6755,0.0,2,0.13,1.94,540.21
100,hex-1-ene,C=CCCCC,592-41-6,"InChI=1S/C6H12/c1-3-5-6-4-2/h3H,1,4-6H2,2H3",alkenes,All,0.217,1.0,12.061,12,0.02,0.76,514.5
103,n-propan-2-ylpropan-2-amine,CC(C)NC(C)C,108-18-9,"InChI=1S/C6H15N/c1-5(2)7-6(3)4/h5-7H,1-4H3",other,All,1.855,0.2708,93.98,6,0.01,0.05,534.88
105,hexan-1-amine,CCCCCCN,111-26-2,"InChI=1S/C6H15N/c1-2-3-4-5-6-7/h2-7H2,1H3",amines,All,3.725,1.0,6.112,5,0.01,0.15,581.26
108,1-methylnaphthalene,Cc1cccc2ccccc12,90-12-0,"InChI=1S/C11H10/c1-9-5-4-7-10-6-2-3-8-11(9)10/h2-8H,1H3",other,NP,0.0,0.0,24.199,3,0.01,0.45,795.41
109,2-methylnaphthalene,Cc1ccc2ccccc2c1,91-57-6,"InChI=1S/C11H10/c1-9-6-7-10-4-2-3-5-11(10)8-9/h2-8H,1H3",other,NP,0.0,0.0,23.308,2,0.0,0.15,794.87
110,methanol,CO,67-56-1,"InChI=1S/CH4O/c1-2/h2H,1H3",n-alcohols,All,5.43,0.131,5.631,89,0.55,1.78,537.21
111,2-methylpentane,CCCC(C)C,107-83-5,"InChI=1S/C6H14/c1-4-5-6(2)3/h6H,4-5H2,1-3H3",branched alkanes,NP,0.0,0.0,12.446,7,0.01,0.55,506.94
112,3-methylpentane,CCC(C)CC,96-14-0,"InChI=1S/C6H14/c1-4-6(3)5-2/h6H,4-5H2,1-3H3",branched alkanes,All,0.118,1.0,11.511,6,0.0,0.03,513.48
113,2-methoxyethanol,COCCO,109-86-4,"InChI=1S/C3H8O2/c1-5-3-2-4/h4H,2-3H2,1H3",other,P,8.01,0.1847,0.0,32,0.29,1.56,624.42
116,butylbenzene,CCCCc1ccccc1,104-51-8,"InChI=1S/C10H14/c1-2-3-7-10-8-5-4-6-9-10/h4-6,8-9H,2-3,7H2,1H3",aromatics,NP,0.0,0.0,20.913,2,0.0,0.1,678.74
117,4-methylpentan-2-one,CC(=O)CC(C)C,108-10-1,"InChI=1S/C6H12O/c1-5(2)4-6(3)7/h5H,4H2,1-3H3",ketones,P,11.103,0.2795,0.0,10,0.11,0.79,584.79
118,3-methylpyridine,Cc1cccnc1,108-99-6,"InChI=1S/C6H7N/c1-6-3-2-4-7-5-6/h2-5H,1H3",other,P,8.136,0.3378,0.0,4,0.01,0.05,660.85
119,4-methylpyridine,Cc1ccncc1,108-89-4,"InChI=1S/C6H7N/c1-6-2-4-7-5-3-6/h2-5H,1H3",other,P,8.643,0.3448,0.0,4,0.0,0.04,664.0
120,2-methylpropan-1-ol,CC(C)CO,78-83-1,"InChI=1S/C4H10O/c1-4(2)3-5/h4-5H,3H2,1-2H3",other,P,9.018,0.1344,0.0,39,1.14,12.89,563.06
122,naphthalene,c1ccc2ccccc2c1,91-20-3,InChI=1S/C10H8/c1-2-6-10-8-4-3-7-9(10)5-1/h1-8H,other,NP,0.0,0.0,25.596,1,0.0,0.0,770.43
124,nitromethane,C[N+](=O)[O-],75-52-5,InChI=1S/CH3NO2/c1-2(3)4/h1H3,other,All,3.768,0.046,32.305,20,0.67,1.75,599.12
125,1-nitropropane,CCC[N+](=O)[O-],108-03-2,"InChI=1S/C3H7NO2/c1-2-3-4(5)6/h2-3H2,1H3",other,P,13.208,0.2229,0.0,5,0.15,0.65,630.06
126,nonan-1-ol,CCCCCCCCCO,143-08-8,"InChI=1S/C9H20O/c1-2-3-4-5-6-7-8-9-10/h10H,2-9H2,1H3",n-alcohols,P,9.72,0.0,0.0,14,0.41,5.34,688.92
127,octane,CCCCCCCC,111-65-9,"InChI=1S/C8H18/c1-3-5-7-8-6-4-2/h3-8H2,1-2H3",n-alkanes,NP,0.0,0.0,16.353,16,0.01,0.6,582.43
128,oct-1-ene,C=CCCCCCC,111-66-0,"InChI=1S/C8H16/c1-3-5-7-8-6-4-2/h3H,1,4-8H2,2H3",alkenes,NP,0.0,0.0,17.78,6,0.02,0.89,579.01
129,2-methylphenol,Cc1ccccc1O,95-48-7,"InChI=1S/C7H8O/c1-6-4-2-3-5-7(6)8/h2-5,8H,1H3",other,P,5.36,0.104,0.0,10,0.07,1.41,713.8
131,4-methylphenol,Cc1ccc(O)cc1,106-44-5,"InChI=1S/C7H8O/c1-6-2-4-7(8)5-3-6/h2-5,8H,1H3",other,P,7.191,0.0,0.0,9,0.37,4.76,720.28
132,ethyl 2-phenylacetate,CCOC(=O)Cc1ccccc1,101-97-3,"InChI=1S/C10H12O2/c1-2-12-10(11)8-9-6-4-3-5-7-9/h3-7H,2,8H2,1H3",other,P,7.6,1.0,0.0,2,0.0,0.01,719.31
133,pentane,CCCCC,109-66-0,"InChI=1S/C5H12/c1-3-5-4-2/h3-5H2,1-2H3",n-alkanes,NP,0.0,0.0,10.438,12,0.01,0.49,478.78
135,pentan-1-ol,CCCCCO,71-41-0,"InChI=1S/C5H12O/c1-2-3-4-5-6/h6H,2-5H2,1H3",n-alcohols,P,9.259,0.097,0.0,32,0.55,5.48,600.44
136,pentan-2-one,CCCC(C)=O,107-87-9,"InChI=1S/C5H10O/c1-3-4-5(2)6/h3-4H2,1-2H3",ketones,All,10.02,0.2553,5.496,10,0.07,0.42,576.6
137,phenol,Oc1ccccc1,108-95-2,"InChI=1S/C6H6O/c7-6-4-2-1-3-5-6/h1-5,7H",other,P,6.323,0.0,0.0,21,0.52,6.01,710.48
138,carbonyl dichloride,O=C(Cl)Cl,75-44-5,InChI=1S/CCl2O/c2-1(3)4,other,All,2.089,0.3913,3.318,27,0.13,2.53,460.01
139,propan-1-ol,CCCO,71-23-8,"InChI=1S/C3H8O/c1-2-3-4/h4H,2-3H2,1H3",n-alcohols,P,8.345,0.152,0.0,79,0.55,3.93,554.64
141,propane-1-thiol,CCCS,107-03-9,"InChI=1S/C3H8S/c1-2-3-4/h4H,2-3H2,1H3",other,P,4.482,0.7206,0.0,5,0.02,0.36,550.72
143,pyridine,c1ccncc1,110-86-1,InChI=1S/C5H5N/c1-2-4-6-5-3-1/h1-5H,other,All,2.378,0.0,29.476,22,0.88,7.44,630.92
146,methyl 2-hydroxybenzoate,COC(=O)c1ccccc1O,119-36-8,"InChI=1S/C8H8O3/c1-11-8(10)6-4-2-3-5-7(6)9/h2-5,9H,1H3",other,P,9.18,0.3697,0.0,12,0.17,2.14,765.51
148,,S=C=S,75-15-0,InChI=1S/CS2/c2-1-3,other,NP,0.0,0.0,9.414,43,0.02,0.76,560.2
149,styrene,C=Cc1ccccc1,100-42-5,"InChI=1S/C8H8/c1-2-8-6-4-3-5-7-8/h2-7H,1H2",other,NP,0.0,0.0,16.021,6,0.01,0.46,651.46
150,methylsulfinylmethane,CS(C)=O,67-68-5,InChI=1S/C2H6OS/c1-4(2)3/h1-2H3,other,P,17.778,0.1725,0.0,54,0.44,0.96,736.65
152,2-methylpropan-2-ol,CC(C)(C)O,75-65-0,"InChI=1S/C4H10O/c1-4(2,3)5/h5H,1-3H3",other,P,6.339,0.0,0.0,48,0.79,9.36,517.76
153,tetradecane,CCCCCCCCCCCCCC,629-59-4,"InChI=1S/C14H30/c1-3-5-7-9-11-13-14-12-10-8-6-4-2/h3-14H2,1-2H3",n-alkanes,NP,0.0,0.0,26.484,3,0.01,0.35,710.23
154,"1,2,3,4,4a,5,6,7,8,8a-decahydronaphthalene",C1CCC2CCCCC2C1,493-02-7,"InChI=1/C10H18/c1-2-6-10-8-4-3-7-9(10)5-1/h9-10H,1-8H2/t9-,10-",other,NP,0.0,0.0,18.657,20,0.02,1.16,699.22
155,"1,2,3,4-tetrahydronaphthalene",c1ccc2c(c1)CCCC2,119-64-2,"InChI=1S/C10H12/c1-2-6-10-8-4-3-7-9(10)5-1/h1-2,5-6H,3-4,7-8H2",other,NP,0.0,0.0,22.579,8,0.03,1.05,737.74
156,tetrachloromethane,ClC(Cl)(Cl)Cl,56-23-5,"InChI=1S/CCl4/c2-1(3,4)5",other,All,0.085,0.9994,11.558,94,0.01,0.28,565.59
157,oxolan-2-ylmethanol,OCC1CCCO1,97-99-4,"InChI=1S/C5H10O2/c6-4-5-2-1-3-7-5/h5-6H,1-4H2",other,P,7.992,0.12,0.0,1,0.0,0.0,732.68
158,oxolane,C1CCOC1,109-99-9,InChI=1S/C4H8O/c1-2-4-5-3-1/h1-4H2,other,P,4.757,0.4239,0.0,37,0.31,4.06,550.64
160,toluene,Cc1ccccc1,108-88-3,"InChI=1S/C7H8/c1-7-5-3-2-4-6-7/h2-6H,1H3",aromatics,All,0.12,0.0,13.483,105,0.02,0.82,605.93
161,"n,n-diethylethanamine",CCN(CC)CC,121-44-8,"InChI=1S/C6H15N/c1-4-7(5-2)6-3/h4-6H2,1-3H3",other,NP,0.0,0.0,19.463,19,0.06,2.42,544.33
163,"1,1,2,2-tetrachloroethene",ClC(Cl)=C(Cl)Cl,127-18-4,InChI=1S/C2Cl4/c3-1(4)2(5)6,other,NP,0.0,0.0,13.29,5,0.03,1.38,628.17
166,"1,1,1-trichloroethane",CC(Cl)(Cl)Cl,71-55-6,"InChI=1S/C2H3Cl3/c1-2(3,4)5/h1H3",other,P,5.569,0.4587,0.0,25,0.39,6.03,554.33
167,"1,1,2-trichloroethene",ClC=C(Cl)Cl,79-01-6,InChI=1S/C2HCl3/c3-1-2(4)5/h1H,other,NP,0.0,0.0,18.531,3,0.02,0.59,580.76
170,"2,2,3-trimethylbutane",CC(C)C(C)(C)C,464-06-2,"InChI=1S/C7H16/c1-6(2)7(3,4)5/h6H,1-5H3",branched alkanes,NP,0.0,0.0,14.27,1,0.0,0.0,540.31
173,oxidane,O,7732-18-5,InChI=1S/H2O/h1H2,other,P,5.638,0.1273,0.0,235,0.37,0.47,697.38
174,"1,3-xylene",Cc1cccc(C)c1,108-38-3,"InChI=1S/C8H10/c1-7-4-3-5-8(2)6-7/h3-6H,1-2H3",aromatics,NP,0.0,0.0,16.57,16,0.01,0.53,635.7
175,"1,4-xylene",Cc1ccc(C)cc1,106-42-3,"InChI=1S/C8H10/c1-7-3-5-8(2)6-4-7/h3-6H,1-2H3",aromatics,NP,0.0,0.0,15.769,15,0.02,0.86,634.97
176,1-nitroethane,CC[N+](=O)[O-],79-24-3,"InChI=1S/C2H5NO2/c1-2-3(4)5/h2H2,1H3",other,P,12.18,0.2079,0.0,6,0.21,0.75,611.04
177,methanamine,CN,74-89-5,"InChI=1S/CH5N/c1-2/h2H2,1H3",amines,P,3.147,0.2367,0.0,23,0.3,2.09,445.1
178,n-methylmethanamine,CNC,124-40-3,"InChI=1S/C2H7N/c1-3-2/h3H,1-2H3",other,P,2.68,0.0,0.0,2,0.07,1.18,450.25
179,propane-2-thiol,CC(C)S,75-33-2,"InChI=1S/C3H8S/c1-3(2)4/h3-4H,1-2H3",other,P,4.063,0.12,0.0,1,0.0,0.0,523.71
180,"n,n-diethylaniline",CCN(CC)c1ccccc1,91-66-7,"InChI=1S/C10H15N/c1-3-11(4-2)10-8-6-5-7-9-10/h5-9H,3-4H2,1-2H3",other,P,6.706,0.6658,0.0,4,0.06,1.12,708.16
181,cyclopentanol,OC1CCCC1,96-41-3,"InChI=1S/C5H10O/c6-5-3-1-2-4-5/h5-6H,1-4H2",other,P,8.057,0.0,0.0,8,0.53,3.15,635.53
182,fluorobenzene,Fc1ccccc1,462-06-6,InChI=1S/C6H5F/c7-6-4-2-1-3-5-6/h1-5H,other,P,4.062,0.4484,0.0,49,0.19,3.29,572.1
184,tetrachlorosilane,Cl[Si](Cl)(Cl)Cl,10026-04-7,"InChI=1S/Cl4Si/c1-5(2,3)4",other,NP,0.0,0.0,13.88,17,0.02,1.06,516.52
186,trichlorophosphane,ClP(Cl)Cl,7719-12-2,InChI=1S/Cl3P/c1-4(2)3,other,NP,0.0,0.0,20.787,2,0.52,13.04,585.58
187,phosphoryl trichloride,O=P(Cl)(Cl)Cl,10025-87-3,"InChI=1S/Cl3OP/c1-5(2,3)4",other,P,6.93,0.0,0.0,2,0.53,4.02,606.18
196,thionyl dichloride,O=S(Cl)Cl,7719-09-7,InChI=1S/Cl2OS/c1-4(2)3,other,P,4.335,0.12,0.0,1,0.0,0.0,590.05
199,"1,1,2,2-tetrachloroethane",ClC(Cl)C(Cl)Cl,79-34-5,InChI=1S/C2H2Cl4/c3-1(4)2(5)6/h1-2H,other,P,5.501,0.0,0.0,5,0.19,2.47,653.43
204,ethyl propanoate,CCOC(=O)CC,105-37-3,"InChI=1S/C5H10O2/c1-3-5(6)7-4-2/h3-4H2,1-2H3",other,P,5.565,0.7322,0.0,10,0.1,1.89,557.79
205,3-methylbutyl acetate,CC(=O)OCCC(C)C,123-92-2,"InChI=1S/C7H14O2/c1-6(2)4-5-9-7(3)8/h6H,4-5H2,1-3H3",esters,P,6.305,1.0,0.0,10,0.21,4.28,601.21
206,butyl propanoate,CCCCOC(=O)CC,590-01-2,"InChI=1S/C7H14O2/c1-3-5-6-9-7(8)4-2/h3-6H2,1-2H3",other,P,6.341,1.0,0.0,2,0.01,0.15,603.37
209,azane,N,7664-41-7,InChI=1S/H3N/h1H3,other,All,2.41,0.2357,4.22,34,0.42,2.26,415.62
210,chloroethene,C=CCl,75-01-4,"InChI=1S/C2H3Cl/c1-2-3/h2H,1H2",other,P,2.978,0.12,0.0,1,0.0,0.0,432.42
212,"1,2-dimethoxyethane",COCCOC,110-71-4,"InChI=1S/C4H10O2/c1-5-3-4-6-2/h3-4H2,1-2H3",other,All,4.063,0.27,12.358,38,0.2,2.84,544.84
218,2-chloro-2-methylpropane,CC(C)(C)Cl,507-20-0,"InChI=1S/C4H9Cl/c1-4(2,3)5/h1-3H3",other,P,7.847,0.3313,0.0,27,0.21,1.93,511.83
219,"1,1,2-trichloro-1,2,2-trifluoroethane",FC(F)(Cl)C(F)(Cl)Cl,76-13-1,"InChI=1S/C2Cl3F3/c3-1(4,6)2(5,7)8",other,NP,0.0,0.0,17.362,1,0.1,3.86,494.86
225,n-methylformamide,CN=CO,123-39-7,"InChI=1S/C2H5NO/c1-3-2-4/h2H,1H3,(H,3,4)",other,P,19.912,0.0458,0.0,15,6.1,3.53,753.61
226,"n,n-dimethylacetamide",CC(=O)N(C)C,127-19-5,InChI=1S/C4H9NO/c1-4(6)5(2)3/h1-3H3,other,P,17.319,0.1587,0.0,31,0.93,2.52,675.48
227,prop-2-enenitrile,C=CC#N,107-13-1,"InChI=1S/C3H3N/c1-2-3-4/h2H,1H2",other,All,6.917,0.1414,24.825,17,0.63,2.07,541.65
229,"propane-1,2,3-triol",OCC(O)CO,56-81-5,"InChI=1S/C3H8O3/c4-1-3(6)2-5/h3-6H,1-2H2",other,P,13.446,0.1364,0.0,57,1.18,3.02,884.46
236,propane,CCC,74-98-6,"InChI=1S/C3H8/c1-3-2/h3H2,1-2H3",n-alkanes,All,0.011,0.0,6.457,69,0.01,0.41,375.31
237,propyl acetate,CCCOC(C)=O,109-60-4,"InChI=1S/C5H10O2/c1-3-4-7-5(2)6/h3-4H2,1-2H3",esters,All,3.052,0.3063,14.651,14,0.02,0.44,563.25
239,butan-1-amine,CCCCN,109-73-9,"InChI=1S/C4H11N/c1-2-3-4-5/h2-5H2,1H3",amines,P,3.418,0.0,0.0,10,0.08,1.67,543.81
240,cyclopentanone,O=C1CCCC1,120-92-3,InChI=1S/C5H8O/c6-5-3-1-2-4-5/h1-4H2,ketones,All,6.777,0.3195,15.862,36,0.08,0.55,644.07
241,(z)-octadec-9-enoic acid,CCCCCCCCC=CCCCCCCCC(=O)O,112-80-1,"InChI=1S/C18H34O2/c1-2-3-4-5-6-7-8-9-10-11-12-13-14-15-16-17-18(19)20/h9-10H,2-8,11-17H2,1H3,(H,19,20)/b10-9-",other,NP,0.0,0.0,45.221,6,0.04,1.56,767.28
242,piperidine,C1CCNCC1,110-89-4,"InChI=1S/C5H11N/c1-2-4-6-5-3-1/h6H,1-5H2",other,P,3.298,0.0,0.0,6,0.32,6.8,602.2
243,chloro(difluoro)methane,FC(F)Cl,75-45-6,InChI=1S/CHClF2/c2-1(3)4/h1H,other,P,3.533,0.3774,0.0,5,0.13,1.63,375.77
244,dichloro(difluoro)methane,FC(F)(Cl)Cl,75-71-8,"InChI=1S/CCl2F2/c2-1(3,4)5",other,NP,0.0,0.0,10.403,1,0.0,0.0,390.53
246,"1,1,2,2,3,3,4,4-octafluorocyclobutane",FC1(F)C(F)(F)C(F)(F)C1(F)F,115-25-3,"InChI=1S/C4F8/c5-1(6)2(7,8)4(11,12)3(1,9)10",other,NP,0.0,0.0,9.969,11,0.0,0.24,393.25
247,methyl tetradecanoate,CCCCCCCCCCCCCC(=O)OC,124-10-7,"InChI=1S/C15H30O2/c1-3-4-5-6-7-8-9-10-11-12-13-14-15(16)17-2/h3-14H2,1-2H3",other,P,7.541,1.0,0.0,2,0.06,1.71,743.07
248,phenylhydrazine,NNc1ccccc1,100-63-0,"InChI=1S/C6H8N2/c7-8-6-4-2-1-3-5-6/h1-5,8H,7H2",other,P,4.927,0.12,0.0,1,0.0,0.0,798.86
249,cyclohexanone,O=C1CCCCC1,108-94-1,InChI=1S/C6H10O/c7-6-4-2-1-3-5-6/h1-5H2,ketones,All,10.267,0.2655,6.112,68,0.19,1.1,675.13
251,cyclohexanol,OC1CCCCC1,108-93-0,"InChI=1S/C6H12O/c7-6-4-2-1-3-5-6/h6-7H,1-5H2",other,P,8.64,0.0,0.0,39,1.27,15.98,665.6
252,methyl hexadecanoate,CCCCCCCCCCCCCCCC(=O)OC,112-39-0,"InChI=1S/C17H34O2/c1-3-4-5-6-7-8-9-10-11-12-13-14-15-16-17(18)19-2/h3-16H2,1-2H3",other,P,7.847,0.12,0.0,1,0.0,0.0,764.92
254,"2,4-dimethylpyridine",Cc1ccnc(C)c1,108-47-4,"InChI=1S/C7H9N/c1-6-3-4-8-7(2)5-6/h3-5H,1-2H3",other,P,8.377,0.4009,0.0,3,0.0,0.01,667.07
255,2-nitropropane,CC(C)[N+](=O)[O-],79-46-9,"InChI=1S/C3H7NO2/c1-3(2)4(5)6/h3H,1-2H3",other,P,13.843,0.2104,0.0,4,0.15,0.59,613.89
256,pent-1-ene,C=CCCC,109-67-1,"InChI=1S/C5H10/c1-3-5-4-2/h3H,1,4-5H2,2H3",alkenes,NP,0.0,0.0,11.791,4,0.02,0.78,475.66
259,bromoform,BrC(Br)Br,75-25-2,InChI=1S/CHBr3/c2-1(3)4/h1H,other,P,3.293,1.0,0.0,10,0.07,1.64,694.7
260,trimethyl borate,COB(OC)OC,121-43-7,InChI=1S/C3H9BO3/c1-5-4(6-2)7-3/h1-3H3,other,NP,0.0,0.0,47.85,1,0.0,0.0,509.29
261,methyl 2-methylprop-2-enoate,C=C(C)C(=O)OC,80-62-6,"InChI=1S/C5H8O2/c1-4(2)5(6)7-3/h1H2,2-3H3",other,P,6.81,0.7768,0.0,6,0.19,3.06,569.5
262,2-methylbut-2-ene,CC=C(C)C,513-35-9,"InChI=1S/C5H10/c1-4-5(2)3/h4H,1-3H3",alkenes,NP,0.0,0.0,11.075,4,0.01,0.51,489.17
265,3-methylbutan-1-ol,CC(C)CCO,123-51-3,"InChI=1S/C5H12O/c1-5(2)3-4-6/h5-6H,3-4H2,1-2H3",other,P,9.224,0.1077,0.0,31,0.92,12.55,593.33
268,octanoic acid,CCCCCCCC(=O)O,124-07-2,"InChI=1S/C8H16O2/c1-2-3-4-5-6-7-8(9)10/h2-7H2,1H3,(H,9,10)",other,NP,0.0,0.0,22.938,11,0.04,1.78,717.73
272,2-ethoxyethanol,CCOCCO,110-80-5,"InChI=1S/C4H10O2/c1-2-6-4-3-5/h5H,2-4H2,1H3",other,P,7.564,0.0,0.0,7,0.4,2.84,615.58
273,2-methylpropan-1-amine,CC(C)CN,78-81-9,"InChI=1S/C4H11N/c1-4(2)3-5/h4H,3,5H2,1-2H3",other,P,3.247,0.0,0.0,6,0.04,0.92,526.27
274,furan-2-ylmethanol,OCc1ccco1,98-00-0,"InChI=1S/C5H6O2/c6-4-5-2-1-3-7-5/h1-3,6H,4H2",other,P,8.205,0.12,0.0,1,0.0,0.0,652.57
275,1-chlorooctane,CCCCCCCCCl,111-85-3,"InChI=1S/C8H17Cl/c1-2-3-4-5-6-7-8-9/h2-8H2,1H3",other,P,7.343,0.8069,0.0,4,0.0,0.07,658.64
281,"propane-1,2-diol",CC(O)CO,57-55-6,"InChI=1S/C3H8O2/c1-3(5)2-4/h3-5H,2H2,1H3",other,P,10.566,0.146,0.0,39,1.44,8.13,697.56
282,thiophene,c1ccsc1,110-02-1,InChI=1S/C4H4S/c1-2-4-5-3-1/h1-4H,other,NP,0.0,0.0,12.973,29,0.01,0.54,588.58
283,1-methylpyrrolidin-2-one,CN1CCCC1=O,872-50-4,"InChI=1S/C5H9NO/c1-6-4-2-3-5(6)7/h2-4H2,1H3",other,P,15.372,0.1592,0.0,6,0.35,1.15,742.62
284,pentan-3-one,CCC(=O)CC,96-22-0,"InChI=1S/C5H10O/c1-3-5(6)4-2/h3-4H2,1-2H3",ketones,P,11.687,0.2583,0.0,8,0.27,1.65,574.85
286,heptan-4-one,CCCC(=O)CCC,123-19-3,"InChI=1S/C7H14O/c1-3-5-7(8)6-4-2/h3-6H2,1-2H3",ketones,P,12.145,0.2877,0.0,11,0.08,0.69,616.0
288,2-methylfuran,Cc1ccco1,534-22-5,"InChI=1S/C5H6O/c1-5-3-2-4-6-5/h2-4H,1H3",other,All,1.463,1.0,4.011,25,0.01,0.3,536.06
291,methyl formate,COC=O,107-31-3,"InChI=1S/C2H4O2/c1-4-2-3/h2H,1H3",esters,P,3.621,0.2867,0.0,2,0.0,0.0,499.48
292,n-methylacetamide,CN=C(C)O,79-16-3,"InChI=1S/C3H7NO/c1-3(5)4-2/h1-2H3,(H,4,5)",other,P,23.625,0.0,0.0,29,2.77,2.64,775.17
293,2-methyloxolane,CC1CCCO1,96-47-9,"InChI=1S/C5H10O/c1-5-3-2-4-6-5/h5H,2-4H2,1H3",other,P,4.77,0.12,0.0,1,0.4,6.08,557.38
295,hexan-1-ol,CCCCCCO,111-27-3,"InChI=1S/C6H14O/c1-2-3-4-5-6-7/h7H,2-6H2,1H3",n-alcohols,P,9.186,0.0,0.0,29,0.52,6.31,625.99
296,"1,2,3,4,5,6-hexafluorobenzene",Fc1c(F)c(F)c(F)c(F)c1F,392-56-3,InChI=1S/C6F6/c7-1-2(8)4(10)6(12)5(11)3(1)9,other,All,0.264,0.0,10.398,20,0.02,1.3,530.7
301,cyclohexanamine,NC1CCCCC1,108-91-8,"InChI=1S/C6H13N/c7-6-4-2-1-3-5-6/h6H,1-5,7H2",other,P,4.25,0.697,0.0,3,0.03,0.69,648.16
302,"1,1,1,2,2,3,3,4,4,5,5,6,6,7,7,7-hexadecafluoroheptane",FC(F)(F)C(F)(F)C(F)(F)C(F)(F)C(F)(F)C(F)(F)C(F)(F)F,335-57-9,"InChI=1S/C7F16/c8-1(9,2(10,11)4(14,15)6(18,19)20)3(12,13)5(16,17)7(21,22)23",other,NP,0.0,0.0,20.135,2,0.0,0.03,483.28
303,"2,3-dimethylpentane",CCC(C)C(C)C,565-59-3,"InChI=1S/C7H16/c1-5-7(4)6(2)3/h6-7H,5H2,1-4H3",branched alkanes,NP,0.0,0.0,14.114,6,0.01,0.31,549.35
304,"1,1,2,2,3,3,4,4,4-nonafluoro-n,n-bis(1,1,2,2,3,3,4,4,4-nonafluorobutyl)butan-1-amine",FC(F)(F)C(F)(F)C(F)(F)C(F)(F)N(C(F)(F)C(F)(F)C(F)(F)C(F)(F)F)C(F)(F)C(F)(F)C(F)(F)C(F)(F)F,311-89-7,"InChI=1S/C12F27N/c13-1(14,7(25,26)27)4(19,20)10(34,35)40(11(36,37)5(21,22)2(15,16)8(28,29)30)12(38,39)6(23,24)3(17,18)9(31,32)33",other,NP,0.0,0.0,33.087,1,0.01,0.6,566.17
307,"2-methylpentane-2,4-diol",CC(O)CC(C)(C)O,107-41-5,"InChI=1S/C6H14O2/c1-5(7)4-6(2,3)8/h5,7-8H,4H2,1-3H3",other,P,15.285,0.0873,0.0,35,0.58,3.46,688.87
309,methyl benzoate,COC(=O)c1ccccc1,93-58-3,"InChI=1S/C8H8O2/c1-10-8(9)7-5-3-2-4-6-7/h2-6H,1H3",other,P,7.476,0.6762,0.0,10,0.12,1.9,711.63
312,butanal,CCCC=O,123-72-8,"InChI=1S/C4H8O/c1-2-3-4-5/h4H,2-3H2,1H3",aldehydes,P,8.958,0.3161,0.0,2,0.0,0.0,543.29
314,"1,2,3,4,4a,5,6,7,8,8a-decahydronaphthalene",C1CCC2CCCCC2C1,493-01-6,"InChI=1/C10H18/c1-2-6-10-8-4-3-7-9(10)5-1/h9-10H,1-8H2/t9-,10+",other,NP,0.0,0.0,18.71,16,0.02,0.71,720.9
315,2-methylpropane,CC(C)C,75-28-5,"InChI=1S/C4H10/c1-4(2)3/h4H,1-3H3",branched alkanes,All,0.021,0.9992,8.544,53,0.0,0.22,414.13
316,butyl prop-2-enoate,C=CC(=O)OCCCC,141-32-2,"InChI=1S/C7H12O2/c1-3-5-6-9-7(8)4-2/h4H,2-3,5-6H2,1H3",other,P,5.884,0.421,0.0,25,0.02,0.41,613.3
317,ethyl prop-2-enoate,C=CC(=O)OCC,140-88-5,"InChI=1S/C5H8O2/c1-3-5(6)7-4-2/h3H,1,4H2,2H3",other,P,5.0,0.2613,0.0,25,0.04,0.63,566.12
319,ethanamine,CCN,75-04-7,"InChI=1S/C2H7N/c1-2-3/h2-3H2,1H3",amines,P,2.928,0.0425,0.0,6,0.07,1.07,467.08
320,chloroethane,CCCl,75-00-3,"InChI=1S/C2H5Cl/c1-2-3/h2H2,1H3",other,NP,0.0,0.0,42.26,6,0.15,2.67,466.56
321,"1,2-xylene",Cc1ccccc1C,95-47-6,"InChI=1S/C8H10/c1-7-5-3-4-6-8(7)2/h3-6H,1-2H3",aromatics,NP,0.0,0.0,18.049,10,0.02,0.75,646.7
322,2-butoxyethyl acetate,CCCCOCCOC(C)=O,112-07-2,"InChI=1S/C8H16O3/c1-3-4-5-10-6-7-11-8(2)9/h3-7H2,1-2H3",other,P,8.074,0.12,0.0,1,0.0,0.0,650.76
324,n-methylaniline,CNc1ccccc1,100-61-8,"InChI=1S/C7H9N/c1-8-7-5-3-2-4-6-7/h2-6,8H,1H3",other,P,4.701,0.0,0.0,5,0.3,4.55,720.88
325,propanenitrile,CCC#N,107-12-0,"InChI=1S/C3H5N/c1-2-3-4/h2H2,1H3",other,All,7.244,0.1676,26.033,29,0.53,2.03,568.08
327,non-1-ene,C=CCCCCCCC,124-11-8,"InChI=1S/C9H18/c1-3-5-7-9-8-6-4-2/h3H,1,4-9H2,2H3",alkenes,All,0.395,1.0,17.875,6,0.0,0.11,606.55
328,2-chloropropane,CC(C)Cl,75-29-6,"InChI=1S/C3H7Cl/c1-3(2)4/h3H,1-2H3",other,P,6.749,0.4182,0.0,5,0.05,0.57,492.57
329,3-chloroprop-1-ene,C=CCCl,107-05-1,"InChI=1S/C3H5Cl/c1-2-3-4/h2H,1,3H2",other,P,4.407,0.1954,0.0,3,0.26,3.3,513.37
330,furan,c1ccoc1,110-00-9,InChI=1S/C4H4O/c1-2-4-5-3-1/h1-4H,other,All,0.381,0.0,9.717,21,0.02,0.71,498.44
331,1-chloropropane,CCCCl,540-54-5,"InChI=1S/C3H7Cl/c1-2-3-4/h2-3H2,1H3",other,P,5.51,0.3522,0.0,5,0.02,0.27,512.25
335,n-butylbutan-1-amine,CCCCNCCCC,111-92-2,"InChI=1S/C8H19N/c1-3-5-7-9-8-6-4-2/h9H,3-8H2,1-2H3",other,All,1.205,1.0,20.555,13,0.06,2.06,640.0
337,1-propoxypropane,CCCOCCC,111-43-3,"InChI=1S/C6H14O/c1-3-5-7-6-4-2/h3-6H2,1-2H3",ethers,All,1.767,0.0096,13.345,6,0.04,0.96,543.3
339,"methyl (9z,12z)-octadeca-9,12-dienoate",CCCCCC=CCC=CCCCCCCCC(=O)OC,112-63-0,"InChI=1S/C19H34O2/c1-3-4-5-6-7-8-9-10-11-12-13-14-15-16-17-18-19(20)21-2/h7-8,10-11H,3-6,9,12-18H2,1-2H3/b8-7-,11-10-",other,P,9.054,1.0,0.0,2,0.06,1.72,789.12
340,2-methylcyclohexan-1-ol,CC1CCCCC1O,583-59-5,"InChI=1S/C7H14O/c1-6-4-2-3-5-7(6)8/h6-8H,2-5H2,1H3",other,P,7.493,0.0,0.0,6,1.05,12.87,692.31
342,heptan-1-ol,CCCCCCCO,111-70-6,"InChI=1S/C7H16O/c1-2-3-4-5-6-7-8/h8H,2-7H2,1H3",n-alcohols,P,9.655,0.0,0.0,39,0.57,7.8,650.74
343,octan-1-ol,CCCCCCCCO,111-87-5,"InChI=1S/C8H18O/c1-2-3-4-5-6-7-8-9/h9H,2-8H2,1H3",n-alcohols,P,9.728,0.0,0.0,42,0.44,6.84,673.44
344,decan-1-ol,CCCCCCCCCCO,112-30-1,"InChI=1S/C10H22O/c1-2-3-4-5-6-7-8-9-10-11/h11H,2-10H2,1H3",n-alcohols,P,9.689,0.0,0.0,28,0.41,7.76,710.11
345,dodecanoic acid,CCCCCCCCCCCC(=O)O,143-07-7,"InChI=1S/C12H24O2/c1-2-3-4-5-6-7-8-9-10-11-12(13)14/h2-11H2,1H3,(H,13,14)",other,P,4.533,1.0,0.0,3,0.06,2.61,775.14
347,methyl dodecanoate,CCCCCCCCCCCC(=O)OC,111-82-0,"InChI=1S/C13H26O2/c1-3-4-5-6-7-8-9-10-11-12-13(14)15-2/h3-12H2,1-2H3",other,P,7.117,1.0,0.0,2,0.06,1.63,716.36
350,cumene,CC(C)c1ccccc1,98-82-8,"InChI=1S/C9H12/c1-8(2)9-6-4-3-5-7-9/h3-8H,1-2H3",aromatics,NP,0.0,0.0,18.871,9,0.01,0.41,648.16
353,dec-1-ene,C=CCCCCCCCC,872-05-9,"InChI=1S/C10H20/c1-3-5-7-9-10-8-6-4-2/h3H,1,4-10H2,2H3",alkenes,NP,0.0,0.0,21.975,6,0.01,0.31,631.85
362,2-methylhexan-1-ol,CCCCC(C)CO,624-22-6,"InChI=1S/C7H16O/c1-3-4-5-7(2)6-8/h7-8H,3-6H2,1-2H3",other,P,9.607,0.12,0.0,1,0.0,0.0,528.47
363,"buta-1,3-diene",C=CC=C,106-99-0,"InChI=1S/C4H6/c1-3-4-2/h3-4H,1-2H2",alkenes,NP,0.0,0.0,9.18,4,0.01,0.64,434.4
365,but-1-en-3-yne,C#CC=C,689-97-4,"InChI=1S/C4H4/c1-3-4-2/h1,4H,2H2",alkynes,NP,0.0,0.0,9.028,1,0.0,0.0,450.61
366,"2,3-dimethylbutane",CC(C)C(C)C,79-29-8,"InChI=1S/C6H14/c1-5(2)6(3)4/h5-6H,1-4H3",branched alkanes,All,0.114,1.0,11.483,6,0.0,0.03,509.61
367,but-1-ene,C=CCC,106-98-9,"InChI=1S/C4H8/c1-3-4-2/h3H,1,4H2,2H3",alkenes,All,0.194,1.0,8.309,6,0.0,0.01,430.85
368,propylbenzene,CCCc1ccccc1,103-65-1,"InChI=1S/C9H12/c1-2-6-9-7-4-3-5-8-9/h3-5,7-8H,2,6H2,1H3",aromatics,All,0.346,1.0,16.312,6,0.0,0.13,655.11
369,"2,2-dimethylbutane",CCC(C)(C)C,75-83-2,"InChI=1S/C6H14/c1-5-6(2,3)4/h5H2,1-4H3",branched alkanes,NP,0.0,0.0,12.482,5,0.0,0.21,495.08
370,ethyl butanoate,CCCC(=O)OCC,105-54-4,"InChI=1S/C6H12O2/c1-3-5-6(7)8-4-2/h3-5H2,1-2H3",other,P,5.728,0.7442,0.0,4,0.06,1.27,581.21
371,1-phenylethanone,CC(=O)c1ccccc1,98-86-2,"InChI=1S/C8H8O/c1-7(9)8-5-3-2-4-6-8/h2-6H,1H3",ketones,P,13.331,0.2486,0.0,13,0.28,1.71,729.81
372,2-methylpropyl acetate,CC(=O)OCC(C)C,110-19-0,"InChI=1S/C6H12O2/c1-5(2)4-8-6(3)7/h5H,4H2,1-3H3",esters,P,5.81,0.8663,0.0,11,0.08,1.65,573.06
375,propan-2-amine,CC(C)N,75-31-0,"InChI=1S/C3H9N/c1-3(2)4/h3H,4H2,1-2H3",other,P,3.417,0.3769,0.0,18,0.12,1.79,481.43
376,propan-1-amine,CCCN,107-10-8,"InChI=1S/C3H9N/c1-2-3-4/h2-4H2,1H3",amines,P,3.471,0.5759,0.0,24,0.14,2.38,510.51
378,2-ethylhexan-1-ol,CCCCC(CC)CO,104-76-7,"InChI=1S/C8H18O/c1-3-5-6-8(4-2)7-9/h8-9H,3-7H2,1-2H3",other,P,7.492,0.0,0.0,9,0.38,5.87,657.01
379,propan-2-yl acetate,CC(=O)OC(C)C,108-21-4,"InChI=1S/C5H10O2/c1-4(2)7-5(3)6/h4H,1-3H3",esters,P,5.0,0.0,0.0,9,0.49,8.57,542.92
380,"1,3-dioxolane",C1COCO1,646-06-0,InChI=1S/C3H6O2/c1-2-5-3-4-1/h1-3H2,other,All,2.518,0.2712,8.594,16,0.02,0.23,565.03
381,cycloheptane,C1CCCCCC1,291-64-5,InChI=1S/C7H14/c1-2-4-6-7-5-3-1/h1-7H2,cycloalkanes,All,0.068,1.0,13.013,18,0.0,0.05,614.27
382,cyclooctane,C1CCCCCCC1,292-64-8,InChI=1S/C8H16/c1-2-4-6-8-7-5-3-1/h1-8H2,cycloalkanes,All,0.098,1.0,14.906,18,0.0,0.08,654.72
383,cycloheptanol,OC1CCCCCC1,502-41-0,"InChI=1S/C7H14O/c8-7-5-3-1-2-4-6-7/h7-8H,1-6H2",other,P,9.113,0.0,0.0,3,0.3,2.22,643.94
386,"1,2,4,5-tetramethylbenzene",Cc1cc(C)c(C)cc1C,95-93-2,"InChI=1S/C10H14/c1-7-5-9(3)10(4)6-8(7)2/h5-6H,1-4H3",aromatics,NP,0.0,0.0,19.616,5,0.0,0.14,694.87
388,1-methyl-4-propan-2-ylbenzene,Cc1ccc(C(C)C)cc1,99-87-6,"InChI=1S/C10H14/c1-8(2)10-6-4-9(3)5-7-10/h4-8H,1-3H3",aromatics,NP,0.0,0.0,19.899,11,0.03,1.54,667.27
392,2-(dimethylamino)ethanol,CN(C)CCO,108-01-0,"InChI=1S/C4H11NO/c1-5(2)3-4-6/h6H,3-4H2,1-2H3",other,P,8.478,0.0,0.0,4,1.94,13.23,638.72
397,nonane,CCCCCCCCC,111-84-2,"InChI=1S/C9H20/c1-3-5-7-9-8-6-4-2/h3-9H2,1-2H3",n-alkanes,NP,0.0,0.0,18.2,20,0.01,0.54,606.97
399,methyl propanoate,CCC(=O)OC,554-12-1,"InChI=1S/C4H8O2/c1-3-4(5)6-2/h3H2,1-2H3",other,P,4.953,0.6398,0.0,5,0.01,0.14,542.16
404,methyl hexanoate,CCCCCC(=O)OC,106-70-7,"InChI=1S/C7H14O2/c1-3-4-5-6-7(8)9-2/h3-6H2,1-2H3",other,P,5.915,1.0,0.0,3,0.02,0.46,615.38
405,methyl octanoate,CCCCCCCC(=O)OC,111-11-5,"InChI=1S/C9H18O2/c1-3-4-5-6-7-8-9(10)11-2/h3-8H2,1-2H3",other,P,6.206,1.0,0.0,2,0.05,1.29,656.98
406,methyl decanoate,CCCCCCCCCC(=O)OC,110-42-9,"InChI=1S/C11H22O2/c1-3-4-5-6-7-8-9-10-11(12)13-2/h3-10H2,1-2H3",other,P,6.672,1.0,0.0,2,0.05,1.28,692.14
415,pentyl acetate,CCCCCOC(C)=O,628-63-7,"InChI=1S/C7H14O2/c1-3-4-5-6-9-7(2)8/h3-6H2,1-2H3",esters,P,6.147,0.9907,0.0,11,0.12,2.7,608.59
422,butyl butanoate,CCCCOC(=O)CCC,109-21-7,"InChI=1S/C8H16O2/c1-3-5-7-10-8(9)6-4-2/h3-7H2,1-2H3",other,P,6.062,0.6895,0.0,4,0.04,0.92,632.75
426,"1,1,2,2,2-pentafluoro-n,n-bis(1,1,2,2,2-pentafluoroethyl)ethanamine",FC(F)(F)C(F)(F)N(C(F)(F)C(F)(F)F)C(F)(F)C(F)(F)F,359-70-6,"InChI=1S/C6F15N/c7-1(8,9)4(16,17)22(5(18,19)2(10,11)12)6(20,21)3(13,14)15",other,NP,0.0,0.0,20.137,1,0.0,0.0,469.9
431,propyl propanoate,CCCOC(=O)CC,106-36-5,"InChI=1S/C6H12O2/c1-3-5-8-6(7)4-2/h3-5H2,1-2H3",other,All,3.961,0.9333,18.231,8,0.01,0.11,583.48
432,quinoline,c1ccc2ncccc2c1,91-22-5,InChI=1S/C9H7N/c1-2-6-9-8(4-1)5-3-7-10-9/h1-7H,other,All,5.077,0.2789,20.018,8,0.16,1.8,798.06
441,2-(chloromethyl)oxirane,ClCC1CO1,106-89-8,"InChI=1S/C3H5ClO/c4-1-3-2-5-3/h3H,1-2H2",other,P,9.516,0.1649,0.0,2,0.0,0.0,623.26
442,2-[2-(2-hydroxyethoxy)ethoxy]ethanol,OCCOCCOCCO,112-27-6,"InChI=1S/C6H14O4/c7-1-3-9-5-6-10-4-2-8/h7-8H,1-6H2",other,P,15.964,0.1391,0.0,8,0.1,0.42,861.31
446,chlorocyclohexane,ClC1CCCCC1,542-18-7,"InChI=1S/C6H11Cl/c7-6-4-2-1-3-5-6/h6H,1-5H2",other,P,7.596,0.4733,0.0,5,0.16,2.08,652.16
447,2-(2-methoxyethoxy)ethanol,COCCOCCO,111-77-3,"InChI=1S/C5H12O3/c1-7-4-5-8-3-2-6/h6H,2-5H2,1H3",other,P,13.165,0.2571,0.0,2,0.22,1.32,707.25
452,nonan-5-one,CCCCC(=O)CCCC,502-56-7,"InChI=1S/C9H18O/c1-3-5-7-9(10)8-6-4-2/h3-8H2,1-2H3",ketones,All,12.017,0.3059,3.455,16,0.01,0.13,657.77
455,2-(2-ethoxyethoxy)ethanol,CCOCCOCCO,111-90-0,"InChI=1S/C6H14O3/c1-2-8-5-6-9-4-3-7/h7H,2-6H2,1H3",other,P,14.079,0.2672,0.0,2,0.01,0.07,630.99
456,2-methylprop-1-ene,C=C(C)C,115-11-7,"InChI=1S/C4H8/c1-4(2)3/h1H2,2-3H3",alkenes,All,0.364,1.0,7.856,6,0.0,0.06,427.37
457,2-methoxyethyl acetate,COCCOC(C)=O,110-49-6,"InChI=1S/C5H10O3/c1-5(6)8-4-3-7-2/h3-4H2,1-2H3",other,P,6.586,0.12,0.0,1,0.12,1.49,606.13
459,(z)-but-2-ene,CC=CC,590-18-1,"InChI=1S/C4H8/c1-3-4-2/h3-4H,1-2H3/b4-3-",alkenes,NP,0.0,0.0,9.542,5,0.03,1.4,443.44
460,2-methylpropan-2-amine,CC(C)(C)N,75-64-9,"InChI=1S/C4H11N/c1-4(2,3)5/h5H2,1-3H3",other,P,3.307,0.0,0.0,4,0.2,4.88,494.75
462,2-(2-hydroxyethoxy)ethanol,OCCOCCO,111-46-6,"InChI=1S/C4H10O3/c5-1-3-7-4-2-6/h5-6H,1-4H2",other,P,13.652,0.1126,0.0,11,0.28,0.97,782.3
463,3-methylhexane,CCCC(C)CC,589-34-4,"InChI=1S/C7H16/c1-4-6-7(3)5-2/h7H,4-6H2,1-3H3",branched alkanes,NP,0.0,0.0,14.133,6,0.0,0.21,547.5
464,methyl prop-2-enoate,C=CC(=O)OC,96-33-3,"InChI=1S/C4H6O2/c1-3-4(5)6-2/h3H,1H2,2H3",other,P,4.619,0.2467,0.0,25,0.06,0.96,555.65
466,"1,2,4-trichlorobenzene",Clc1ccc(Cl)c(Cl)c1,120-82-1,InChI=1S/C6H3Cl3/c7-4-1-2-5(8)6(9)3-4/h1-3H,other,P,5.866,0.12,0.0,1,0.0,0.0,751.91
467,"2,2-dimethylpropane",CC(C)(C)C,463-82-1,"InChI=1S/C5H12/c1-5(2,3)4/h1-4H3",branched alkanes,NP,0.0,0.0,10.441,6,0.01,0.52,439.91
471,benzylbenzene,c1ccc(Cc2ccccc2)cc1,101-81-5,"InChI=1S/C13H12/c1-3-7-12(8-4-1)11-13-9-5-2-6-10-13/h1-10H,11H2",aromatics,NP,0.0,0.0,24.019,1,0.0,0.0,788.51
473,butan-2-ylbenzene,CCC(C)c1ccccc1,135-98-8,"InChI=1S/C10H14/c1-3-9(2)10-7-5-4-6-8-10/h4-9H,3H2,1-2H3",aromatics,All,0.479,1.0,17.378,6,0.0,0.2,669.57
486,"1,3,5-trimethylbenzene",Cc1cc(C)cc(C)c1,108-67-8,"InChI=1S/C9H12/c1-7-4-8(2)6-9(3)5-7/h4-6H,1-3H3",aromatics,NP,0.0,0.0,17.879,8,0.02,0.67,660.02
488,1-methyl-2-nitrobenzene,Cc1ccccc1[N+](=O)[O-],88-72-2,"InChI=1S/C7H7NO2/c1-6-4-2-3-5-7(6)8(9)10/h2-5H,1H3",other,P,17.22,0.1908,0.0,18,0.35,1.44,755.66
489,1-methyl-3-nitrobenzene,Cc1cccc([N+](=O)[O-])c1,99-08-1,"InChI=1S/C7H7NO2/c1-6-3-2-4-7(5-6)8(9)10/h2-5H,1H3",other,P,18.712,0.2162,0.0,6,0.31,1.2,770.15
490,1-methyl-4-nitrobenzene,Cc1ccc([N+](=O)[O-])cc1,99-99-0,"InChI=1S/C7H7NO2/c1-6-2-4-7(5-3-6)8(9)10/h2-5H,1H3",other,P,13.299,0.12,0.0,1,0.0,0.0,770.91
491,chloromethylbenzene,ClCc1ccccc1,100-44-7,"InChI=1S/C7H7Cl/c8-6-7-4-2-1-3-5-7/h1-5H,6H2",other,P,6.617,0.6091,0.0,8,0.08,1.23,692.96
498,decanoic acid,CCCCCCCCCC(=O)O,334-48-5,"InChI=1S/C10H20O2/c1-2-3-4-5-6-7-8-9-10(11)12/h2-9H2,1H3,(H,11,12)",other,P,3.877,1.0,0.0,4,0.09,3.79,760.79
501,isoquinoline,c1ccc2cnccc2c1,119-65-3,InChI=1S/C9H7N/c1-2-4-9-7-10-6-5-8(9)3-1/h1-7H,other,P,9.484,0.3907,0.0,3,0.01,0.09,809.86
502,2-methylquinoline,Cc1ccc2ccccc2n1,91-63-4,"InChI=1S/C10H9N/c1-8-6-7-9-4-2-3-5-10(9)11-8/h2-7H,1H3",other,P,7.945,0.548,0.0,3,0.01,0.16,796.77
503,ethyl 2-hydroxybenzoate,CCOC(=O)c1ccccc1O,118-61-6,"InChI=1S/C9H10O3/c1-2-12-9(11)7-5-3-4-6-8(7)10/h3-6,10H,2H2,1H3",other,P,9.747,0.4266,0.0,9,0.17,2.13,717.87
504,phenoxybenzene,c1ccc(Oc2ccccc2)cc1,101-84-8,InChI=1S/C12H10O/c1-3-7-11(8-4-1)13-12-9-5-2-6-10-12/h1-10H,other,All,2.007,1.0,22.278,7,0.02,0.57,789.82
505,4-methylquinoline,Cc1ccnc2ccccc12,491-35-0,"InChI=1S/C10H9N/c1-8-6-7-11-10-5-3-2-4-9(8)10/h2-7H,1H3",other,NP,0.0,0.0,61.78,3,0.2,2.23,827.38
509,1-methyl-4-prop-1-en-2-ylcyclohexene,C=C(C)C1CC=C(C)CC1,138-86-3,"InChI=1S/C10H16/c1-8(2)10-6-4-9(3)5-7-10/h4,10H,1,5-7H2,2-3H3",other,NP,0.0,0.0,21.985,2,0.06,2.35,662.79
510,1-methyl-4-propan-2-ylidenecyclohexene,CC1=CCC(=C(C)C)CC1,586-62-9,"InChI=1S/C10H16/c1-8(2)10-6-4-9(3)5-7-10/h4H,5-7H2,1-3H3",other,NP,0.0,0.0,20.304,1,0.0,0.0,686.41
514,undecan-1-ol,CCCCCCCCCCCO,112-42-5,"InChI=1S/C11H24O/c1-2-3-4-5-6-7-8-9-10-11-12/h12H,2-11H2,1H3",n-alcohols,P,9.076,0.0,0.0,2,0.18,3.38,715.95
515,hexadecane,CCCCCCCCCCCCCCCC,544-76-3,"InChI=1S/C16H34/c1-3-5-7-9-11-13-15-16-14-12-10-8-6-4-2/h3-16H2,1-2H3",n-alkanes,NP,0.0,0.0,31.872,4,0.02,0.79,732.5
517,"dibutyl benzene-1,2-dicarboxylate",CCCCOC(=O)c1ccccc1C(=O)OCCCC,84-74-2,"InChI=1S/C16H22O4/c1-3-5-11-19-15(17)13-9-7-8-10-14(13)16(18)20-12-6-4-2/h7-10H,3-6,11-12H2,1-2H3",other,P,14.915,0.6436,0.0,5,0.01,0.1,808.92
521,"1,2,4-trimethylbenzene",Cc1ccc(C)c(C)c1,95-63-6,"InChI=1S/C9H12/c1-7-4-5-8(2)9(3)6-7/h4-6H,1-3H3",aromatics,All,0.261,1.0,16.969,7,0.0,0.15,672.16
522,"1,2,3-trimethylbenzene",Cc1cccc(C)c1C,526-73-8,"InChI=1S/C9H12/c1-7-5-4-6-8(2)9(7)3/h4-6H,1-3H3",aromatics,All,0.645,1.0,16.238,6,0.0,0.19,684.94
525,1-(1-butoxypropan-2-yloxy)propan-2-ol,CCCCOCC(C)OCC(C)O,29911-28-2,"InChI=1S/C10H22O3/c1-4-5-6-12-8-10(3)13-7-9(2)11/h9-11H,4-8H2,1-3H3",other,P,10.753,0.0799,0.0,5,0.01,0.17,772.74
528,1-bromopentane,CCCCCBr,110-53-2,"InChI=1S/C5H11Br/c1-2-3-4-5-6/h2-5H2,1H3",other,All,1.98,0.0,29.134,24,0.18,2.09,628.39
532,"n,n-dimethylmethanamine",CN(C)C,75-50-3,InChI=1S/C3H9N/c1-4(2)3/h1-3H3,other,NP,0.0,0.0,14.102,4,0.16,5.77,441.01
533,deuteriooxymethane,CO,1455-13-6,"InChI=1S/CH4O/c1-2/h2H,1H3/i2D",other,All,5.552,0.132,3.508,18,0.16,0.33,524.77
534,dodecan-1-ol,CCCCCCCCCCCCO,112-53-8,"InChI=1S/C12H26O/c1-2-3-4-5-6-7-8-9-10-11-12-13/h13H,2-12H2,1H3",n-alcohols,P,9.395,0.0,0.0,18,0.38,7.44,729.63
541,"thiolane 1,1-dioxide",O=S1(=O)CCCC1,126-33-0,InChI=1S/C4H8O2S/c5-7(6)3-1-2-4-7/h1-4H2,other,All,4.713,0.0104,78.329,38,0.69,1.74,881.97
550,"1,2-dichloro-1,1,2,2-tetrafluoroethane",FC(F)(Cl)C(F)(F)Cl,76-14-2,"InChI=1S/C2Cl2F4/c3-1(5,6)2(4,7)8",other,NP,0.0,0.0,14.214,1,0.0,0.0,425.52
551,dichloro(fluoro)methane,FC(Cl)Cl,75-43-4,InChI=1S/CHCl2F/c2-1(3)4/h1H,other,P,3.356,0.12,0.0,1,0.0,0.0,459.58
556,4-methylpent-3-en-2-one,CC(=O)C=C(C)C,141-79-7,"InChI=1S/C6H10O/c1-5(2)4-6(3)7/h4H,1-3H3",ketones,P,9.807,0.12,0.0,1,0.0,0.0,611.09
574,"2,2,3,3-tetrafluoropropan-1-ol",OCC(F)(F)C(F)F,76-37-9,"InChI=1S/C3H4F4O/c4-2(5)3(6,7)1-8/h2,8H,1H2",other,P,9.459,0.0602,0.0,11,0.15,0.71,578.97
576,"2,4,6-trimethylpyridine",Cc1cc(C)nc(C)c1,108-75-8,"InChI=1S/C8H11N/c1-6-4-7(2)9-8(3)5-6/h4-5H,1-3H3",other,P,8.552,0.5065,0.0,3,0.0,0.0,664.6
579,methoxymethane,COC,115-10-6,InChI=1S/C2H6O/c1-3-2/h1-2H3,ethers,P,2.723,0.4287,0.0,32,0.15,5.33,407.91
580,chloromethane,CCl,74-87-3,InChI=1S/CH3Cl/c1-2/h1H3,other,All,1.794,0.1002,13.943,20,0.05,0.5,419.41
583,undec-1-ene,C=CCCCCCCCCC,821-95-4,"InChI=1S/C11H22/c1-3-5-7-9-11-10-8-6-4-2/h3H,1,4-11H2,2H3",alkenes,NP,0.0,0.0,23.707,6,0.01,0.31,652.82
584,"diethyl benzene-1,2-dicarboxylate",CCOC(=O)c1ccccc1C(=O)OCC,84-66-2,"InChI=1S/C12H14O4/c1-3-15-11(13)9-7-5-6-8-10(9)12(14)16-4-2/h5-8H,3-4H2,1-2H3",other,P,13.193,0.5543,0.0,5,0.01,0.16,784.39
585,hex-1-yne,C#CCCCC,693-02-7,"InChI=1S/C6H10/c1-3-5-6-4-2/h1H,4-6H2,2H3",alkynes,All,0.798,1.0,11.788,6,0.0,0.15,527.85
597,"2,2,2-trifluoroacetic acid",O=C(O)C(F)(F)F,76-05-1,"InChI=1S/C2HF3O2/c3-2(4,5)1(6)7/h(H,6,7)",other,P,5.348,0.4954,0.0,8,0.11,1.3,530.73
599,hept-1-ene,C=CCCCCC,592-76-7,"InChI=1S/C7H14/c1-3-5-7-6-4-2/h3H,1,4-7H2,2H3",alkenes,All,0.225,1.0,14.213,6,0.0,0.08,551.51
600,"hexa-1,5-diene",C=CCCC=C,592-42-7,"InChI=1S/C6H10/c1-3-5-6-4-2/h3-4H,1-2,5-6H2",alkenes,NP,0.0,0.0,14.354,6,0.04,1.52,515.88
603,propyl butanoate,CCCOC(=O)CCC,105-66-8,"InChI=1S/C7H14O2/c1-3-5-7(8)9-6-4-2/h3-6H2,1-2H3",other,All,4.494,1.0,12.879,7,0.0,0.05,605.81
608,ethoxybenzene,CCOc1ccccc1,103-73-1,"InChI=1S/C8H10O/c1-2-9-8-6-4-3-5-7-8/h3-7H,2H2,1H3",other,P,4.629,1.0,0.0,4,0.1,2.46,666.44
613,"butane-1,4-diol",OCCCCO,110-63-4,"InChI=1S/C4H10O2/c5-3-1-2-4-6/h5-6H,1-4H2",other,P,12.458,0.102,0.0,31,0.35,1.26,750.41
615,hexan-2-one,CCCCC(C)=O,591-78-6,"InChI=1S/C6H12O/c1-3-4-5-6(2)7/h3-5H2,1-2H3",ketones,P,10.669,0.1684,0.0,5,0.14,0.91,601.96
618,4-nitrophenol,O=[N+]([O-])c1ccc(O)cc1,100-02-7,"InChI=1S/C6H5NO3/c8-6-3-1-5(2-4-6)7(9)10/h1-4,8H",other,P,26.599,0.14,0.0,7,0.12,0.33,799.8
620,"1,1,1,2,2-pentachloroethane",ClC(Cl)C(Cl)(Cl)Cl,76-01-7,"InChI=1S/C2HCl5/c3-1(4)2(5,6)7/h1H",other,All,2.431,0.7869,9.17,8,0.04,1.02,683.53
624,oxolan-2-one,O=C1CCCO1,96-48-0,InChI=1S/C4H6O2/c5-4-2-1-3-6-4/h1-3H2,other,P,17.279,0.1806,0.0,16,0.52,1.29,764.25
626,3-methylheptane,CCCCC(C)CC,589-81-1,"InChI=1S/C8H18/c1-4-6-7-8(3)5-2/h8H,4-7H2,1-3H3",branched alkanes,NP,0.0,0.0,16.133,3,0.0,0.12,577.18
627,1-methoxy-2-[2-(2-methoxyethoxy)ethoxy]ethane,COCCOCCOCCOC,112-49-2,"InChI=1S/C8H18O4/c1-9-3-5-11-7-8-12-6-4-10-2/h3-8H2,1-2H3",other,All,4.476,0.0,38.084,7,0.02,0.21,696.63
634,methyl (z)-octadec-9-enoate,CCCCCCCCC=CCCCCCCCC(=O)OC,112-62-9,"InChI=1S/C19H36O2/c1-3-4-5-6-7-8-9-10-11-12-13-14-15-16-17-18-19(20)21-2/h10-11H,3-9,12-18H2,1-2H3/b11-10-",other,P,8.713,1.0,0.0,2,0.06,1.88,779.49
636,"2,4,6-trimethyl-1,3,5-trioxane",CC1OC(C)OC(C)O1,123-63-7,"InChI=1S/C6H12O3/c1-4-7-5(2)9-6(3)8-4/h4-6H,1-3H3",other,P,10.176,0.0,0.0,10,0.79,8.16,578.42
658,"1,1,2,2,3,3,4,4,5,5,6-undecafluoro-6-(trifluoromethyl)cyclohexane",FC(F)(F)C1(F)C(F)(F)C(F)(F)C(F)(F)C(F)(F)C1(F)F,355-02-2,"InChI=1S/C7F14/c8-1(7(19,20)21)2(9,10)4(13,14)6(17,18)5(15,16)3(1,11)12",other,NP,0.0,0.0,17.583,1,0.0,0.0,492.69
661,"3,3-dimethylbutan-2-one",CC(=O)C(C)(C)C,75-97-8,"InChI=1S/C6H12O/c1-5(7)6(2,3)4/h1-4H3",ketones,P,9.572,0.1408,0.0,5,0.04,0.31,583.14
663,nitrocyclohexane,O=[N+]([O-])C1CCCCC1,1122-60-7,"InChI=1S/C6H11NO2/c8-7(9)6-4-2-1-3-5-6/h6H,1-5H2",other,P,11.091,0.12,0.0,1,0.0,0.0,741.87
664,2-methylbutan-1-ol,CCC(C)CO,137-32-6,"InChI=1S/C5H12O/c1-3-5(2)4-6/h5-6H,3-4H2,1-2H3",other,P,8.89,0.0,0.0,8,0.3,2.14,586.28
666,pentan-2-ol,CCCC(C)O,6032-29-7,"InChI=1S/C5H12O/c1-3-4-5(2)6/h5-6H,3-4H2,1-2H3",other,P,8.319,0.0,0.0,11,0.59,4.87,574.4
667,pentan-3-ol,CCC(O)CC,584-02-1,"InChI=1S/C5H12O/c1-3-5(6)4-2/h5-6H,3-4H2,1-2H3",other,P,8.073,0.0,0.0,11,0.84,7.29,554.6
678,3-ethylpentan-3-ol,CCC(O)(CC)CC,597-49-9,"InChI=1S/C7H16O/c1-4-7(8,5-2)6-3/h8H,4-6H2,1-3H3",other,NP,0.0,0.0,27.943,19,0.28,9.39,596.27
688,2-methylpentan-2-ol,CCCC(C)(C)O,590-36-3,"InChI=1S/C6H14O/c1-4-5-6(2,3)7/h7H,4-5H2,1-3H3",other,P,3.435,0.12,0.0,1,0.0,0.0,581.99
691,hexan-3-ol,CCCC(O)CC,623-37-0,"InChI=1S/C6H14O/c1-3-5-6(7)4-2/h6-7H,3-5H2,1-2H3",other,P,7.684,0.0,0.0,3,0.67,6.98,596.44
692,hexan-2-ol,CCCCC(C)O,626-93-7,"InChI=1S/C6H14O/c1-3-4-5-6(2)7/h6-7H,3-5H2,1-2H3",other,P,8.43,0.0,0.0,3,0.46,4.17,600.15
693,"2,2-dimethylbutan-1-ol",CCC(C)(C)CO,1185-33-7,"InChI=1S/C6H14O/c1-4-6(2,3)5-7/h7H,4-5H2,1-3H3",other,P,9.15,0.0,0.0,11,1.71,14.93,605.57
694,1-bromo-2-chloroethane,ClCCBr,107-04-0,InChI=1S/C2H4BrCl/c3-1-2-4/h1-2H2,other,All,2.048,0.1585,16.982,8,0.06,0.95,619.39
696,diethyl hexanedioate,CCOC(=O)CCCCC(=O)OCC,141-28-6,"InChI=1S/C10H18O4/c1-3-13-9(11)7-5-6-8-10(12)14-4-2/h3-8H2,1-2H3",other,P,10.853,0.7482,0.0,3,0.01,0.19,703.64
697,dibromomethane,BrCBr,74-95-3,InChI=1S/CH2Br2/c2-1-3/h1H2,other,P,3.688,0.2766,0.0,2,0.0,0.0,617.13
699,"1,3-dibromopropane",BrCCCBr,109-64-8,InChI=1S/C3H6Br2/c4-2-1-3-5/h1-3H2,other,P,7.154,0.376,0.0,4,0.01,0.11,698.65
700,formamide,N=CO,75-12-7,"InChI=1S/CH3NO/c2-1-3/h1H,(H2,2,3)",other,P,14.977,0.1229,0.0,20,1.34,1.29,870.95
701,diphenylmethanone,O=C(c1ccccc1)c1ccccc1,119-61-9,InChI=1S/C13H10O/c14-13(11-7-3-1-4-8-11)12-9-5-2-6-10-12/h1-10H,ketones,P,14.706,0.2643,0.0,9,0.49,4.21,845.0
704,1-chloro-2-methylbenzene,Cc1ccccc1Cl,95-49-8,"InChI=1S/C7H7Cl/c1-6-4-2-3-5-7(6)8/h2-5H,1H3",other,P,4.768,1.0,0.0,6,0.06,1.39,672.12
706,ethyl benzoate,CCOC(=O)c1ccccc1,93-89-0,"InChI=1S/C9H10O2/c1-2-11-9(10)8-6-4-3-5-7-8/h3-7H,2H2,1H3",other,NP,0.0,0.0,49.496,19,0.11,1.83,717.05
707,1-bromopropane,CCCBr,106-94-5,"InChI=1S/C3H7Br/c1-2-3-4/h2-3H2,1H3",other,P,5.799,0.4431,0.0,4,0.01,0.18,551.87
708,1-chloro-3-methylbenzene,Cc1cccc(Cl)c1,108-41-8,"InChI=1S/C7H7Cl/c1-6-3-2-4-7(8)5-6/h2-5H,1H3",other,P,5.828,0.7686,0.0,6,0.05,0.87,680.19
717,3-methylbutanoic acid,CC(C)CC(=O)O,503-74-2,"InChI=1S/C5H10O2/c1-4(2)3-5(6)7/h4H,3H2,1-2H3,(H,6,7)",other,NP,0.0,0.0,18.316,1,0.0,0.0,663.32
718,ethyl 3-oxobutanoate,CCOC(=O)CC(C)=O,141-97-9,"InChI=1S/C6H10O3/c1-3-9-6(8)4-5(2)7/h3-4H2,1-2H3",other,P,11.575,0.12,0.0,1,0.0,0.0,669.8
719,methyl butanoate,CCCC(=O)OC,623-42-7,"InChI=1S/C5H10O2/c1-3-4-5(6)7-2/h3-4H2,1-2H3",other,P,5.337,0.9057,0.0,9,0.13,2.61,567.39
720,"pentane-1,5-diol",OCCCCCO,111-29-5,"InChI=1S/C5H12O2/c6-4-2-1-3-5-7/h6-7H,1-5H2",other,P,13.606,0.1348,0.0,8,0.64,2.54,700.78
721,hexadecan-1-ol,CCCCCCCCCCCCCCCCO,36653-82-4,"InChI=1S/C16H34O/c1-2-3-4-5-6-7-8-9-10-11-12-13-14-15-16-17/h17H,2-16H2,1H3",n-alcohols,P,9.285,0.3209,0.0,15,0.04,1.02,789.66
722,octadecan-1-ol,CCCCCCCCCCCCCCCCCCO,112-92-5,"InChI=1S/C18H38O/c1-2-3-4-5-6-7-8-9-10-11-12-13-14-15-16-17-18-19/h19H,2-18H2,1H3",n-alcohols,P,9.58,0.165,0.0,10,0.02,0.55,809.12
723,undecane,CCCCCCCCCCC,1120-21-4,"InChI=1S/C11H24/c1-3-5-7-9-11-10-8-6-4-2/h3-11H2,1-2H3",n-alkanes,NP,0.0,0.0,20.994,14,0.01,0.29,656.78
727,"4-methyl-1,3-dioxolan-2-one",CC1COC(=O)O1,108-32-7,"InChI=1S/C4H6O3/c1-3-2-6-4(5)7-3/h3H,2H2,1H3",other,All,15.839,0.1359,51.452,31,0.31,0.48,797.42
729,"propane-1,3-diol",OCCCO,504-63-2,"InChI=1S/C3H8O2/c4-2-1-3-5/h4-5H,1-3H2",other,P,12.0,0.1565,0.0,31,0.59,2.33,743.05
737,2-ethylhexanoic acid,CCCCC(CC)C(=O)O,149-57-5,"InChI=1S/C8H16O2/c1-3-5-6-7(4-2)8(9)10/h7H,3-6H2,1-2H3,(H,9,10)",other,NP,0.0,0.0,23.066,1,0.0,0.0,699.37
744,heptanoic acid,CCCCCCC(=O)O,111-14-8,"InChI=1S/C7H14O2/c1-2-3-4-5-6-7(8)9/h2-6H2,1H3,(H,8,9)",other,P,3.217,0.12,0.0,1,0.0,0.0,693.93
746,2-bromopropane,CC(C)Br,75-26-3,"InChI=1S/C3H7Br/c1-3(2)4/h3H,1-2H3",other,All,2.24,0.0,27.095,17,0.53,3.77,535.54
747,1-bromo-2-methylpropane,CC(C)CBr,78-77-3,"InChI=1S/C4H9Br/c1-4(2)3-5/h4H,3H2,1-2H3",other,P,6.384,0.5278,0.0,8,0.03,0.45,573.11
749,1-chloro-4-methylbenzene,Cc1ccc(Cl)cc1,106-43-4,"InChI=1S/C7H7Cl/c1-6-2-4-7(8)5-3-6/h2-5H,1H3",other,P,6.59,0.7648,0.0,6,0.09,1.47,677.98
750,dodec-1-ene,C=CCCCCCCCCCC,112-41-4,"InChI=1S/C12H24/c1-3-5-7-9-11-12-10-8-6-4-2/h3H,1,4-12H2,2H3",alkenes,NP,0.0,0.0,25.914,6,0.01,0.3,667.91
754,heptanal,CCCCCCC=O,111-71-7,"InChI=1S/C7H14O/c1-2-3-4-5-6-7-8/h7H,2-6H2,1H3",aldehydes,P,8.244,0.12,0.0,1,0.0,0.0,644.09
759,2-methylhexane,CCCCC(C)C,591-76-4,"InChI=1S/C7H16/c1-4-5-6-7(2)3/h7H,4-6H2,1-3H3",branched alkanes,NP,0.0,0.0,14.438,1,0.0,0.0,542.3
761,"2,4-dimethylhexane",CCC(C)CC(C)C,589-43-5,"InChI=1S/C8H18/c1-5-8(4)6-7(2)3/h7-8H,5-6H2,1-4H3",branched alkanes,NP,0.0,0.0,16.577,3,0.0,0.11,564.31
762,tert-butylbenzene,CC(C)(C)c1ccccc1,98-06-6,"InChI=1S/C10H14/c1-10(2,3)9-7-5-4-6-8-9/h4-8H,1-3H3",aromatics,All,0.471,1.0,17.277,6,0.01,0.23,660.25
765,"benzene-1,2-diol",Oc1ccccc1O,120-80-9,"InChI=1S/C6H6O2/c7-5-3-1-2-4-6(5)8/h1-4,7-8H",other,P,13.058,0.2007,0.0,7,0.06,0.4,809.81
773,oxane,C1CCOCC1,142-68-7,InChI=1S/C5H10O/c1-2-4-6-5-3-1/h1-5H2,other,All,2.006,0.0,15.491,9,0.02,0.38,577.02
774,"2,2,2-trichloroacetic acid",O=C(O)C(Cl)(Cl)Cl,76-03-9,"InChI=1S/C2HCl3O2/c3-2(4,5)1(6)7/h(H,6,7)",other,P,3.895,0.12,0.0,1,0.0,0.0,693.04
779,2-nitrophenol,O=[N+]([O-])c1ccccc1O,88-75-5,"InChI=1S/C6H5NO3/c8-6-4-2-1-3-5(6)7(9)10/h1-4,8H",other,P,14.094,0.2841,0.0,10,0.22,1.41,767.12
791,"1,2,3,4,4a,5,6,7,8,8a-decahydronaphthalene",C1CCC2CCCCC2C1,91-17-8,"InChI=1S/C10H18/c1-2-6-10-8-4-3-7-9(10)5-1/h9-10H,1-8H2",other,NP,0.0,0.0,18.725,4,0.01,0.5,702.45
800,nonanoic acid,CCCCCCCCC(=O)O,112-05-0,"InChI=1S/C9H18O2/c1-2-3-4-5-6-7-8-9(10)11/h2-8H2,1H3,(H,10,11)",other,NP,0.0,0.0,24.417,6,0.03,1.07,732.79
801,"1,2-dichlorobenzene",Clc1ccccc1Cl,95-50-1,InChI=1S/C6H4Cl2/c7-5-3-1-2-4-6(5)8/h1-4H,other,P,8.504,0.3805,0.0,7,0.56,7.5,716.46
802,3-methylaniline,Cc1cccc(N)c1,108-44-1,"InChI=1S/C7H9N/c1-6-3-2-4-7(8)5-6/h2-5H,8H2,1H3",other,P,5.755,0.7472,0.0,5,0.06,1.03,738.97
807,2-hydroxybenzaldehyde,O=Cc1ccccc1O,90-02-8,"InChI=1S/C7H6O2/c8-5-6-3-1-2-4-7(6)9/h1-5,9H",other,P,13.072,0.2771,0.0,15,0.48,3.19,739.35
808,2-methoxyphenol,COc1ccccc1O,90-05-1,"InChI=1S/C7H8O2/c1-9-7-5-3-2-4-6(7)8/h2-5,8H,1H3",other,P,9.799,0.3498,0.0,9,0.04,0.43,723.19
809,2-chlorophenol,Oc1ccccc1Cl,95-57-8,"InChI=1S/C6H5ClO/c7-5-3-1-2-4-6(5)8/h1-4,8H",other,P,5.397,0.3311,0.0,11,0.18,3.04,701.59
811,4-chlorophenol,Oc1ccc(Cl)cc1,106-48-9,"InChI=1S/C6H5ClO/c7-5-1-3-6(8)4-2-5/h1-4,8H",other,All,3.296,0.0,29.249,9,0.03,0.31,754.48
815,"pentane-2,4-dione",CC(=O)CC(C)=O,123-54-6,"InChI=1S/C5H8O2/c1-4(6)3-5(2)7/h3H2,1-2H3",ketones,P,15.219,0.2241,0.0,3,0.64,2.66,671.77
816,"benzene-1,3-diol",Oc1cccc(O)c1,108-46-3,"InChI=1S/C6H6O2/c7-5-2-1-3-6(8)4-5/h1-4,7-8H",other,P,13.44,0.3504,0.0,5,0.04,0.29,867.85
822,"penta-1,4-diene",C=CCC=C,591-93-5,"InChI=1S/C5H8/c1-3-5-4-2/h3-4H,1-2,5H2",alkenes,NP,0.0,0.0,11.729,5,0.03,1.42,471.74
828,pentanedinitrile,N#CCCCC#N,544-13-8,InChI=1S/C5H6N2/c6-4-2-1-3-5-7/h1-3H2,other,All,7.358,0.1517,69.247,31,0.02,0.05,898.7
834,1-methoxy-2-(2-methoxyethoxy)ethane,COCCOCCOC,111-96-6,"InChI=1S/C6H14O3/c1-7-3-5-9-6-4-8-2/h3-6H2,1-2H3",other,All,5.964,0.3948,16.746,6,0.01,0.17,624.07
835,tetradecan-1-ol,CCCCCCCCCCCCCCO,112-72-1,"InChI=1S/C14H30O/c1-2-3-4-5-6-7-8-9-10-11-12-13-14-15/h15H,2-14H2,1H3",n-alcohols,P,8.932,0.0,0.0,12,0.12,2.99,752.33
838,1-pentoxypentane,CCCCCOCCCCC,693-65-2,"InChI=1S/C10H22O/c1-3-5-7-9-11-10-8-6-4-2/h3-10H2,1-2H3",ethers,P,4.15,0.0,0.0,4,0.05,2.03,646.31
844,cyclopentene,C1=CCCC1,142-29-0,"InChI=1S/C5H8/c1-2-4-5-3-1/h1-2H,3-5H2",other,NP,0.0,0.0,10.003,17,0.01,0.53,514.96
845,cycloheptene,C1=CCCCCC1,628-92-2,"InChI=1S/C7H12/c1-2-4-6-7-5-3-1/h1-2H,3-7H2",other,All,0.236,1.0,13.047,7,0.0,0.05,610.41
847,"cyclohexa-1,4-diene",C1=CCC=CC1,628-41-1,"InChI=1S/C6H8/c1-2-4-6-5-3-1/h1-2,5-6H,3-4H2",alkenes,All,0.074,1.0,11.053,7,0.0,0.11,582.36
853,2-chloroaniline,Nc1ccccc1Cl,95-51-2,"InChI=1S/C6H6ClN/c7-5-3-1-2-4-6(5)8/h1-4H,8H2",other,P,5.403,0.12,0.0,1,0.44,6.02,734.44
854,3-chloroaniline,Nc1cccc(Cl)c1,108-42-9,"InChI=1S/C6H6ClN/c7-5-2-1-3-6(8)4-5/h1-4H,8H2",other,P,8.077,0.12,0.0,1,0.34,2.66,781.63
856,2-nitroaniline,Nc1ccccc1[N+](=O)[O-],88-74-4,"InChI=1S/C6H6N2O2/c7-5-3-1-2-4-6(5)8(9)10/h1-4H,7H2",other,P,32.129,0.2022,0.0,3,0.06,0.19,822.71
858,4-nitroaniline,Nc1ccc([N+](=O)[O-])cc1,100-01-6,"InChI=1S/C6H6N2O2/c7-5-1-3-6(4-2-5)8(9)10/h1-4H,7H2",other,P,51.682,0.1627,0.0,3,0.07,0.12,831.04
884,diethyl oxalate,CCOC(=O)C(=O)OCC,95-92-1,"InChI=1S/C6H10O4/c1-3-9-5(7)6(8)10-4-2/h3-4H2,1-2H3",other,P,9.642,0.5501,0.0,4,0.16,2.04,657.66
887,(4r)-1-methyl-4-prop-1-en-2-ylcyclohexene,C=C(C)C1CC=C(C)CC1,5989-27-5,"InChI=1S/C10H16/c1-8(2)10-6-4-9(3)5-7-10/h4,10H,1,5-7H2,2-3H3/t10-/m0/s1",other,NP,0.0,0.0,22.198,2,0.04,1.53,666.67
893,2-(2-hydroxyethylamino)ethanol,OCCNCCO,111-42-2,"InChI=1S/C4H11NO2/c6-3-1-5-2-4-7/h5-7H,1-4H2",other,P,13.516,0.1925,0.0,6,0.23,1.02,747.73
895,methyl pentanoate,CCCCC(=O)OC,624-24-8,"InChI=1S/C6H12O2/c1-3-4-5-6(7)8-2/h3-5H2,1-2H3",other,P,5.853,0.9914,0.0,2,0.0,0.0,596.63
909,bromo(trifluoro)methane,FC(F)(F)Br,75-63-8,"InChI=1S/CBrF3/c2-1(3,4)5",other,NP,0.0,0.0,15.439,1,0.0,0.0,345.05
910,"1,1-difluoroethane",CC(F)F,75-37-6,"InChI=1S/C2H4F2/c1-2(3)4/h2H,1H3",other,All,4.016,0.1133,12.676,11,0.01,0.05,393.46
912,ethanethiol,CCS,75-08-1,"InChI=1S/C2H6S/c1-2-3/h3H,2H2,1H3",other,P,4.183,0.6032,0.0,2,0.0,0.0,507.74
917,butan-2-amine,CCC(C)N,13952-84-6,"InChI=1S/C4H11N/c1-3-4(2)5/h4H,3,5H2,1-2H3",other,P,3.445,0.0,0.0,5,0.07,1.66,520.87
919,2-chlorobutane,CCC(C)Cl,78-86-4,"InChI=1S/C4H9Cl/c1-3-4(2)5/h4H,3H2,1-2H3",other,P,7.119,0.4333,0.0,7,0.11,1.31,536.75
924,anthracene,c1ccc2cc3ccccc3cc2c1,120-12-7,InChI=1S/C14H10/c1-2-6-12-10-14-8-4-3-7-13(14)9-11(12)5-1/h1-10H,other,NP,0.0,0.0,28.864,4,0.0,0.06,948.74
934,octan-3-ol,CCCCCC(O)CC,589-98-0,"InChI=1S/C8H18O/c1-3-5-6-7-8(9)4-2/h8-9H,3-7H2,1-2H3",other,P,9.038,0.0,0.0,36,2.09,33.65,618.79
935,octan-2-ol,CCCCCCC(C)O,123-96-6,"InChI=1S/C8H18O/c1-3-4-5-6-7-8(2)9/h8-9H,3-7H2,1-2H3",other,P,9.479,0.0,0.0,46,1.42,25.2,653.72
944,"2,4-dimethylaniline",Cc1ccc(N)c(C)c1,95-68-1,"InChI=1S/C8H11N/c1-6-3-4-8(9)7(2)5-6/h3-5H,9H2,1-2H3",other,P,4.457,0.12,0.0,1,0.0,0.0,736.26
955,butanenitrile,CCCC#N,109-74-0,"InChI=1S/C4H7N/c1-2-3-4-5/h2-3H2,1H3",other,All,3.856,0.0,45.106,21,0.71,3.12,602.06
956,"2-chloro-1,1,1,2-tetrafluoroethane",FC(Cl)C(F)(F)F,2837-89-0,"InChI=1S/C2HClF4/c3-1(4)2(5,6)7/h1H",other,P,3.585,0.12,0.0,1,0.0,0.0,402.99
966,n-methylcyclohexanamine,CNC1CCCCC1,100-60-7,"InChI=1S/C7H15N/c1-8-7-5-3-2-4-6-7/h7-8H,2-6H2,1H3",other,NP,0.0,0.0,31.892,1,0.0,0.0,660.52
975,octan-2-one,CCCCCCC(C)=O,111-13-7,"InChI=1S/C8H16O/c1-3-4-5-6-7-8(2)9/h3-7H2,1-2H3",ketones,All,5.957,0.0,31.005,16,0.18,1.89,643.35
976,2-methylpentan-1-ol,CCCC(C)CO,105-30-6,"InChI=1S/C6H14O/c1-3-4-6(2)5-7/h6-7H,3-5H2,1-2H3",other,P,11.364,0.3069,0.0,2,0.0,0.0,594.78
977,diiodomethane,ICI,75-11-6,InChI=1S/CH2I2/c2-1-3/h1H2,other,P,3.172,0.12,0.0,1,0.0,0.0,757.82
1000,2-[bis(2-hydroxyethyl)amino]ethanol,OCCN(CCO)CCO,102-71-6,"InChI=1S/C6H15NO3/c8-4-1-7(2-5-9)3-6-10/h8-10H,1-6H2",other,P,19.538,0.1624,0.0,6,0.01,0.03,847.34
1004,dimethyl sulfate,COS(=O)(=O)OC,77-78-1,"InChI=1S/C2H6O4S/c1-5-7(3,4)6-2/h1-2H3",other,P,21.932,0.1543,0.0,6,2.34,4.39,709.28
1005,2-methoxyaniline,COc1ccccc1N,90-04-0,"InChI=1S/C7H9NO/c1-9-7-5-3-2-4-6(7)8/h2-5H,8H2,1H3",other,All,3.483,1.0,16.783,12,0.09,1.87,709.03
1008,4-ethoxyaniline,CCOc1ccc(N)cc1,156-43-4,"InChI=1S/C8H11NO/c1-2-10-8-5-3-7(9)4-6-8/h3-6H,2,9H2,1H3",other,P,6.41,0.12,0.0,1,0.0,0.0,824.33
1009,2-bromo-2-methylpropane,CC(C)(C)Br,507-19-7,"InChI=1S/C4H9Br/c1-4(2,3)5/h1-3H3",other,P,8.856,0.3972,0.0,10,0.19,1.78,544.93
1010,2-methoxy-4-prop-2-enylphenol,C=CCc1ccc(O)c(OC)c1,97-53-0,"InChI=1S/C10H12O2/c1-3-4-8-5-6-9(11)10(7-8)12-2/h3,5-7,11H,1,4H2,2H3",other,P,9.338,0.12,0.0,1,0.0,0.0,784.9
1011,2-ethylpyridine,CCc1ccccn1,100-71-0,"InChI=1S/C7H9N/c1-2-7-5-3-4-6-8-7/h3-6H,2H2,1H3",other,P,7.079,0.3813,0.0,3,0.02,0.22,647.86
1013,tetrafluoromethane,FC(F)(F)F,75-73-0,"InChI=1S/CF4/c2-1(3,4)5",other,NP,0.0,0.0,3.886,12,0.01,0.41,230.33
1022,"2,6,10,15,19,23-hexamethyltetracosane",CC(C)CCCC(C)CCCC(C)CCCCC(C)CCCC(C)CCCC(C)C,111-01-3,"InChI=1S/C30H62/c1-25(2)15-11-19-29(7)23-13-21-27(5)17-9-10-18-28(6)22-14-24-30(8)20-12-16-26(3)4/h25-30H,9-24H2,1-8H3",branched alkanes,NP,0.0,0.0,60.622,4,0.01,0.33,827.47
1023,2-phenylacetonitrile,N#CCc1ccccc1,140-29-4,"InChI=1S/C8H7N/c9-7-6-8-4-2-1-3-5-8/h1-5H,6H2",other,P,15.136,0.2748,0.0,14,0.4,2.79,787.19
1038,ethoxymethoxyethane,CCOCOCC,462-95-3,"InChI=1S/C5H12O2/c1-3-6-5-7-4-2/h3-5H2,1-2H3",other,NP,0.0,0.0,17.567,5,0.05,1.89,545.84
1039,"1,1-diethoxyethane",CCOC(C)OCC,105-57-7,"InChI=1S/C6H14O2/c1-4-7-6(3)8-5-2/h6H,4-5H2,1-3H3",other,P,3.954,0.0,0.0,2,0.23,6.11,552.95
1041,1-nitrobutane,CCCC[N+](=O)[O-],627-05-4,"InChI=1S/C4H9NO2/c1-2-3-4-5(6)7/h2-4H2,1H3",other,P,8.215,0.12,0.0,1,0.0,0.0,645.36
1048,"2,2,2-trichloroacetaldehyde",O=CC(Cl)(Cl)Cl,75-87-6,"InChI=1S/C2HCl3O/c3-2(4,5)1-6/h1H",other,P,3.573,0.0,0.0,8,0.13,2.28,571.25
1049,carbon dioxide,O=C=O,124-38-9,InChI=1S/CO2/c2-1-3,other,NP,0.0,0.0,3.113,18,0.01,0.75,309.27
1051,molecular oxygen,O=O,7782-44-7,InChI=1S/O2/c1-2,other,NP,0.0,0.0,1.583,52,0.01,0.44,154.4
1052,ethene,C=C,74-85-1,InChI=1S/C2H4/c1-2/h1-2H2,alkenes,NP,0.0,0.0,4.419,9,0.0,0.17,284.63
1053,ethane,CC,74-84-0,InChI=1S/C2H6/c1-2/h1-2H3,n-alkanes,All,0.004,0.4101,4.491,47,0.0,0.25,308.82
1054,prop-1-ene,C=CC,115-07-1,"InChI=1S/C3H6/c1-3-2/h3H,1H2,2H3",alkenes,All,0.174,0.0,6.059,31,0.03,2.05,369.85
1055,molecular nitrogen,N#N,7727-37-9,InChI=1S/N2/c1-2,other,NP,0.0,0.0,1.807,39,0.01,0.79,126.29
1057,argon,[Ar],7440-37-1,InChI=1S/Ar,other,NP,0.0,0.0,1.685,16,0.01,0.58,150.24
1058,molecular chlorine,ClCl,7782-50-5,InChI=1S/Cl2/c1-2,other,NP,0.0,0.0,4.97,32,0.04,2.09,420.56
1060,nitrous oxide,[N-]=[N+]=O,10024-97-2,InChI=1S/N2O/c1-2-3,other,NP,0.0,0.0,3.799,6,0.0,0.24,314.02
1061,xenon,[Xe],7440-63-3,InChI=1S/Xe,other,NP,0.0,0.0,4.171,1,0.0,0.0,290.56
1063,acetylene,C#C,74-86-2,InChI=1S/C2H2/c1-2/h1-2H,alkynes,NP,0.0,0.0,6.116,1,0.0,0.0,314.76
1064,sulfane,S,7783-06-4,InChI=1S/H2S/h1H2,other,All,0.635,0.2816,9.811,26,0.19,4.06,375.46
1072,fluoroform,FC(F)F,75-46-7,InChI=1S/CHF3/c2-1(3)4/h1H,other,P,3.325,0.1493,0.0,22,0.44,4.4,304.02
1074,benzyl benzoate,O=C(OCc1ccccc1)c1ccccc1,120-51-4,"InChI=1S/C14H12O2/c15-14(13-9-5-2-6-10-13)16-11-12-7-3-1-4-8-12/h1-10H,11H2",other,P,7.9,0.8583,0.0,10,0.08,1.69,837.52
1083,"octa-1,7-diene",C=CCCCCC=C,3710-30-3,"InChI=1S/C8H14/c1-3-5-7-8-6-4-2/h3-4H,1-2,5-8H2",other,NP,0.0,0.0,18.547,4,0.02,0.75,576.19
1085,"2,2,2-trifluoroethanol",OCC(F)(F)F,75-89-8,"InChI=1S/C2H3F3O/c3-2(4,5)1-6/h6H,1H2",other,P,9.048,0.0997,0.0,5,0.25,0.96,516.79
1086,heptan-3-one,CCCCC(=O)CC,106-35-4,"InChI=1S/C7H14O/c1-3-5-6-7(8)4-2/h3-6H2,1-2H3",ketones,P,10.763,0.12,0.0,1,0.0,0.0,612.45
1087,(z)-hex-3-ene,CCC=CCC,7642-09-3,"InChI=1S/C6H12/c1-3-5-6-4-2/h5-6H,3-4H2,1-2H3/b6-5-",alkenes,All,0.16,1.0,12.684,6,0.01,0.23,526.09
1089,"2,2-dimethylpentane",CCCC(C)(C)C,590-35-2,"InChI=1S/C7H16/c1-5-6-7(2,3)4/h5-6H2,1-4H3",branched alkanes,All,0.0,0.9998,14.485,21,0.0,0.13,531.33
1094,1-chlorododecane,CCCCCCCCCCCCCl,112-52-7,"InChI=1S/C12H25Cl/c1-2-3-4-5-6-7-8-9-10-11-12-13/h2-12H2,1H3",other,P,8.346,1.0,0.0,4,0.04,0.95,735.48
1096,1-bromododecane,CCCCCCCCCCCCBr,143-15-7,"InChI=1S/C12H25Br/c1-2-3-4-5-6-7-8-9-10-11-12-13/h2-12H2,1H3",other,P,8.242,1.0,0.0,4,0.07,1.79,707.42
1098,tert-butyl acetate,CC(=O)OC(C)(C)C,540-88-5,"InChI=1S/C6H12O2/c1-5(7)8-6(2,3)4/h1-4H3",esters,P,6.043,0.5862,0.0,6,0.01,0.12,548.89
1133,"1,4-dichlorobutane",ClCCCCCl,110-56-5,InChI=1S/C4H8Cl2/c5-3-1-2-4-6/h1-4H2,other,P,7.943,0.4469,0.0,4,0.0,0.04,676.88
1139,n-methylpropanamide,CCC(O)=NC,1187-58-2,"InChI=1S/C4H9NO/c1-3-4(6)5-2/h3H2,1-2H3,(H,5,6)",other,P,27.785,0.0,0.0,15,6.82,5.57,858.84
1140,n-ethylacetamide,CCN=C(C)O,625-50-3,"InChI=1S/C4H9NO/c1-3-5-4(2)6/h3H2,1-2H3,(H,5,6)",other,P,24.182,0.0,0.0,7,1.78,3.66,776.22
1141,"n,n-dimethylpropanamide",CCC(=O)N(C)C,758-96-3,"InChI=1S/C5H11NO/c1-4-5(7)6(2)3/h4H2,1-3H3",other,P,14.17,0.0,0.0,2,0.18,0.55,677.14
1142,"butane-1,3-diol",CC(O)CCO,107-88-0,"InChI=1S/C4H10O2/c1-4(6)2-3-5/h4-6H,2-3H2,1H3",other,P,12.573,0.1386,0.0,47,0.22,0.79,717.71
1143,bromocyclohexane,BrC1CCCCC1,108-85-0,"InChI=1S/C6H11Br/c7-6-4-2-1-3-5-6/h6H,1-5H2",other,P,8.229,0.5298,0.0,6,0.08,1.05,693.75
1144,pentanenitrile,CCCCC#N,110-59-8,"InChI=1S/C5H9N/c1-2-3-4-5-6/h2-4H2,1H3",other,All,9.717,0.2117,22.592,18,0.28,1.31,633.86
1146,octan-1-amine,CCCCCCCCN,111-86-4,"InChI=1S/C8H19N/c1-2-3-4-5-6-7-8-9/h2-9H2,1H3",amines,P,4.724,1.0,0.0,4,0.03,0.97,660.84
1147,decan-1-amine,CCCCCCCCCCN,2016-57-1,"InChI=1S/C10H23N/c1-2-3-4-5-6-7-8-9-10-11/h2-11H2,1H3",amines,P,5.315,1.0,0.0,4,0.04,1.24,713.61
1149,methylsulfanylmethane,CSC,75-18-3,InChI=1S/C2H6S/c1-3-2/h1-2H3,other,P,3.804,0.5545,0.0,4,0.15,2.39,512.59
1157,difluoromethane,FCF,75-10-5,InChI=1S/CH2F2/c2-1-3/h1H2,other,P,4.155,0.127,0.0,9,1.08,11.42,357.41
1158,bromo(chloro)methane,ClCBr,74-97-5,InChI=1S/CH2BrCl/c2-1-3/h1H2,other,P,3.607,0.12,0.0,1,0.0,0.0,571.38
1159,pyrrolidin-2-one,OC1=NCCC1,616-45-5,"InChI=1S/C4H7NO/c6-4-2-1-3-5-4/h1-3H2,(H,5,6)",other,P,14.284,0.2241,0.0,7,0.26,0.99,843.85
1163,"2,4-diisocyanato-1-methylbenzene",Cc1ccc(N=C=O)cc1N=C=O,584-84-9,"InChI=1S/C9H6N2O2/c1-7-2-3-8(10-5-12)4-9(7)11-6-13/h2-4H,1H3",other,All,5.426,0.3533,27.565,6,0.0,0.01,770.3
1171,diethoxymethoxyethane,CCOC(OCC)OCC,122-51-0,"InChI=1S/C7H16O3/c1-4-8-7(9-5-2)10-6-3/h7H,4-6H2,1-3H3",other,P,6.903,1.0,0.0,2,0.0,0.02,598.28
1183,diethyl propanedioate,CCOC(=O)CC(=O)OCC,105-53-3,"InChI=1S/C7H12O4/c1-3-10-6(8)5-7(9)11-4-2/h3-5H2,1-2H3",other,P,9.528,0.4408,0.0,5,0.16,2.01,670.52
1184,diethyl butanedioate,CCOC(=O)CCC(=O)OCC,123-25-1,"InChI=1S/C8H14O4/c1-3-11-7(9)5-6-8(10)12-4-2/h3-6H2,1-2H3",other,P,8.607,0.4073,0.0,6,0.32,5.24,685.28
1186,diethyl pentanedioate,CCOC(=O)CCCC(=O)OCC,818-38-2,"InChI=1S/C9H16O4/c1-3-12-8(10)6-5-7-9(11)13-4-2/h3-7H2,1-2H3",other,P,9.895,0.4754,0.0,3,0.0,0.0,705.12
1189,1-chloronaphthalene,Clc1cccc2ccccc12,90-13-1,InChI=1S/C10H7Cl/c11-10-7-3-5-8-4-1-2-6-9(8)10/h1-7H,other,P,6.42,1.0,0.0,4,0.01,0.24,816.0
1193,trichloro(fluoro)methane,FC(Cl)(Cl)Cl,75-69-4,"InChI=1S/CCl3F/c2-1(3,4)5",other,NP,0.0,0.0,12.511,3,0.09,3.68,478.04
1203,1-bromohexane,CCCCCCBr,111-25-1,"InChI=1S/C6H13Br/c1-2-3-4-5-6-7/h2-6H2,1H3",other,P,7.094,0.7256,0.0,5,0.02,0.39,637.12
1207,"1,3-dichlorobenzene",Clc1cccc(Cl)c1,541-73-1,InChI=1S/C6H4Cl2/c7-5-2-1-3-6(8)4-5/h1-4H,other,P,5.128,0.9338,0.0,5,0.05,1.07,703.33
1212,2-methylpropylbenzene,CC(C)Cc1ccccc1,538-93-2,"InChI=1S/C10H14/c1-9(2)8-10-6-4-3-5-7-10/h3-7,9H,8H2,1-2H3",aromatics,All,0.423,1.0,17.422,6,0.0,0.08,666.83
1222,morpholine-4-carbaldehyde,O=CN1CCOCC1,4394-85-8,"InChI=1S/C5H9NO2/c7-5-6-1-3-8-4-2-6/h5H,1-4H2",other,P,11.721,0.3263,0.0,2,0.0,0.0,800.66
1228,"1-methyl-4-propan-2-ylcyclohexa-1,3-diene",CC1=CC=C(C(C)C)CC1,99-86-5,"InChI=1S/C10H16/c1-8(2)10-6-4-9(3)5-7-10/h4,6,8H,5,7H2,1-3H3",other,NP,0.0,0.0,22.899,1,0.0,0.0,670.22
1235,bromo-chloro-difluoromethane,FC(F)(Cl)Br,353-59-3,"InChI=1S/CBrClF2/c2-1(3,4)5",other,NP,0.0,0.0,14.513,1,0.0,0.0,433.71
1241,"3,3-dimethylpentane",CCC(C)(C)CC,562-49-2,"InChI=1S/C7H16/c1-5-7(3,4)6-2/h5-6H2,1-4H3",branched alkanes,NP,0.0,0.0,14.399,1,0.0,0.0,546.14
1250,pentan-1-amine,CCCCCN,110-58-7,"InChI=1S/C5H13N/c1-2-3-4-5-6/h2-6H2,1H3",amines,P,3.961,0.12,0.0,1,0.0,0.0,573.3
1259,(methyldisulfanyl)methane,CSSC,624-92-0,InChI=1S/C2H6S2/c1-3-4-2/h1-2H3,other,P,6.81,0.432,0.0,6,0.03,0.29,620.23
1262,n-ethylaniline,CCNc1ccccc1,103-69-5,"InChI=1S/C8H11N/c1-2-9-8-6-4-3-5-7-8/h3-7,9H,2H2,1H3",other,P,6.096,0.6774,0.0,3,0.0,0.06,714.08
1263,phenylmethanamine,NCc1ccccc1,100-46-9,"InChI=1S/C7H9N/c8-6-7-4-2-1-3-5-7/h1-5H,6,8H2",other,P,3.886,0.0,0.0,6,0.3,6.05,742.19
1267,n-[bis(dimethylamino)phosphoryl]-n-methylmethanamine,CN(C)P(=O)(N(C)C)N(C)C,680-31-9,"InChI=1S/C6H18N3OP/c1-7(2)11(10,8(3)4)9(5)6/h1-6H3",other,P,24.138,0.108,0.0,6,0.79,2.58,717.11
1270,1-chloropentane,CCCCCCl,543-59-9,"InChI=1S/C5H11Cl/c1-2-3-4-5-6/h2-5H2,1H3",other,P,6.385,0.5293,0.0,6,0.01,0.13,583.87
1293,hexafluoro-lambda6-sulfane,FS(F)(F)(F)(F)F,2551-62-4,"InChI=1S/F6S/c1-7(2,3,4,5)6",other,NP,0.0,0.0,6.906,1,0.0,0.0,322.6
1294,1-chloro-4-nitrobenzene,O=[N+]([O-])c1ccc(Cl)cc1,100-00-5,InChI=1S/C6H4ClNO2/c7-5-1-3-6(4-2-5)8(9)10/h1-4H,other,P,9.833,0.3401,0.0,10,0.01,0.14,799.89
1295,1-chloro-3-nitrobenzene,O=[N+]([O-])c1cccc(Cl)c1,121-73-3,InChI=1S/C6H4ClNO2/c7-5-2-1-3-6(4-5)8(9)10/h1-4H,other,All,8.954,0.0,27.421,12,0.01,0.07,789.15
1296,1-chloro-2-nitrobenzene,O=[N+]([O-])c1ccccc1Cl,88-73-3,InChI=1S/C6H4ClNO2/c7-5-3-1-2-4-6(5)8(9)10/h1-4H,other,P,21.704,0.1434,0.0,14,0.34,0.99,796.37
1299,sulfur dioxide,O=S=O,7446-09-5,InChI=1S/O2S/c1-3-2,other,P,3.637,0.0,0.0,15,0.49,7.31,436.3
1303,triethyl phosphate,CCOP(=O)(OCC)OCC,78-40-0,"InChI=1S/C6H15O4P/c1-4-8-11(7,9-5-2)10-6-3/h4-6H2,1-3H3",other,P,15.78,0.3148,0.0,5,0.07,0.58,677.36
1311,2-ethylbutan-1-ol,CCC(CC)CO,97-95-0,"InChI=1S/C6H14O/c1-3-6(4-2)5-7/h6-7H,3-5H2,1-2H3",other,P,9.06,0.12,0.0,1,0.0,0.0,664.06
1316,cycloheptanone,O=C1CCCCCC1,502-42-1,InChI=1S/C7H12O/c8-7-5-3-1-2-4-6-7/h1-6H2,other,All,7.68,0.299,24.709,25,0.01,0.04,710.03
1317,cyclooctanone,O=C1CCCCCCC1,502-49-8,InChI=1S/C8H14O/c9-8-6-4-2-1-3-5-7-8/h1-7H2,other,P,12.906,0.2628,0.0,12,0.0,0.03,739.06
1325,"2,2-dimethylpropanenitrile",CC(C)(C)C#N,630-18-2,"InChI=1S/C5H9N/c1-5(2,3)4-6/h1-3H3",other,All,10.224,0.2177,26.543,14,0.12,0.68,574.78
1328,1h-pyrrole,c1cc[nH]c1,109-97-7,InChI=1S/C4H5N/c1-2-4-5-3-1/h1-5H,other,P,5.132,0.5838,0.0,3,0.02,0.31,656.57
1335,octanenitrile,CCCCCCCC#N,124-12-9,"InChI=1S/C8H15N/c1-2-3-4-5-6-7-8-9/h2-7H2,1H3",other,P,14.016,0.2798,0.0,6,0.67,5.26,706.47
1337,1-phenylpropan-2-ol,CC(O)Cc1ccccc1,698-87-3,"InChI=1S/C9H12O/c1-8(10)7-9-5-3-2-4-6-9/h2-6,8,10H,7H2,1H3",other,P,7.202,0.0,0.0,2,0.01,0.18,689.74
1339,iodane,I,10034-85-2,InChI=1S/HI/h1H,other,NP,0.0,0.0,9.587,6,0.21,7.24,423.38
1340,iodobenzene,Ic1ccccc1,591-50-4,InChI=1S/C6H5I/c7-6-4-2-1-3-5-6/h1-5H,other,All,0.0,1.0,35.761,11,0.06,1.32,735.69
1341,1-bromooctane,CCCCCCCCBr,111-83-1,"InChI=1S/C8H17Br/c1-2-3-4-5-6-7-8-9/h2-8H2,1H3",other,All,5.527,0.7068,13.664,14,0.03,0.46,677.96
1342,1-iodooctane,CCCCCCCCI,629-27-6,"InChI=1S/C8H17I/c1-2-3-4-5-6-7-8-9/h2-8H2,1H3",other,All,6.147,1.0,9.552,5,0.0,0.05,752.89
1347,"1,1,1,2,2,3,3,3-octafluoropropane",FC(F)(F)C(F)(F)C(F)(F)F,76-19-7,"InChI=1S/C3F8/c4-1(5,2(6,7)8)3(9,10)11",other,NP,0.0,0.0,8.955,13,0.01,0.41,349.41
1353,4-methoxybenzaldehyde,COc1ccc(C=O)cc1,123-11-5,"InChI=1S/C8H8O2/c1-10-8-4-2-7(6-9)3-5-8/h2-6H,1H3",other,P,10.507,0.12,0.0,1,0.0,0.0,791.92
1361,"1,1,1,3,3,3-hexafluoropropan-2-one",O=C(C(F)(F)F)C(F)(F)F,684-16-2,"InChI=1S/C3F6O/c4-2(5,6)1(10)3(7,8)9",other,All,0.239,1.0,8.436,14,0.0,0.14,362.65
1366,butan-2-yl acetate,CCC(C)OC(C)=O,105-46-4,"InChI=1S/C6H12O2/c1-4-5(2)8-6(3)7/h5H,4H2,1-3H3",esters,P,5.766,0.8234,0.0,6,0.01,0.13,564.38
1368,ethyl carbonochloridate,CCOC(=O)Cl,541-41-3,"InChI=1S/C3H5ClO2/c1-2-6-3(4)5/h2H2,1H3",other,P,6.529,0.12,0.0,1,0.0,0.0,570.98
1370,"ethyl 2,2-dichloroacetate",CCOC(=O)C(Cl)Cl,535-15-9,"InChI=1S/C4H6Cl2O2/c1-2-8-4(7)3(5)6/h3H,2H2,1H3",other,P,8.381,0.237,0.0,2,0.0,0.0,533.48
1378,ethyl 2-chloroacetate,CCOC(=O)CCl,105-39-5,"InChI=1S/C4H7ClO2/c1-2-7-4(6)3-5/h2-3H2,1H3",other,P,8.224,0.12,0.0,1,0.0,0.0,633.3
1383,1-bromo-2-methylbenzene,Cc1ccccc1Br,95-46-5,"InChI=1S/C7H7Br/c1-6-4-2-3-5-7(6)8/h2-5H,1H3",other,All,3.987,0.9395,5.905,6,0.0,0.09,703.41
1385,1-bromo-4-methylbenzene,Cc1ccc(Br)cc1,106-38-7,"InChI=1S/C7H7Br/c1-6-2-4-7(8)5-3-6/h2-5H,1H3",other,P,6.399,0.7609,0.0,3,0.0,0.0,698.75
1393,2-ethoxyethyl acetate,CCOCCOC(C)=O,111-15-9,"InChI=1S/C6H12O3/c1-3-8-4-5-9-6(2)7/h3-5H2,1-2H3",other,P,7.706,0.2515,0.0,4,0.13,1.68,618.03
1402,"1,2-dibromobenzene",Brc1ccccc1Br,583-53-9,InChI=1S/C6H4Br2/c7-5-3-1-2-4-6(5)8/h1-4H,other,P,5.984,0.12,0.0,1,0.15,2.04,767.76
1403,"1,3-dibromobenzene",Brc1cccc(Br)c1,108-36-1,InChI=1S/C6H4Br2/c7-5-2-1-3-6(8)4-5/h1-4H,other,P,4.469,0.4829,0.0,2,0.0,0.0,776.91
1404,6-methylquinoline,Cc1ccc2ncccc2c1,91-62-3,"InChI=1S/C10H9N/c1-8-4-5-10-9(7-8)3-2-6-11-10/h2-7H,1H3",other,P,9.569,0.5278,0.0,2,0.0,0.0,804.41
1418,dodecan-1-amine,CCCCCCCCCCCCN,124-22-1,"InChI=1S/C12H27N/c1-2-3-4-5-6-7-8-9-10-11-12-13/h2-13H2,1H3",amines,P,5.902,1.0,0.0,3,0.03,0.96,717.92
1421,,O=[N+]([O-])[N+](=O)[O-],10544-72-6,InChI=1S/N2O4/c3-1(4)2(5)6,other,NP,0.0,0.0,8.531,5,0.03,1.33,414.95
1438,1-bromoheptane,CCCCCCCBr,629-04-9,"InChI=1S/C7H15Br/c1-2-3-4-5-6-7-8/h2-7H2,1H3",other,All,4.334,0.5494,19.485,25,0.02,0.24,662.73
1439,fluoromethane,CF,593-53-3,InChI=1S/CH3F/c1-2/h1H3,other,All,2.716,0.1293,5.396,19,0.27,1.02,317.44
1440,bromomethane,CBr,74-83-9,InChI=1S/CH3Br/c1-2/h1H3,other,P,3.46,0.302,0.0,12,0.64,10.04,467.73
1464,5-methyloxolan-2-one,CC1CCC(=O)O1,108-29-2,"InChI=1S/C5H8O2/c1-4-2-3-5(6)7-4/h4H,2-3H2,1H3",other,P,19.174,0.1866,0.0,2,0.0,0.0,745.72
1479,methyl 2-cyanoacetate,COC(=O)CC#N,105-34-0,"InChI=1S/C4H5NO2/c1-7-4(6)2-3-5/h2H2,1H3",other,P,11.953,0.12,0.0,1,0.0,0.0,702.68
1500,1-ethyl-2-methylbenzene,CCc1ccccc1C,611-14-3,"InChI=1S/C9H12/c1-3-9-7-5-4-6-8(9)2/h4-7H,3H2,1-2H3",aromatics,NP,0.0,0.0,20.619,2,0.0,0.18,670.06
1501,1-ethyl-3-methylbenzene,CCc1cccc(C)c1,620-14-4,"InChI=1S/C9H12/c1-3-9-6-4-5-8(2)7-9/h4-7H,3H2,1-2H3",aromatics,NP,0.0,0.0,18.629,2,0.0,0.02,660.52
1502,1-ethyl-4-methylbenzene,CCc1ccc(C)cc1,622-96-8,"InChI=1S/C9H12/c1-3-9-6-4-8(2)5-7-9/h4-7H,3H2,1-2H3",aromatics,NP,0.0,0.0,17.485,4,0.01,0.45,660.18
1503,"1,2,3,4-tetramethylbenzene",Cc1ccc(C)c(C)c1C,488-23-3,"InChI=1S/C10H14/c1-7-5-6-8(2)10(4)9(7)3/h5-6H,1-4H3",aromatics,All,0.336,0.9922,19.79,6,0.0,0.08,716.58
1511,"1,3-diethylbenzene",CCc1cccc(CC)c1,141-93-5,"InChI=1S/C10H14/c1-3-9-6-5-7-10(4-2)8-9/h5-8H,3-4H2,1-2H3",aromatics,NP,0.0,0.0,20.861,2,0.0,0.05,673.53
1512,"1,4-diethylbenzene",CCc1ccc(CC)cc1,105-05-5,"InChI=1S/C10H14/c1-3-9-5-7-10(4-2)8-6-9/h5-8H,3-4H2,1-2H3",aromatics,NP,0.0,0.0,19.572,2,0.0,0.0,678.21
1518,"1,2,3,4,5-pentamethylbenzene",Cc1cc(C)c(C)c(C)c1C,700-12-9,"InChI=1S/C11H16/c1-7-6-8(2)10(4)11(5)9(7)3/h6H,1-5H3",aromatics,NP,0.0,0.0,22.263,5,0.0,0.21,751.35
1549,4-ethylpyridine,CCc1ccncc1,536-75-4,"InChI=1S/C7H9N/c1-2-7-3-5-8-6-4-7/h3-6H,2H2,1H3",other,P,10.272,0.4167,0.0,3,0.04,0.35,680.34
1566,2-methylthiophene,Cc1cccs1,554-14-3,"InChI=1S/C5H6S/c1-5-3-2-4-6-5/h2-4H,1H3",other,All,0.438,1.0,13.839,25,0.0,0.08,614.3
1575,"2,5-dimethylthiophene",Cc1ccc(C)s1,638-02-8,"InChI=1S/C6H8S/c1-5-3-4-6(2)7-5/h3-4H,1-2H3",other,All,0.132,1.0,16.273,25,0.0,0.04,637.23
1624,"2,3-diacetyloxypropyl acetate",CC(=O)OCC(COC(C)=O)OC(C)=O,102-76-1,"InChI=1S/C9H14O6/c1-6(10)13-4-9(15-8(3)12)5-14-7(2)11/h9H,4-5H2,1-3H3",other,All,2.127,0.0,57.213,21,0.1,1.23,710.8
1636,8-methylquinoline,Cc1cccc2cccnc12,611-32-5,"InChI=1S/C10H9N/c1-8-4-2-5-9-6-3-7-11-10(8)9/h2-7H,1H3",other,P,6.963,0.5425,0.0,3,0.0,0.02,801.59
1643,2-phenylethanol,OCCc1ccccc1,60-12-8,"InChI=1S/C8H10O/c9-7-6-8-4-2-1-3-5-8/h1-5,9H,6-7H2",other,P,8.237,0.0,0.0,16,0.85,10.48,751.1
1699,hexanenitrile,CCCCCC#N,628-73-9,"InChI=1S/C6H11N/c1-2-3-4-5-6-7/h2-5H2,1H3",other,P,14.145,0.2704,0.0,13,0.45,2.81,669.35
1701,heptanenitrile,CCCCCCC#N,629-08-3,"InChI=1S/C7H13N/c1-2-3-4-5-6-7-8/h2-6H2,1H3",other,P,13.959,0.2518,0.0,3,0.03,0.2,687.27
1702,nonanenitrile,CCCCCCCCC#N,2243-27-8,"InChI=1S/C9H17N/c1-2-3-4-5-6-7-8-9-10/h2-8H2,1H3",other,P,15.353,0.3059,0.0,3,0.03,0.24,723.13
1703,heptanedinitrile,N#CCCCCCC#N,646-20-8,InChI=1S/C7H10N2/c8-6-4-2-1-3-5-7-9/h1-5H2,other,All,11.709,0.1565,61.158,35,0.01,0.03,913.58
1704,octanedinitrile,N#CCCCCCCC#N,629-40-3,InChI=1S/C8H12N2/c9-7-5-3-1-2-4-6-8-10/h1-6H2,other,All,10.563,0.1667,76.409,25,0.01,0.03,905.03
1709,diethyl sulfate,CCOS(=O)(=O)OCC,64-67-5,"InChI=1S/C4H10O4S/c1-3-7-9(5,6)8-4-2/h3-4H2,1-2H3",other,P,22.506,0.1894,0.0,3,0.75,2.21,712.09
1710,"dimethyl benzene-1,2-dicarboxylate",COC(=O)c1ccccc1C(=O)OC,131-11-3,"InChI=1S/C10H10O4/c1-13-9(11)7-5-3-4-6-8(7)10(12)14-2/h3-6H,1-2H3",other,All,8.083,0.3699,19.872,5,0.0,0.01,829.87
1712,"1,3-dioxolan-2-one",O=C1OCCO1,96-49-1,InChI=1S/C3H4O3/c4-3-5-1-2-6-3/h1-2H2,other,P,22.06,0.1239,0.0,4,0.67,0.78,823.69
1717,1-propylsulfinylpropane,CCCS(=O)CCC,4253-91-2,"InChI=1S/C6H14OS/c1-3-5-8(7)6-4-2/h3-6H2,1-2H3",other,All,14.595,0.1285,46.713,9,0.1,0.35,761.3
1723,1-thiophen-2-ylethanone,CC(=O)c1cccs1,88-15-3,"InChI=1S/C6H6OS/c1-5(7)6-3-2-4-8-6/h2-4H,1H3",other,P,16.061,0.1604,0.0,22,0.05,0.17,750.79
1730,"3-chloropropane-1,2-diol",OCC(O)CCl,96-24-2,"InChI=1S/C3H7ClO2/c4-1-3(6)2-5/h3,5-6H,1-2H2",other,P,10.378,0.0,0.0,2,1.07,3.19,786.48
1732,"1,1,3,3-tetramethylurea",CN(C)C(=O)N(C)C,632-22-4,InChI=1S/C5H12N2O/c1-6(2)5(8)7(3)4/h1-4H3,other,P,14.287,0.12,0.0,1,0.1,0.43,675.45
1756,dimethyl (z)-but-2-enedioate,COC(=O)C=CC(=O)OC,624-48-6,"InChI=1S/C6H8O4/c1-9-5(7)3-4-6(8)10-2/h3-4H,1-2H3/b4-3-",other,P,8.292,0.5891,0.0,5,0.0,0.06,688.72
1792,1-bromonaphthalene,Brc1cccc2ccccc12,90-11-9,InChI=1S/C10H7Br/c11-10-7-3-5-8-4-1-2-6-9(8)10/h1-7H,other,P,5.808,0.8186,0.0,12,0.11,2.32,850.91
1827,1-ethylsulfinylethane,CCS(=O)CC,70-29-1,"InChI=1S/C4H10OS/c1-3-6(5)4-2/h3-4H2,1-2H3",other,P,25.376,0.1768,0.0,4,0.62,1.45,737.34
1893,dimethyl propanedioate,COC(=O)CC(=O)OC,108-59-8,"InChI=1S/C5H8O4/c1-8-4(6)3-5(7)9-2/h3H2,1-2H3",other,P,7.461,0.12,0.0,1,0.0,0.0,657.21
1897,n-benzyl-1-phenylmethanamine,c1ccc(CNCc2ccccc2)cc1,103-49-1,"InChI=1S/C14H15N/c1-3-7-13(8-4-1)11-15-12-14-9-5-2-6-10-14/h1-10,15H,11-12H2",other,NP,0.0,0.0,40.071,1,0.0,0.0,710.71
1904,heptan-3-ol,CCCCC(O)CC,589-82-2,"InChI=1S/C7H16O/c1-3-5-6-7(8)4-2/h7-8H,3-6H2,1-2H3",other,P,9.274,0.0,0.0,14,2.89,42.09,621.15
1905,heptan-2-ol,CCCCCC(C)O,543-49-7,"InChI=1S/C7H16O/c1-3-4-5-6-7(2)8/h7-8H,3-6H2,1-2H3",other,P,8.448,0.0,0.0,4,0.34,3.68,625.59
1908,1-chloroheptane,CCCCCCCCl,629-06-1,"InChI=1S/C7H15Cl/c1-2-3-4-5-6-7-8/h2-7H2,1H3",other,All,3.563,0.0,20.585,20,0.03,0.59,635.8
1910,1-chlorohexane,CCCCCCCl,544-10-5,"InChI=1S/C6H13Cl/c1-2-3-4-5-6-7/h2-6H2,1H3",other,All,3.529,0.0,18.389,19,0.02,0.33,612.43
1914,3-ethylpentane,CCC(CC)CC,617-78-7,"InChI=1S/C7H16/c1-4-7(5-2)6-3/h7H,4-6H2,1-3H3",branched alkanes,NP,0.0,0.0,14.426,21,0.0,0.11,551.18
1921,ethyl nitrate,CCO[N+](=O)[O-],625-58-1,"InChI=1S/C2H5NO3/c1-2-6-3(4)5/h2H2,1H3",other,P,9.757,0.2331,0.0,5,0.42,2.22,577.75
1922,propyl nitrate,CCCO[N+](=O)[O-],627-13-4,"InChI=1S/C3H7NO3/c1-2-3-7-4(5)6/h2-3H2,1H3",other,P,7.98,0.12,0.0,1,0.0,0.0,594.32
1932,butane-1-thiol,CCCCS,109-79-5,"InChI=1S/C4H10S/c1-2-3-4-5/h5H,2-4H2,1H3",other,P,4.847,0.8774,0.0,5,0.02,0.47,584.23
1933,2-methylpropane-1-thiol,CC(C)CS,513-44-0,"InChI=1S/C4H10S/c1-4(2)3-5/h4-5H,3H2,1-2H3",other,P,4.014,0.12,0.0,1,0.0,0.0,570.75
1934,butane-2-thiol,CCC(C)S,513-53-1,"InChI=1S/C4H10S/c1-3-4(2)5/h4-5H,3H2,1-2H3",other,P,5.17,0.7691,0.0,5,0.02,0.44,564.29
1935,2-iodopropane,CC(C)I,75-30-9,"InChI=1S/C3H7I/c1-3(2)4/h3H,1-2H3",other,P,5.477,0.12,0.0,1,0.0,0.0,585.68
1936,ethynylbenzene,C#Cc1ccccc1,536-74-3,"InChI=1S/C8H6/c1-2-8-6-4-3-5-7-8/h1,3-7H",other,NP,0.0,0.0,19.761,1,0.0,0.0,648.45
1937,"(2e,4e)-hexa-2,4-diene",CC=CC=CC,5194-51-4,"InChI=1S/C6H10/c1-3-5-6-4-2/h3-6H,1-2H3/b5-3+,6-4+",alkenes,NP,0.0,0.0,13.245,5,0.01,0.51,548.74
1940,prop-1-yne,C#CC,74-99-7,"InChI=1S/C3H4/c1-3-2/h1H,2H3",alkynes,NP,0.0,0.0,12.304,3,0.14,3.9,410.75
1971,1-oxidopyridin-1-ium,[O-][n+]1ccccc1,694-59-7,InChI=1S/C5H5NO/c7-6-4-2-1-3-5-6/h1-5H,other,P,19.377,0.1913,0.0,6,0.25,0.76,853.57
1998,"2,2,3,3,3-pentafluoropropan-1-ol",OCC(F)(F)C(F)(F)F,422-05-9,"InChI=1S/C3H3F5O/c4-2(5,1-9)3(6,7)8/h9H,1H2",other,P,9.158,0.0,0.0,5,0.41,2.5,526.84
2011,hexane-1-thiol,CCCCCCS,111-31-9,"InChI=1S/C6H14S/c1-2-3-4-5-6-7/h7H,2-6H2,1H3",other,All,2.139,0.0,19.822,5,0.01,0.14,647.28
2013,octane-1-thiol,CCCCCCCCS,111-88-6,"InChI=1S/C8H18S/c1-2-3-4-5-6-7-8-9/h9H,2-8H2,1H3",other,P,5.667,1.0,0.0,4,0.11,2.97,687.2
2016,sulfur trioxide,O=S(=O)=O,7446-11-9,InChI=1S/O3S/c1-4(2)3,other,NP,0.0,0.0,9.326,1,0.0,0.0,483.88
2019,molecular fluorine,FF,7782-41-4,InChI=1S/F2/c1-2,other,All,0.009,0.165,1.102,26,0.02,1.63,144.44
2020,"propa-1,2-diene",C=C=C,463-49-0,InChI=1S/C3H4/c1-3-2/h1-2H2,alkenes,NP,0.0,0.0,6.998,5,0.02,1.06,399.64
2067,ozone,O=[O+][O-],10028-15-6,InChI=1S/O3/c1-3-2,other,All,0.225,0.7001,3.493,11,0.01,0.38,275.39
2091,phosphane,P,7803-51-2,InChI=1S/H3P/h1H3,other,NP,0.0,0.0,7.412,1,0.0,0.0,326.76
2100,1-iodopropane,CCCI,107-08-4,"InChI=1S/C3H7I/c1-2-3-4/h2-3H2,1H3",other,P,4.781,0.12,0.0,1,0.0,0.0,606.07
2101,1-iodobutane,CCCCI,542-69-8,"InChI=1S/C4H9I/c1-2-3-4-5/h2-4H2,1H3",other,All,3.267,0.426,17.849,10,0.03,0.51,626.12
2102,1-iodohexane,CCCCCCI,638-45-9,"InChI=1S/C6H13I/c1-2-3-4-5-6-7/h2-6H2,1H3",other,All,3.633,0.5454,21.674,17,0.01,0.14,678.05
2103,1-iodoheptane,CCCCCCCI,4282-40-0,"InChI=1S/C7H15I/c1-2-3-4-5-6-7-8/h2-7H2,1H3",other,All,2.991,0.4509,27.44,18,0.02,0.42,687.13
2105,1-chlorononane,CCCCCCCCCCl,2473-01-0,"InChI=1S/C9H19Cl/c1-2-3-4-5-6-7-8-9-10/h2-9H2,1H3",other,All,3.818,0.5025,18.648,17,0.0,0.03,678.8
2106,1-bromononane,CCCCCCCCCBr,693-58-3,"InChI=1S/C9H19Br/c1-2-3-4-5-6-7-8-9-10/h2-9H2,1H3",other,All,4.05,0.6159,26.105,14,0.02,0.34,693.13
2107,methyl nonanoate,CCCCCCCCC(=O)OC,1731-84-6,"InChI=1S/C10H20O2/c1-3-4-5-6-7-8-9-10(11)12-2/h3-9H2,1-2H3",other,P,6.443,1.0,0.0,2,0.05,1.32,677.06
2183,ethyl hexanoate,CCCCCC(=O)OCC,123-66-0,"InChI=1S/C8H16O2/c1-3-5-6-7-8(9)10-4-2/h3-7H2,1-2H3",other,All,2.006,0.0,27.967,6,0.01,0.13,625.91
2185,2-[2-hydroxyethyl(methyl)amino]ethanol,CN(CCO)CCO,105-59-9,"InChI=1S/C5H13NO2/c1-6(2-4-7)3-5-8/h7-8H,2-5H2,1H3",other,P,14.363,0.1819,0.0,8,0.03,0.12,772.87
2187,2-amino-2-methylpropan-1-ol,CC(C)(N)CO,124-68-5,"InChI=1S/C4H11NO/c1-4(2,5)3-6/h6H,3,5H2,1-2H3",other,P,12.082,0.2175,0.0,5,0.03,0.14,647.07
2188,"1,3-dimethylimidazolidin-2-one",CN1CCN(C)C1=O,80-73-9,"InChI=1S/C5H10N2O/c1-6-3-4-7(2)5(6)8/h3-4H2,1-2H3",other,All,16.969,0.1613,22.511,6,0.03,0.08,759.87
2189,"1,3-dimethyl-1,3-diazinan-2-one",CN1CCCN(C)C1=O,7226-23-5,"InChI=1S/C6H12N2O/c1-7-4-3-5-8(2)6(7)9/h3-5H2,1-2H3",other,All,17.237,0.1429,24.215,6,0.02,0.04,824.29
2210,tridec-1-ene,C=CCCCCCCCCCCC,2437-56-1,"InChI=1S/C13H26/c1-3-5-7-9-11-13-12-10-8-6-4-2/h3H,1,4-13H2,2H3",alkenes,NP,0.0,0.0,27.355,6,0.01,0.39,692.82
2242,[dimethyl-(trimethylsilylamino)silyl]methane,C[Si](C)(C)N[Si](C)(C)C,999-97-3,"InChI=1S/C6H19NSi2/c1-8(2,3)7-9(4,5)6/h7H,1-6H3",other,NP,0.0,0.0,26.535,1,0.0,0.0,545.02
2245,tetrachlorogermane,Cl[Ge](Cl)(Cl)Cl,10038-98-9,"InChI=1S/Cl4Ge/c1-5(2,3)4",other,NP,0.0,0.0,16.012,19,0.02,0.88,561.2
2250,"2,3-dimethylbuta-1,3-diene",C=C(C)C(=C)C,513-81-5,"InChI=1S/C6H10/c1-5(2)6(3)4/h1,3H2,2,4H3",alkenes,NP,0.0,0.0,12.848,5,0.0,0.09,536.18
2287,methyl 2-hydroxypropanoate,COC(=O)C(C)O,547-64-8,"InChI=1S/C4H8O3/c1-3(5)4(6)7-2/h3,5H,1-2H3",other,P,8.862,0.12,0.0,1,0.0,0.0,634.36
2288,ethyl 2-hydroxypropanoate,CCOC(=O)C(C)O,97-64-3,"InChI=1S/C5H10O3/c1-3-8-5(7)4(2)6/h4,6H,3H2,1-2H3",other,P,8.863,0.12,0.0,1,0.0,0.0,680.15
2291,"1,3,3-trimethyl-2-oxabicyclo[2.2.2]octane",CC12CCC(CC1)C(C)(C)O2,470-82-6,"InChI=1S/C10H18O/c1-9(2)8-4-6-10(3,11-9)7-5-8/h8H,4-7H2,1-3H3",other,P,5.664,0.12,0.0,1,0.0,0.0,669.22
2293,methyl 2-chloroacetate,COC(=O)CCl,96-34-4,"InChI=1S/C3H5ClO2/c1-6-3(5)2-4/h2H2,1H3",other,P,6.406,0.0,0.0,7,0.47,3.56,619.17
2309,1-iodo-2-methylpropane,CC(C)CI,513-38-2,"InChI=1S/C4H9I/c1-4(2)3-5/h4H,3H2,1-2H3",other,P,6.727,0.7256,0.0,4,0.02,0.24,621.43
2322,3-methylbutyl butanoate,CCCC(=O)OCCC(C)C,106-27-4,"InChI=1S/C9H18O2/c1-4-5-9(10)11-7-6-8(2)3/h8H,4-7H2,1-3H3",other,P,5.794,0.12,0.0,1,0.0,0.0,648.37
2330,"1,2,3-tribromopropane",BrCC(Br)CBr,96-11-7,"InChI=1S/C3H5Br3/c4-1-3(6)2-5/h3H,1-2H2",other,P,5.95,0.5884,0.0,6,0.06,0.98,760.8
2340,"1-methyl-4-propan-2-ylcyclohexa-1,4-diene",CC1=CCC(C(C)C)=CC1,99-85-4,"InChI=1S/C10H16/c1-8(2)10-6-4-9(3)5-7-10/h4,7-8H,5-6H2,1-3H3",other,NP,0.0,0.0,20.475,1,0.0,0.0,670.86
2346,"1,4-dibromobenzene",Brc1ccc(Br)cc1,106-37-6,InChI=1S/C6H4Br2/c7-5-1-2-6(8)4-3-5/h1-4H,other,NP,0.0,0.0,19.324,1,0.0,0.0,770.37
2361,3-methylbut-3-en-2-one,C=C(C)C(C)=O,814-78-8,"InChI=1S/C5H8O/c1-4(2)5(3)6/h1H2,2-3H3",ketones,P,6.761,0.12,0.0,1,0.0,0.0,581.36
2371,1-methoxy-4-[(e)-prop-1-enyl]benzene,CC=Cc1ccc(OC)cc1,104-46-1,"InChI=1S/C10H12O/c1-3-4-9-5-7-10(11-2)8-6-9/h3-8H,1-2H3",other,P,4.447,0.12,0.0,1,0.0,0.0,724.49
2375,2-propoxyethanol,CCCOCCO,2807-30-9,"InChI=1S/C5H12O2/c1-2-4-7-5-3-6/h6H,2-5H2,1H3",other,P,8.81,0.2176,0.0,5,0.01,0.11,630.07
2376,2-hydroxyethyl acetate,CC(=O)OCCO,542-59-6,"InChI=1S/C4H8O3/c1-4(6)7-3-2-5/h5H,2-3H2,1H3",other,P,7.519,0.12,0.0,1,0.0,0.0,674.66
2387,"1,1,1,2-tetrafluoroethane",FCC(F)(F)F,811-97-2,"InChI=1S/C2H2F4/c3-1-2(4,5)6/h1H2",other,P,5.742,0.3033,0.0,5,0.04,0.45,381.12
2405,2-hydroxyacetonitrile,N#CCO,107-16-4,"InChI=1S/C2H3NO/c3-1-2-4/h4H,2H2",other,P,12.609,0.12,0.0,1,0.0,0.0,876.85
2421,arsane,[AsH3],7784-42-1,InChI=1S/AsH3/h1H3,other,NP,0.0,0.0,6.59,8,0.04,1.75,377.9
2422,trichloroarsane,Cl[As](Cl)Cl,7784-34-1,InChI=1S/AsCl3/c2-1(3)4,other,P,5.99,0.0,0.0,2,0.18,1.45,646.98
2451,2-iodobutane,CCC(C)I,513-48-4,"InChI=1S/C4H9I/c1-3-4(2)5/h4H,3H2,1-2H3",other,P,6.133,0.12,0.0,1,0.0,0.0,607.36
2467,prop-2-en-1-amine,C=CCN,107-11-9,"InChI=1S/C3H7N/c1-2-3-4/h2H,1,3-4H2",other,P,3.161,0.0,0.0,4,0.62,9.8,567.04
2468,methyl heptanoate,CCCCCCC(=O)OC,106-73-0,"InChI=1S/C8H16O2/c1-3-4-5-6-7-8(9)10-2/h3-7H2,1-2H3",other,P,6.076,1.0,0.0,2,0.04,0.93,632.02
2477,"1,1-dichloro-1-fluoroethane",CC(F)(Cl)Cl,1717-00-6,"InChI=1S/C2H3Cl2F/c1-2(3,4)5/h1H3",other,P,5.578,0.3075,0.0,14,0.09,0.82,484.6
2487,1-fluoropentane,CCCCCF,592-50-7,"InChI=1S/C5H11F/c1-2-3-4-5-6/h2-5H2,1H3",other,P,3.59,0.12,0.0,1,0.0,0.0,515.23
2496,2-methyl-n-(2-methylpropyl)propan-1-amine,CC(C)CNCC(C)C,110-96-3,"InChI=1S/C8H19N/c1-7(2)5-9-6-8(3)4/h7-9H,5-6H2,1-4H3",other,NP,0.0,0.0,26.983,1,0.0,0.0,585.91
2498,3-methoxyphenol,COc1cccc(O)c1,150-19-6,"InChI=1S/C7H8O2/c1-9-7-4-2-3-6(8)5-7/h2-5,8H,1H3",other,P,8.574,0.2633,0.0,9,0.07,0.82,791.18
2513,"1,2,3,4,5,6-hexamethylbenzene",Cc1c(C)c(C)c(C)c(C)c1C,87-85-4,InChI=1S/C12H18/c1-7-8(2)10(4)12(6)11(5)9(7)3/h1-6H3,aromatics,NP,0.0,0.0,23.381,3,0.0,0.04,767.13
2619,"(9z,12z)-octadeca-9,12-dienoic acid",CCCCCC=CCC=CCCCCCCCC(=O)O,60-33-3,"InChI=1S/C18H32O2/c1-2-3-4-5-6-7-8-9-10-11-12-13-14-15-16-17-18(19)20/h6-7,9-10H,2-5,8,11-17H2,1H3,(H,19,20)/b7-6-,10-9-",other,NP,0.0,0.0,47.281,6,0.05,2.13,873.55
2630,ethyl 2-methylprop-2-enoate,C=C(C)C(=O)OCC,97-63-2,"InChI=1S/C6H10O2/c1-4-8-6(7)5(2)3/h2,4H2,1,3H3",other,P,5.302,0.2002,0.0,3,0.16,2.97,605.97
2740,2-methyl-2-nitropropane,CC(C)(C)[N+](=O)[O-],594-70-7,"InChI=1S/C4H9NO2/c1-4(2,3)5(6)7/h1-3H3",other,NP,0.0,0.0,92.863,1,0.0,0.0,620.68
2829,methyl pentadecanoate,CCCCCCCCCCCCCCC(=O)OC,7132-64-1,"InChI=1S/C16H32O2/c1-3-4-5-6-7-8-9-10-11-12-13-14-15-16(17)18-2/h3-15H2,1-2H3",other,P,7.815,1.0,0.0,2,0.06,1.94,762.06
2835,2-(2-ethoxyethoxy)ethyl acetate,CCOCCOCCOC(C)=O,112-15-2,"InChI=1S/C8H16O4/c1-3-10-4-5-11-6-7-12-8(2)9/h3-7H2,1-2H3",other,P,9.749,0.12,0.0,1,0.0,0.0,691.53
2916,2-methylpropane-2-thiol,CC(C)(C)S,75-66-1,"InChI=1S/C4H10S/c1-4(2,3)5/h5H,1-3H3",other,P,5.33,0.8239,0.0,5,0.02,0.3,530.96
2955,1-bromo-3-chloropropane,ClCCCBr,109-70-6,InChI=1S/C3H6BrCl/c4-2-1-3-5/h1-3H2,other,P,6.141,0.12,0.0,1,0.0,0.0,652.44
3030,methyl thiocyanate,CSC#N,556-64-9,InChI=1S/C2H3NS/c1-4-2-3/h1H3,other,P,10.681,0.12,0.0,1,0.0,0.0,723.78
3035,"2,2-dichloro-1,1,1-trifluoroethane",FC(F)(F)C(Cl)Cl,306-83-2,"InChI=1S/C2HCl2F3/c3-1(4)2(5,6)7/h1H",other,All,1.941,0.0,12.606,17,0.07,1.5,465.97
3068,"1,2-dibromo-1,1,2,2-tetrafluoroethane",FC(F)(Br)C(F)(F)Br,124-73-2,"InChI=1S/C2Br2F4/c3-1(5,6)2(4,7)8",other,NP,0.0,0.0,19.143,1,0.0,0.0,495.87
3082,2-[2-(2-hydroxypropoxy)propoxy]propan-1-ol,CC(O)COC(C)COC(C)CO,24800-44-0,"InChI=1S/C9H20O4/c1-7(11)5-12-9(3)6-13-8(2)4-10/h7-11H,4-6H2,1-3H3",other,P,19.764,0.3426,0.0,4,0.28,2.03,731.3
3095,octan-3-one,CCCCCC(=O)CC,106-68-3,"InChI=1S/C8H16O/c1-3-5-6-7-8(9)4-2/h3-7H2,1-2H3",ketones,P,10.731,0.12,0.0,1,0.0,0.0,642.73
3111,"1,1,2,2,3,3,4,4,4a,5,5,6,6,7,7,8,8,8a-octadecafluoronaphthalene",FC1(F)C(F)(F)C(F)(F)C2(F)C(F)(F)C(F)(F)C(F)(F)C(F)(F)C2(F)C1(F)F,306-94-5,"InChI=1S/C10F18/c11-1-2(12,5(17,18)9(25,26)7(21,22)3(1,13)14)6(19,20)10(27,28)8(23,24)4(1,15)16",other,NP,0.0,0.0,23.19,1,0.0,0.0,573.13
3209,"1,2-diethylbenzene",CCc1ccccc1CC,135-01-3,"InChI=1S/C10H14/c1-3-9-7-5-6-8-10(9)4-2/h5-8H,3-4H2,1-2H3",aromatics,NP,0.0,0.0,23.037,2,0.0,0.18,678.95
3239,"1,1,3,3-tetraethylurea",CCN(CC)C(=O)N(CC)CC,1187-03-7,"InChI=1S/C9H20N2O/c1-5-10(6-2)9(12)11(7-3)8-4/h5-8H2,1-4H3",other,All,14.498,0.2291,24.315,6,0.01,0.06,622.07
3254,"2,3-di(hexanoyloxy)propyl hexanoate",CCCCCC(=O)OCC(COC(=O)CCCCC)OC(=O)CCCCC,621-70-5,"InChI=1S/C21H38O6/c1-4-7-10-13-19(22)25-16-18(27-21(24)15-12-9-6-3)17-26-20(23)14-11-8-5-2/h18H,4-17H2,1-3H3",other,P,15.747,1.0,0.0,2,0.04,0.9,783.38
3268,ethyl 2-cyanoacetate,CCOC(=O)CC#N,105-56-6,"InChI=1S/C5H7NO2/c1-2-8-5(7)3-4-6/h2-3H2,1H3",other,P,15.359,0.1819,0.0,4,0.48,1.74,717.59
3273,pentyl propanoate,CCCCCOC(=O)CC,624-54-4,"InChI=1S/C8H16O2/c1-3-5-6-7-10-8(9)4-2/h3-7H2,1-2H3",other,P,6.511,1.0,0.0,2,0.01,0.23,622.54
3293,ethyl tetradecanoate,CCCCCCCCCCCCCC(=O)OCC,124-06-1,"InChI=1S/C16H32O2/c1-3-5-6-7-8-9-10-11-12-13-14-15-16(17)18-4-2/h3-15H2,1-2H3",other,P,8.805,1.0,0.0,4,0.09,2.7,749.58
3342,chlorosulfanyl thiohypochlorite,ClSSCl,10025-67-9,InChI=1S/Cl2S2/c1-3-4-2,other,P,2.889,0.0,0.0,2,0.09,1.78,717.92
3391,2-nitrooxyethyl nitrate,O=[N+]([O-])OCCO[N+](=O)[O-],628-96-6,InChI=1S/C2H4N2O6/c5-3(6)9-1-2-10-4(7)8/h1-2H2,other,P,13.486,0.12,0.0,1,0.0,0.0,696.33
3394,"1,3-dinitrooxypropan-2-yl nitrate",O=[N+]([O-])OCC(CO[N+](=O)[O-])O[N+](=O)[O-],55-63-0,"InChI=1S/C3H5N3O9/c7-4(8)13-1-3(15-6(11)12)2-14-5(9)10/h3H,1-2H2",other,P,14.464,0.12,0.0,1,0.0,0.0,677.56
3396,undecan-6-one,CCCCCC(=O)CCCCC,927-49-1,"InChI=1S/C11H22O/c1-3-5-7-9-11(12)10-8-6-4-2/h3-10H2,1-2H3",ketones,All,12.117,0.3463,8.339,15,0.01,0.08,689.93
3414,dibromo(difluoro)methane,FC(F)(Br)Br,75-61-6,"InChI=1S/CBr2F2/c2-1(3,4)5",other,NP,0.0,0.0,15.434,3,0.13,4.38,482.62
3415,acetyl chloride,CC(=O)Cl,75-36-5,InChI=1S/C2H3ClO/c1-2(3)4/h1H3,other,P,7.576,0.2826,0.0,3,0.15,0.95,517.79
3473,"3,3-dichloro-1,1,1,2,2-pentafluoropropane",FC(F)(F)C(F)(F)C(Cl)Cl,422-56-0,"InChI=1S/C3HCl2F5/c4-1(5)2(6,7)3(8,9)10/h1H",other,P,4.082,0.908,0.0,4,0.01,0.14,484.2
3485,pyridine-3-carbonitrile,N#Cc1cccnc1,100-54-9,"InChI=1S/C6H4N2/c7-4-6-2-1-3-8-5-6/h1-3,5H",other,P,13.92,0.2407,0.0,5,0.04,0.2,842.98
3486,2-chloropyridine,Clc1ccccn1,109-09-1,InChI=1S/C5H4ClN/c6-5-3-1-2-4-7-5/h1-4H,other,All,11.509,0.1479,11.542,7,0.01,0.03,716.72
3497,pyridine-4-carbonitrile,N#Cc1ccncc1,100-48-1,InChI=1S/C6H4N2/c7-5-6-1-3-8-4-2-6/h1-4H,other,P,5.874,0.9927,0.0,5,0.01,0.25,726.78
3501,tripropyl borate,CCCOB(OCCC)OCCC,688-71-1,"InChI=1S/C9H21BO3/c1-4-7-11-10(12-8-5-2)13-9-6-3/h4-9H2,1-3H3",other,NP,0.0,0.0,27.322,1,0.0,0.0,607.23
3503,tris(2-methylpropyl) borate,CC(C)COB(OCC(C)C)OCC(C)C,13195-76-1,"InChI=1S/C12H27BO3/c1-10(2)7-14-13(15-8-11(3)4)16-9-12(5)6/h10-12H,7-9H2,1-6H3",other,NP,0.0,0.0,33.494,1,0.0,0.0,647.9
3640,"pentane-1,2-diol",CCCC(O)CO,5343-92-0,"InChI=1S/C5H12O2/c1-2-3-5(7)4-6/h5-7H,2-4H2,1H3",other,P,10.203,0.1134,0.0,2,0.0,0.0,735.45
3731,2-methylbutane-2-thiol,CCC(C)(C)S,1679-09-0,"InChI=1S/C5H12S/c1-4-5(2,3)6/h6H,4H2,1-3H3",other,P,5.476,0.8418,0.0,4,0.02,0.35,582.14
3767,3-methyl-1-oxidopyridin-1-ium,Cc1ccc[n+]([O-])c1,1003-73-2,"InChI=1S/C6H7NO/c1-6-3-2-4-7(8)5-6/h2-5H,1H3",other,All,12.279,0.2053,37.812,5,0.0,0.02,937.5
3774,"butane-1,2-diol",CCC(O)CO,584-03-2,"InChI=1S/C4H10O2/c1-2-4(6)3-5/h4-6H,2-3H2,1H3",other,P,9.275,0.0,0.0,9,0.36,1.74,697.1
3781,(4s)-1-methyl-4-prop-1-en-2-ylcyclohexene,C=C(C)C1CC=C(C)CC1,5989-54-8,"InChI=1S/C10H16/c1-8(2)10-6-4-9(3)5-7-10/h4,10H,1,5-7H2,2-3H3/t10-/m1/s1",other,NP,0.0,0.0,21.809,1,0.0,0.0,669.47
3870,"1,1,1,2,2,3,3,4,4,5,5,6,6,7,7,8,8,8-octadecafluorooctane",FC(F)(F)C(F)(F)C(F)(F)C(F)(F)C(F)(F)C(F)(F)C(F)(F)C(F)(F)F,307-34-6,"InChI=1S/C8F18/c9-1(10,3(13,14)5(17,18)7(21,22)23)2(11,12)4(15,16)6(19,20)8(24,25)26",other,NP,0.0,0.0,21.325,1,0.01,0.67,505.19
3916,nonan-2-ol,CCCCCCCC(C)O,628-99-9,"InChI=1S/C9H20O/c1-3-4-5-6-7-8-9(2)10/h9-10H,3-8H2,1-2H3",other,P,8.155,0.0,0.0,3,0.3,4.44,664.47
3993,octadecyl acetate,CCCCCCCCCCCCCCCCCCOC(C)=O,822-23-1,"InChI=1S/C20H40O2/c1-3-4-5-6-7-8-9-10-11-12-13-14-15-16-17-18-19-22-20(2)21/h3-19H2,1-2H3",other,P,9.47,1.0,0.0,3,0.07,2.22,806.36
4089,1-methylcyclopentan-1-ol,CC1(O)CCCC1,1462-03-9,"InChI=1S/C6H12O/c1-6(7)4-2-3-5-6/h7H,2-5H2,1H3",other,P,5.407,0.0,0.0,5,0.19,2.96,576.24
4099,,N,13550-49-7,InChI=1S/H3N/h1H3/i/hD3,other,P,2.724,0.2302,0.0,5,0.06,0.24,424.86
4166,"1,2-dichlorobutane",CCC(Cl)CCl,616-21-7,"InChI=1S/C4H8Cl2/c1-2-4(6)3-5/h4H,2-3H2,1H3",other,P,7.466,0.5718,0.0,5,0.05,0.8,621.45
4198,2-(2-aminoethylamino)ethanol,NCCNCCO,111-41-1,"InChI=1S/C4H12N2O/c5-1-2-6-3-4-7/h6-7H,1-5H2",other,P,9.339,0.0,0.0,12,1.95,15.07,776.94
4201,"1,3-dichloro-1,1,2,2,3-pentafluoropropane",FC(Cl)C(F)(F)C(F)(F)Cl,507-55-1,"InChI=1S/C3HCl2F5/c4-1(6)2(7,8)3(5,9)10/h1H",other,P,4.708,0.6913,0.0,4,0.0,0.07,500.38
4203,nonan-5-ol,CCCCC(O)CCCC,623-93-8,"InChI=1S/C9H20O/c1-3-5-7-9(10)8-6-4-2/h9-10H,3-8H2,1-2H3",other,NP,0.0,0.0,38.822,3,0.06,1.8,628.4
4370,heptane-1-thiol,CCCCCCCS,1639-09-4,"InChI=1S/C7H16S/c1-2-3-4-5-6-7-8/h8H,2-7H2,1H3",other,All,4.084,1.0,11.029,5,0.01,0.33,684.05
4405,pentane-1-thiol,CCCCCS,110-66-7,"InChI=1S/C5H12S/c1-2-3-4-5-6/h6H,2-5H2,1H3",other,P,5.195,1.0,0.0,6,0.08,1.72,616.71
4622,ethyl decanoate,CCCCCCCCCC(=O)OCC,110-38-3,"InChI=1S/C12H24O2/c1-3-5-6-7-8-9-10-11-12(13)14-4-2/h3-11H2,1-2H3",other,P,7.382,1.0,0.0,4,0.09,2.62,698.3
4688,oxan-2-one,O=C1CCCCO1,542-28-9,InChI=1S/C5H8O2/c6-5-3-1-2-4-7-5/h1-4H2,other,P,18.764,0.1928,0.0,2,0.0,0.0,816.9
4777,tribromophosphane,BrP(Br)Br,7789-60-8,InChI=1S/Br3P/c1-4(2)3,other,NP,0.0,0.0,22.086,1,0.0,0.0,764.41
4779,1-methoxy-4-nitrobenzene,COc1ccc([N+](=O)[O-])cc1,100-17-4,"InChI=1S/C7H7NO3/c1-11-7-4-2-6(3-5-7)8(9)10/h2-5H,1H3",other,P,22.659,0.2044,0.0,12,0.15,0.59,841.36
4784,oxalonitrile,N#CC#N,460-19-5,InChI=1S/C2N2/c3-1-2-4,other,NP,0.0,0.0,8.769,1,0.0,0.0,409.22
4807,cyclobutanone,O=C1CCC1,1191-95-3,InChI=1S/C4H6O/c5-4-2-1-3-4/h1-3H2,other,All,4.757,0.2659,22.656,35,0.02,0.1,599.18
4812,isothiocyanatoethane,CCN=C=S,542-85-8,"InChI=1S/C3H5NS/c1-2-4-3-5/h2H2,1H3",other,P,8.283,0.0,0.0,3,0.45,2.12,667.09
5355,methylimino(sulfanylidene)methane,CN=C=S,556-61-6,InChI=1S/C2H3NS/c1-3-2-4/h1H3,other,NP,0.0,0.0,53.655,1,0.0,0.0,671.65
6020,[methoxy(methyl)phosphoryl]oxymethane,COP(C)(=O)OC,756-79-6,"InChI=1S/C3H9O3P/c1-5-7(3,4)6-2/h1-3H3",other,P,12.001,0.12,0.0,1,0.0,0.0,695.15
7107,naphthalene-1-carbonitrile,N#Cc1cccc2ccccc12,86-53-3,InChI=1S/C11H7N/c12-8-10-6-3-5-9-4-1-2-7-11(9)10/h1-7H,other,NP,0.0,0.0,99.671,2,0.65,3.85,876.17
7130,dipropan-2-yl oxalate,CC(C)OC(=O)C(=O)OC(C)C,615-81-6,"InChI=1S/C8H14O4/c1-5(2)11-7(9)8(10)12-6(3)4/h5-6H,1-4H3",other,P,10.935,0.7863,0.0,4,0.04,0.66,641.81
8041,"1,1,2,2,3,3,4,5,5,6-decafluoro-4,6-bis(trifluoromethyl)cyclohexane",FC(F)(F)C1(F)C(F)(F)C(F)(F)C(F)(F)C(F)(C(F)(F)F)C1(F)F,335-27-3,"InChI=1S/C8F16/c9-1(7(19,20)21)3(11,12)2(10,8(22,23)24)5(15,16)6(17,18)4(1,13)14",other,NP,0.0,0.0,20.027,1,0.0,0.0,517.46
8077,"2,5-dimethylfuran",Cc1ccc(C)o1,625-86-5,"InChI=1S/C6H8O/c1-5-3-4-6(2)7-5/h3-4H,1-2H3",other,All,1.178,1.0,6.023,25,0.0,0.19,559.49
8080,1-phenylpropan-1-ol,CCC(O)c1ccccc1,93-54-9,"InChI=1S/C9H12O/c1-2-9(10)8-6-4-3-5-7-8/h3-7,9-10H,2H2,1H3",other,P,7.173,0.4625,0.0,7,0.12,1.93,692.04
8115,1-tert-butyl-4-methylbenzene,Cc1ccc(C(C)(C)C)cc1,98-51-1,"InChI=1S/C11H16/c1-9-5-7-10(8-6-9)11(2,3)4/h5-8H,1-4H3",other,NP,0.0,0.0,22.37,7,0.03,1.27,683.58
8242,cyclohexylmethanol,OCC1CCCCC1,100-49-2,"InChI=1S/C7H14O/c8-6-7-4-2-1-3-5-7/h7-8H,1-6H2",other,P,8.327,0.0,0.0,3,0.48,5.81,686.01
8406,tetranitromethane,O=[N+]([O-])C([N+](=O)[O-])([N+](=O)[O-])[N+](=O)[O-],509-14-8,"InChI=1S/CN4O8/c6-2(7)1(3(8)9,4(10)11)5(12)13",other,NP,0.0,0.0,15.647,4,0.08,3.59,596.41
8468,furan-2-ylmethyl acetate,CC(=O)OCc1ccco1,623-17-6,"InChI=1S/C7H8O3/c1-6(8)10-5-7-3-2-4-9-7/h2-4H,5H2,1H3",other,All,6.507,0.6458,5.163,25,0.01,0.13,670.94
8494,"(1r,5r)-2,6,6-trimethylbicyclo[3.1.1]hept-2-ene",CC1=CCC2CC1C2(C)C,7785-70-8,"InChI=1S/C10H16/c1-7-4-5-8-6-9(7)10(8,2)3/h4,8-9H,5-6H2,1-3H3/t8-,9-/m1/s1",other,NP,0.0,0.0,23.432,2,0.11,4.42,646.96
8495,"(1s,5s)-2,6,6-trimethylbicyclo[3.1.1]hept-2-ene",CC1=CCC2CC1C2(C)C,7785-26-4,"InChI=1S/C10H16/c1-7-4-5-8-6-9(7)10(8,2)3/h4,8-9H,5-6H2,1-3H3/t8-,9-/m0/s1",other,NP,0.0,0.0,23.658,2,0.16,6.34,645.45
8814,"1,1,2,2,3,3,3-heptafluoro-n,n-bis(1,1,2,2,3,3,3-heptafluoropropyl)propan-1-amine",FC(F)(F)C(F)(F)C(F)(F)N(C(F)(F)C(F)(F)C(F)(F)F)C(F)(F)C(F)(F)C(F)(F)F,338-83-0,"InChI=1S/C9F21N/c10-1(11,4(16,17)18)7(25,26)31(8(27,28)2(12,13)5(19,20)21)9(29,30)3(14,15)6(22,23)24",other,NP,0.0,0.0,29.104,1,0.0,0.0,526.77
8862,2-methylpropanoyl 2-methylpropanoate,CC(C)C(=O)OC(=O)C(C)C,97-72-3,"InChI=1S/C8H14O3/c1-5(2)7(9)11-8(10)6(3)4/h5-6H,1-4H3",other,P,13.198,0.12,0.0,1,0.0,0.0,654.43
8958,"(1r,2s)-2-methylcyclohexan-1-ol",CC1CCCCC1O,7443-70-1,"InChI=1/C7H14O/c1-6-4-2-3-5-7(6)8/h6-8H,2-5H2,1H3/t6-,7+/s2",other,P,8.041,0.0,0.0,3,0.46,4.61,665.43
10075,pentafluoro-lambda5-iodane,FI(F)(F)(F)F,7783-66-6,"InChI=1S/F5I/c1-6(2,3,4)5",other,P,12.023,0.1578,0.0,5,0.03,0.1,573.12
10304,"1,1,1,3,3,3-hexafluoro-2-methoxypropane",COC(C(F)(F)F)C(F)(F)F,13171-18-1,"InChI=1S/C4H4F6O/c1-11-2(3(5,6)7)4(8,9)10/h2H,1H3",other,P,11.405,0.1252,0.0,6,0.01,0.06,469.22
10319,"pentane-2,4-diol",CC(O)CC(C)O,625-69-4,"InChI=1S/C5H12O2/c1-4(6)3-5(2)7/h4-7H,3H2,1-2H3",other,P,13.949,0.1633,0.0,2,0.0,0.0,740.66
11928,"1,1,2,2-tetrafluoro-1-(2,2,2-trifluoroethoxy)ethane",FC(F)C(F)(F)OCC(F)(F)F,406-78-0,"InChI=1S/C4H3F7O/c5-2(6)4(10,11)12-1-3(7,8)9/h2H,1H2",other,P,7.246,0.5748,0.0,6,0.0,0.02,471.36
12605,"7-methyl-3-methylideneocta-1,6-diene",C=CC(=C)CCC=C(C)C,123-35-3,"InChI=1S/C10H16/c1-5-10(4)8-6-7-9(2)3/h5,7H,1,4,6,8H2,2-3H3",other,NP,0.0,0.0,22.343,1,0.0,0.0,642.07
13515,3-ethoxypropan-1-amine,CCOCCCN,6291-85-6,"InChI=1S/C5H13NO/c1-2-7-5-3-4-6/h2-6H2,1H3",other,P,6.134,0.12,0.0,1,0.0,0.0,611.43
14660,methyl (z)-docos-13-enoate,CCCCCCCCC=CCCCCCCCCCCCC(=O)OC,1120-34-9,"InChI=1S/C23H44O2/c1-3-4-5-6-7-8-9-10-11-12-13-14-15-16-17-18-19-20-21-22-23(24)25-2/h10-11H,3-9,12-22H2,1-2H3/b11-10-",other,P,9.678,1.0,0.0,2,0.06,1.85,799.43
16237,3-methylheptan-4-ol,CCCC(O)C(C)CC,1838-73-9,"InChI=1S/C8H18O/c1-4-6-8(9)7(3)5-2/h7-9H,4-6H2,1-3H3",other,P,9.607,0.3345,0.0,25,2.47,84.98,612.22
18087,"4-ethyl-1,3-dioxolan-2-one",CCC1COC(=O)O1,4437-85-8,"InChI=1S/C5H8O3/c1-2-4-3-7-5(6)8-4/h4H,2-3H2,1H3",other,P,23.791,0.1397,0.0,2,0.0,0.0,830.65
20129,"1-(2,2-difluoroethoxy)-1,1,2,2-tetrafluoroethane",CC(F)(F)OC(F)(F)C(F)F,50807-77-7,"InChI=1S/C4H4F6O/c1-3(7,8)11-4(9,10)2(5)6/h2H,1H3",other,P,7.859,0.2576,0.0,4,0.0,0.05,508.03
20245,"2,3,3,3-tetrafluoroprop-1-ene",C=C(F)C(F)(F)F,754-12-1,"InChI=1S/C3H2F4/c1-2(4)3(5,6)7/h1H2",other,P,5.802,0.3042,0.0,5,0.0,0.06,376.61
27384,"(e)-1,3,3,3-tetrafluoroprop-1-ene",FC=CC(F)(F)F,29118-24-9,"InChI=1S/C3H2F4/c4-2-1-3(5,6)7/h1-2H/b2-1+",other,P,1.991,0.12,0.0,1,0.0,0.0,390.45
30459,"(e)-1-chloro-3,3,3-trifluoroprop-1-ene",FC(F)(F)C=CCl,102687-65-0,"InChI=1S/C3H2ClF3/c4-2-1-3(5,6)7/h1-2H/b2-1+",other,NP,0.0,0.0,0.131,19,0.0,0.46,449.41
32068,"3,3,4,4,5,5,6,6,7,7,8,8,8-tridecafluorooctan-1-ol",OCCC(F)(F)C(F)(F)C(F)(F)C(F)(F)C(F)(F)C(F)(F)F,647-42-7,"InChI=1S/C8H5F13O/c9-3(10,1-2-22)4(11,12)5(13,14)6(15,16)7(17,18)8(19,20)21/h22H,1-2H2",other,P,12.619,0.0,0.0,5,0.16,1.76,622.06
38027,"3,3,4,4,5,5,5-heptafluoropentan-2-one",CC(=O)C(F)(F)C(F)(F)C(F)(F)F,355-17-9,"InChI=1S/C5H3F7O/c1-2(13)3(6,7)4(8,9)5(10,11)12/h1H3",other,P,9.34,0.3857,0.0,6,0.0,0.04,483.62
38030,"3,3,4,4,5,5,6,6,6-nonafluorohexan-2-one",CC(=O)C(F)(F)C(F)(F)C(F)(F)C(F)(F)F,678-18-2,"InChI=1S/C6H3F9O/c1-2(16)3(7,8)4(9,10)5(11,12)6(13,14)15/h1H3",other,P,9.817,0.4198,0.0,6,0.02,0.2,506.43
38049,"(z)-1,1,1,4,4,4-hexafluorobut-2-ene",FC(F)(F)C=CC(F)(F)F,692-49-9,"InChI=1S/C4H2F6/c5-3(6,7)1-2-4(8,9)10/h1-2H/b2-1-",other,P,12.639,0.12,0.0,1,0.0,0.0,446.23
55223,furan-2-ylmethyl propanoate,CCC(=O)OCc1ccco1,623-19-8,"InChI=1S/C8H10O3/c1-2-8(9)11-6-7-4-3-5-10-7/h3-5H,2,6H2,1H3",other,All,7.019,0.7456,4.322,25,0.0,0.07,659.09
55225,furan-2-ylmethyl butanoate,CCCC(=O)OCc1ccco1,623-21-2,"InChI=1S/C9H12O3/c1-2-4-9(10)12-7-8-5-3-6-11-8/h3,5-6H,2,4,7H2,1H3",other,All,5.983,0.8593,12.459,25,0.01,0.12,689.13
12639,butan-2-ol,CCC(C)O,15892-23-6,"InChI=1S/C4H10O/c1-3-4(2)5/h4-5H,3H2,1-2H3",other,P,8.021,0.0,0.0,7,0.4,2.42,555.57
10308,1-methylimidazole,Cn1ccnc1,616-47-7,"InChI=1S/C4H6N2/c1-6-3-2-5-4-6/h2-4H,1H3",other,NP,0.0,0.0,91.727,1,0.0,0.0,778.12
2184,1-(2-hydroxypropylamino)propan-2-ol,CC(O)CNCC(C)O,110-97-4,"InChI=1S/C6H15NO2/c1-5(8)3-7-4-6(2)9/h5-9H,3-4H2,1-2H3",other,All,2.477,0.2251,76.088,6,0.01,0.04,734.36
