,value
p_des_in_Pa,10308.498186644281
sigma,8.66779986
epsilon,10.000001
rho,0.08
pore_size_in_Angstrom,20.5791399
specific_surface_area_in_m^2/kg,219277.875
specific_work_in_kJ/kg,241.77846633509225
purity,0.7002706130188964
recovery,0.0
