,value
p_des_in_Pa,4112.74311436267
sigma,8.66779986
epsilon,10.000001
rho,0.08
pore_size_in_Angstrom,20.5791399
specific_surface_area_in_m^2/kg,219277.875
specific_work_in_kJ/kg,323.20234843228184
purity,0.8601807207842272
recovery,0.0
