,p_des_in_Pa,sigma,epsilon,rho,pore_size_in_Angstrom,specific_surface_area_in_m^2/kg,specific_work_in_kJ/kg,purity,recovery
value,1000.0,6.66117357,25.5656726,0.08,9.28500239,1422594.91,482.9409185904368,0.9249566829682596,0.0
value,1099.999,6.66117357,25.5656726,0.08,9.28500239,1422594.91,470.3117175550735,0.922460271359863,0.0
value,4803.688986305295,6.66117357,25.5656726,0.08,9.28500239,1422594.91,310.81409387607016,0.844183966606271,0.0
value,4903.6879863052945,6.66117357,25.5656726,0.08,9.28500239,1422594.91,308.9443917727483,0.842005519436967,0.0
value,5454.786931964283,6.66117357,25.5656726,0.08,9.28500239,1422594.91,299.3882102241297,0.8297306586197777,0.0
value,5554.785931964284,6.66117357,25.5656726,0.08,9.28500239,1422594.91,297.7756923129748,0.8274506101987336,0.0
value,5442.974082538694,6.66117357,25.5656726,0.08,9.28500239,1422594.91,299.58014525724946,0.8300002836267136,0.0
value,5542.973082538694,6.66117357,25.5656726,0.08,9.28500239,1422594.91,297.9632102932961,0.8277232415056563,0.0
