,p_des_in_Pa,sigma,epsilon,rho,pore_size_in_Angstrom,specific_surface_area_in_m^2/kg,specific_work_in_kJ/kg,purity,recovery
value,7455.045847569774,6.66117357,25.5656726,0.08,9.28500239,1422594.91,272.26885369529987,0.7799999976921294,0.0
value,7555.044847569774,6.66117357,25.5656726,0.08,9.28500239,1422594.91,271.1375141132359,0.7772370558985768,0.0
value,2026.104034250455,6.66117357,25.5656726,0.08,9.28500239,1422594.91,396.99365560045896,0.9017266167774456,0.0
value,2126.103034250455,6.66117357,25.5656726,0.08,9.28500239,1422594.91,391.70977294504587,0.8996284842147876,0.0
value,678.5676110558918,6.66117357,25.5656726,0.08,9.28500239,1422594.91,538.1869141624392,0.9336906606319739,0.0
value,778.5666110558918,6.66117357,25.5656726,0.08,9.28500239,1422594.91,517.8652213726864,0.9308279349317264,0.0
value,807.4875325505922,6.66117357,25.5656726,0.08,9.28500239,1422594.91,512.6125879917687,0.9300279991751969,0.0
value,907.4865325505923,6.66117357,25.5656726,0.08,9.28500239,1422594.91,496.180249478337,0.9273427708355423,0.0
value,808.5302332696217,6.66117357,25.5656726,0.08,9.28500239,1422594.91,512.428194920457,0.9299992261883212,0.0
value,908.5292332696218,6.66117357,25.5656726,0.08,9.28500239,1422594.91,496.0208532013989,0.9273156187806011,0.0
