,p_des_in_Pa,sigma,epsilon,rho,pore_size_in_Angstrom,specific_surface_area_in_m^2/kg,specific_work_in_kJ/kg,purity,recovery
value,1000.0,8.66779986,10.000001,0.08,20.5791399,219277.875,479.8146168292181,0.922649949963131,0.0
value,1099.999,8.66779986,10.000001,0.08,20.5791399,219277.875,468.1110525882782,0.9206187285278586,0.0
value,3099.698374732488,8.66779986,10.000001,0.08,20.5791399,219277.875,351.356403448111,0.8802133595511427,0.0
value,3199.697374732488,8.66779986,10.000001,0.08,20.5791399,219277.875,348.1169272877623,0.8781513913560051,0.0
value,3110.0456447849683,8.66779986,10.000001,0.08,20.5791399,219277.875,351.0520025274562,0.8799323169079435,0.0
value,3106.7632267833133,8.66779986,10.000001,0.08,20.5791399,219277.875,351.1128684689718,0.8800996946798146,0.0
value,3206.7622267833135,8.66779986,10.000001,0.08,20.5791399,219277.875,347.9108926464998,0.8780574093766746,0.0
value,3111.6447035639844,8.66779986,10.000001,0.08,20.5791399,219277.875,350.99740105134737,0.8799231884839863,0.0
value,3107.883684093275,8.66779986,10.000001,0.08,20.5791399,219277.875,351.2107492934102,0.8798083080388217,0.0
value,3109.2039651736486,8.66779986,10.000001,0.08,20.5791399,219277.875,350.9626598922467,0.8801510159986945,0.0
value,3209.2029651736484,8.66779986,10.000001,0.08,20.5791399,219277.875,347.82823299408955,0.8780254371155973,0.0
value,3009.204965173649,8.66779986,10.000001,0.08,20.5791399,219277.875,354.4567363417103,0.8818194855266117,0.0
