,p_des_in_Pa,sigma,epsilon,rho,pore_size_in_Angstrom,specific_surface_area_in_m^2/kg,specific_work_in_kJ/kg,purity,recovery
value,1000.0,4.25153231,148.706117,0.08,5.94126718,1229192.5,484.8563003034758,0.8937637722707131,0.0
value,1099.999,4.25153231,148.706117,0.08,5.94126718,1229192.5,472.28074205105224,0.8904972576528917,0.0
value,2952.023550885442,4.25153231,148.706117,0.08,5.94126718,1229192.5,360.0657340162358,0.839147478783653,0.0
value,3052.0225508854423,4.25153231,148.706117,0.08,5.94126718,1229192.5,356.7473392165751,0.8365502090546889,0.0
value,3304.2159784510427,4.25153231,148.706117,0.08,5.94126718,1229192.5,348.93673655787,0.8300057964213806,0.0
value,3404.2149784510425,4.25153231,148.706117,0.08,5.94126718,1229192.5,346.03842461131103,0.8274096748376142,0.0
value,3304.439248557215,4.25153231,148.706117,0.08,5.94126718,1229192.5,348.9303201093884,0.8299998126031438,0.0
value,3404.438248557215,4.25153231,148.706117,0.08,5.94126718,1229192.5,346.03206855426413,0.8274038810165284,0.0
