,value
p_des_in_Pa,1808.041351679918
sigma,7.34897477
epsilon,14.9410548
rho,0.08
pore_size_in_Angstrom,13.7037803
specific_surface_area_in_m^2/kg,480283.418
specific_work_in_kJ/kg,404.2382114509
purity,0.9000180888415767
recovery,0.0
