,p_des_in_Pa,sigma,epsilon,rho,pore_size_in_Angstrom,specific_surface_area_in_m^2/kg,specific_work_in_kJ/kg,purity,recovery
value,1000.0,4.25153231,148.706117,0.08,5.94126718,1229192.5,484.8563003034758,0.8937637722707131,0.0
value,1099.999,4.25153231,148.706117,0.08,5.94126718,1229192.5,472.28074205105224,0.8904972576528917,0.0
value,5707.226283148835,4.25153231,148.706117,0.08,5.94126718,1229192.5,298.42199098830775,0.7650049324050573,0.0
value,5807.225283148835,4.25153231,148.706117,0.08,5.94126718,1229192.5,296.8957696763923,0.7621008672604745,0.0
value,6568.249748906037,4.25153231,148.706117,0.08,5.94126718,1229192.5,286.18196744964547,0.7392426874357513,0.0
value,6668.248748906037,4.25153231,148.706117,0.08,5.94126718,1229192.5,284.88006430009926,0.7361267151764556,0.0
value,6543.945778006943,4.25153231,148.706117,0.08,5.94126718,1229192.5,286.50205086247587,0.7399949178995473,0.0
value,6643.944778006944,4.25153231,148.706117,0.08,5.94126718,1229192.5,285.1944457728554,0.7368865856254239,0.0
value,6543.782280375947,4.25153231,148.706117,0.08,5.94126718,1229192.5,286.50419164771193,0.7399998041917806,0.0
value,6643.781280375948,4.25153231,148.706117,0.08,5.94126718,1229192.5,285.19656463481084,0.7368916924303395,0.0
value,6443.7832803759475,4.25153231,148.706117,0.08,5.94126718,1229192.5,287.83535724298395,0.7430777138080378,0.0
