,value
p_des_in_Pa,1115.5231490914389
sigma,4.25153231
epsilon,148.706117
rho,0.08
pore_size_in_Angstrom,5.94126718
specific_surface_area_in_m^2/kg,1229192.5
specific_work_in_kJ/kg,470.461889825349
purity,0.8899998614206774
recovery,0.0
