[
    {
        "id1": {
            "cas": "124-38-9",
            "name": "carbon dioxide",
            "iupac_name": "carbon dioxide",
            "smiles": "O=C=O",
            "inchi": "InChI=1/CO2/c2-1-3",
            "formula": "CO2"
        },
        "id2": {
            "cas": "7727-37-9",
            "name": "nitrogen",
            "iupac_name": "molecular nitrogen",
            "smiles": "N#N",
            "inchi": "InChI=1/N2/c1-2",
            "formula": "N2"
        },
        "model_record": {
            "k_ij": -0.012
        }
    }
]