,p_des_in_Pa,sigma,epsilon,rho,pore_size_in_Angstrom,specific_surface_area_in_m^2/kg,specific_work_in_kJ/kg,purity,recovery
value,9393.149619443051,6.66117357,25.5656726,0.08,9.28500239,1422594.91,252.80447311742367,0.7200173967996607,0.0
value,9493.14861944305,6.66117357,25.5656726,0.08,9.28500239,1422594.91,251.91753243959278,0.716501515018691,0.0
value,1714.282120666034,6.66117357,25.5656726,0.08,9.28500239,1422594.91,415.84693768196405,0.9083918431447742,0.0
value,1814.2811206660342,6.66117357,25.5656726,0.08,9.28500239,1422594.91,409.357404372507,0.9062307215398092,0.0
value,1.0,6.66117357,25.5656726,0.08,9.28500239,1422594.91,2861.305121783814,0.9769315059654525,0.0
value,857.641060333017,6.66117357,25.5656726,0.08,9.28500239,1422594.91,504.05984303958934,0.9286664348624035,0.0
value,957.6400603330171,6.66117357,25.5656726,0.08,9.28500239,1422594.91,488.79813684645785,0.926038207137206,0.0
value,429.3205301665086,6.66117357,25.5656726,0.08,9.28500239,1422594.91,612.2070822964371,0.9417585896406756,0.0
value,529.3195301665086,6.66117357,25.5656726,0.08,9.28500239,1422594.91,577.1051476888573,0.9383180734873751,0.0
value,100.99900000000018,6.66117357,25.5656726,0.08,9.28500239,1422594.91,918.8265778393222,0.9579528804510418,0.0
value,100000.0,6.66117357,25.5656726,0.08,9.28500239,1422594.91,-0.0,0.19882283661823935,0.0
value,100099.999,6.66117357,25.5656726,0.08,9.28500239,1422594.91,-0.0,0.19874329653746098,0.0
value,99999.63650791517,6.66117357,25.5656726,0.08,9.28500239,1422594.91,2.5179302791913955e-05,0.19882312518637546,0.0
value,100099.63550791518,6.66117357,25.5656726,0.08,9.28500239,1422594.91,-0.0,0.1987435856002691,0.0
value,99997.82554555759,6.66117357,25.5656726,0.08,9.28500239,1422594.91,0.00015062814543554694,0.1988245667992854,0.0
value,100097.82454555757,6.66117357,25.5656726,0.08,9.28500239,1422594.91,-0.0,0.19874502465211002,0.0
value,99988.93203360724,6.66117357,25.5656726,0.08,9.28500239,1422594.91,0.000766736016127398,0.19883164570103107,0.0
value,100088.93103360724,6.66117357,25.5656726,0.08,9.28500239,1422594.91,-0.0,0.1987520952242362,0.0
