,value
p_des_in_Pa,9942.873734353198
sigma,6.66117357
epsilon,25.5656726
rho,0.08
pore_size_in_Angstrom,9.28500239
specific_surface_area_in_m^2/kg,1422594.91
specific_work_in_kJ/kg,248.02513737554384
purity,0.699999763540204
recovery,0.0
