,p_des_in_Pa,sigma,epsilon,rho,pore_size_in_Angstrom,specific_surface_area_in_m^2/kg,specific_work_in_kJ/kg,purity,recovery
value,1000.0,8.66779986,10.000001,0.08,20.5791399,219277.875,479.8146168292181,0.922649949963131,0.0
value,1099.999,8.66779986,10.000001,0.08,20.5791399,219277.875,468.1110525882782,0.9206187285278586,0.0
value,1.0,8.66779986,10.000001,0.08,20.5791399,219277.875,1941.2043074381158,0.9426613362598273,0.0
value,500.50000000000074,8.66779986,10.000001,0.08,20.5791399,219277.875,532.41055489662,0.9262159470207844,0.0
value,750.2500000000003,8.66779986,10.000001,0.08,20.5791399,219277.875,515.0505811851293,0.9279615848164856,0.0
value,850.2490000000004,8.66779986,10.000001,0.08,20.5791399,219277.875,499.63302077730617,0.925846300184983,0.0
value,250.75000000000097,8.66779986,10.000001,0.08,20.5791399,219277.875,655.5818577395349,0.9380638435956689,0.0
value,625.3750000000005,8.66779986,10.000001,0.08,20.5791399,219277.875,537.6499657099139,0.930575941758496,0.0
value,725.3740000000005,8.66779986,10.000001,0.08,20.5791399,219277.875,519.3062459763349,0.9284567973422742,0.0
value,375.62500000000085,8.66779986,10.000001,0.08,20.5791399,219277.875,602.4062616338571,0.9356421100863813,0.0
value,562.9375000000006,8.66779986,10.000001,0.08,20.5791399,219277.875,551.2031997437514,0.9318042982235878,0.0
value,662.9365000000006,8.66779986,10.000001,0.08,20.5791399,219277.875,530.7374268128613,0.9297281289924937,0.0
value,531.7187500000006,8.66779986,10.000001,0.08,20.5791399,219277.875,558.2875162635638,0.9324672927156042,0.0
value,631.7177500000006,8.66779986,10.000001,0.08,20.5791399,219277.875,536.5571998843807,0.9304154619147799,0.0
value,485.71003765640194,8.66779986,10.000001,0.08,20.5791399,219277.875,569.9116237087838,0.9333822907485616,0.0
value,508.7143938282013,8.66779986,10.000001,0.08,20.5791399,219277.875,563.6771543205615,0.9329618881364097,0.0
value,608.7133938282013,8.66779986,10.000001,0.08,20.5791399,219277.875,541.0414536936534,0.9309028863552863,0.0
