,p_des_in_Pa,sigma,epsilon,rho,pore_size_in_Angstrom,specific_surface_area_in_m^2/kg,specific_work_in_kJ/kg,purity,recovery
value,1000.0,4.24276332,100.871049,0.08,7.62557356,745237.12,470.99516918406715,0.8831534436926156,0.0
value,1099.999,4.24276332,100.871049,0.08,7.62557356,745237.12,460.590027219675,0.8802472003346937,0.0
value,420.3380182908237,4.24276332,100.871049,0.08,7.62557356,745237.12,570.7073811200548,0.9005088986767829,0.0
value,520.3370182908237,4.24276332,100.871049,0.08,7.62557356,745237.12,545.2855717469747,0.8974450057856851,0.0
value,436.9473974657508,4.24276332,100.871049,0.08,7.62557356,745237.12,566.0463912380399,0.8999978095630059,0.0
value,536.9463974657508,4.24276332,100.871049,0.08,7.62557356,745237.12,553.0060077864176,0.8994851065124736,0.0
value,436.52016866586814,4.24276332,100.871049,0.08,7.62557356,745237.12,566.1588136724857,0.900013076256408,0.0
value,536.5191686658682,4.24276332,100.871049,0.08,7.62557356,745237.12,541.7211573490862,0.8969463392314532,0.0
value,336.5211686658682,4.24276332,100.871049,0.08,7.62557356,745237.12,597.8603647449523,0.9031013282302482,0.0
value,436.8751293445019,4.24276332,100.871049,0.08,7.62557356,745237.12,566.0662199689489,0.9000000533178099,0.0
value,536.8741293445019,4.24276332,100.871049,0.08,7.62557356,745237.12,541.6082094438365,0.8969413914071188,0.0
