,value
p_des_in_Pa,10021.688462201591
sigma,8.66779986
epsilon,10.000001
rho,0.08
pore_size_in_Angstrom,20.5791399
specific_surface_area_in_m^2/kg,219277.875
specific_work_in_kJ/kg,244.14812947148624
purity,0.7104783876933629
recovery,0.0
