,p_des_in_Pa,sigma,epsilon,rho,pore_size_in_Angstrom,specific_surface_area_in_m^2/kg,specific_work_in_kJ/kg,purity,recovery
value,1000.0,8.66779986,10.000001,0.08,20.5791399,219277.875,479.8146168292181,0.922649949963131,0.0
value,1099.999,8.66779986,10.000001,0.08,20.5791399,219277.875,468.1110525882782,0.9206187285278586,0.0
value,2115.0789899277756,8.66779986,10.000001,0.08,20.5791399,219277.875,392.1061616673097,0.8997572819914261,0.0
value,2215.077989927776,8.66779986,10.000001,0.08,20.5791399,219277.875,386.9196215813287,0.8978665378546012,0.0
value,2102.2419499144507,8.66779986,10.000001,0.08,20.5791399,219277.875,392.87879457446604,0.8998931870535092,0.0
value,2202.2409499144505,8.66779986,10.000001,0.08,20.5791399,219277.875,387.5735017026623,0.8980905127286458,0.0
value,2096.316759940412,8.66779986,10.000001,0.08,20.5791399,219277.875,393.07286611520914,0.9001422063833768,0.0
value,2196.3157599404117,8.66779986,10.000001,0.08,20.5791399,219277.875,387.92997966011023,0.8981614744031514,0.0
value,1996.3177599404116,8.66779986,10.000001,0.08,20.5791399,219277.875,398.477861512679,0.9021758789756652,0.0
value,2103.496174557466,8.66779986,10.000001,0.08,20.5791399,219277.875,392.7383564063303,0.8999506838351562,0.0
value,2101.0064045040453,8.66779986,10.000001,0.08,20.5791399,219277.875,392.8506444206142,0.9000245185353368,0.0
value,2201.0054045040456,8.66779986,10.000001,0.08,20.5791399,219277.875,387.6279183207618,0.8981326374035057,0.0
