,p_des_in_Pa,sigma,epsilon,rho,pore_size_in_Angstrom,specific_surface_area_in_m^2/kg,specific_work_in_kJ/kg,purity,recovery
value,1000.0,3.96548591,358.229008,0.08,9.909386789999997,639797.184,472.90881965888565,0.8473430434340833,0.0
value,1099.999,3.96548591,358.229008,0.08,9.909386789999997,639797.184,461.21471770726544,0.8432212265794956,0.0
value,1.0,3.96548591,358.229008,0.08,9.909386789999997,639797.184,3346.840932847943,0.9613540263995762,0.0
value,500.5000000000001,3.96548591,358.229008,0.08,9.909386789999997,639797.184,569.3924178511601,0.871695814821191,0.0
value,600.4990000000001,3.96548591,358.229008,0.08,9.909386789999997,639797.184,541.8678273419482,0.8660810334889001,0.0
value,250.75,3.96548591,358.229008,0.08,9.909386789999997,639797.184,689.8079566258813,0.8893707255214014,0.0
value,350.749,3.96548591,358.229008,0.08,9.909386789999997,639797.184,628.0361576555015,0.881417075986389,0.0
value,117.11111964622503,3.96548591,358.229008,0.08,9.909386789999997,639797.184,855.0814448060521,0.9041570698728897,0.0
value,217.11011964622506,3.96548591,358.229008,0.08,9.909386789999997,639797.184,718.3405762380349,0.8924811681205036,0.0
value,152.71460784225584,3.96548591,358.229008,0.08,9.909386789999997,639797.184,793.3413797663533,0.8994348736683262,0.0
value,147.87454758485413,3.96548591,358.229008,0.08,9.909386789999997,639797.184,800.5924307119149,0.9000302204130622,0.0
value,247.87354758485412,3.96548591,358.229008,0.08,9.909386789999997,639797.184,692.0476686566694,0.8896259135004235,0.0
value,148.16500528772505,3.96548591,358.229008,0.08,9.909386789999997,639797.184,800.148761238262,0.8999941325612822,0.0
value,148.10861152605833,3.96548591,358.229008,0.08,9.909386789999997,639797.184,800.2348094192683,0.9000011370991966,0.0
value,248.10761152605832,3.96548591,358.229008,0.08,9.909386789999997,639797.184,691.8641306349153,0.8896050052469526,0.0
value,48.10961152605831,3.96548591,358.229008,0.08,9.909386789999997,639797.184,1096.077445766546,0.9174303455595928,0.0
