,p_des_in_Pa,sigma,epsilon,rho,pore_size_in_Angstrom,specific_surface_area_in_m^2/kg,specific_work_in_kJ/kg,purity,recovery
value,1000.0,8.66779986,10.000001,0.08,20.5791399,219277.875,479.8146168292181,0.922649949963131,0.0
value,1099.999,8.66779986,10.000001,0.08,20.5791399,219277.875,468.1110525882782,0.9206187285278586,0.0
value,145.84022031835627,8.66779986,10.000001,0.08,20.5791399,219277.875,730.1365196623043,0.9400547968859382,0.0
value,572.9201101591783,8.66779986,10.000001,0.08,20.5791399,219277.875,549.0804307765461,0.9315861420745564,0.0
value,672.9191101591783,8.66779986,10.000001,0.08,20.5791399,219277.875,528.8198366560636,0.9294993546186239,0.0
value,169.72745328629225,8.66779986,10.000001,0.08,20.5791399,219277.875,708.9579827704554,0.9392962908853059,0.0
value,269.72645328629227,8.66779986,10.000001,0.08,20.5791399,219277.875,645.7971843740135,0.9377066444589652,0.0
value,125.45961699625248,8.66779986,10.000001,0.08,20.5791399,219277.875,751.8776746178144,0.940554691098628,0.0
value,225.45861699625252,8.66779986,10.000001,0.08,20.5791399,219277.875,670.8427640586814,0.9384845792940248,0.0
value,152.2545732147354,8.66779986,10.000001,0.08,20.5791399,219277.875,723.7456836588583,0.939950649383812,0.0
value,252.25357321473538,8.66779986,10.000001,0.08,20.5791399,219277.875,654.8011833462788,0.9380359368346455,0.0
value,149.67715642685997,8.66779986,10.000001,0.08,20.5791399,219277.875,726.9318854874025,0.9399539928891064,0.0
value,150.96586482079766,8.66779986,10.000001,0.08,20.5791399,219277.875,725.1839317249459,0.939962978654677,0.0
value,250.96486482079766,8.66779986,10.000001,0.08,20.5791399,219277.875,656.5164763253857,0.9379988797317177,0.0
