,p_des_in_Pa,sigma,epsilon,rho,pore_size_in_Angstrom,specific_surface_area_in_m^2/kg,specific_work_in_kJ/kg,purity,recovery
value,1000.0,4.25153231,148.706117,0.08,5.94126718,1229192.5,484.8563003034758,0.8937637722707131,0.0
value,1099.999,4.25153231,148.706117,0.08,5.94126718,1229192.5,472.28074205105224,0.8904972576528917,0.0
value,2033.6226401309764,4.25153231,148.706117,0.08,5.94126718,1229192.5,399.0282252007402,0.8633767081700628,0.0
value,2133.6216401309766,4.25153231,148.706117,0.08,5.94126718,1229192.5,393.80623280813467,0.860678167569046,0.0
value,2158.7522899019978,4.25153231,148.706117,0.08,5.94126718,1229192.5,392.5420429142441,0.8600036259895747,0.0
value,2258.751289901998,4.25153231,148.706117,0.08,5.94126718,1229192.5,387.68824522518037,0.8573324899849931,0.0
value,2158.888035641211,4.25153231,148.706117,0.08,5.94126718,1229192.5,392.53526526281087,0.8599999813822189,0.0
value,2258.8870356412112,4.25153231,148.706117,0.08,5.94126718,1229192.5,387.6817947560341,0.8573289725722322,0.0
