,p_des_in_Pa,sigma,epsilon,rho,pore_size_in_Angstrom,specific_surface_area_in_m^2/kg,specific_work_in_kJ/kg,purity,recovery
value,1000.0,4.25153231,148.706117,0.08,5.94126718,1229192.5,484.8563003034758,0.8937637722707131,0.0
value,1099.999,4.25153231,148.706117,0.08,5.94126718,1229192.5,472.28074205105224,0.8904972576528917,0.0
value,3258.157187803597,4.25153231,148.706117,0.08,5.94126718,1229192.5,350.3079986720283,0.8312008574783472,0.0
value,3358.1561878035973,4.25153231,148.706117,0.08,5.94126718,1229192.5,347.36042901972064,0.828605537161437,0.0
value,3689.7318723152785,4.25153231,148.706117,0.08,5.94126718,1229192.5,338.2989116992198,0.8199832993791271,0.0
value,3789.7308723152787,4.25153231,148.706117,0.08,5.94126718,1229192.5,335.7572564854444,0.8173746874049928,0.0
value,3689.091667714814,4.25153231,148.706117,0.08,5.94126718,1229192.5,338.31544910423827,0.8199999890623102,0.0
value,3789.0906677148137,4.25153231,148.706117,0.08,5.94126718,1229192.5,335.7732584725328,0.8173914993780713,0.0
