,value
p_des_in_Pa,34.92943108736312
sigma,3.72772606
epsilon,185.723276
rho,0.08
pore_size_in_Angstrom,7.44072605
specific_surface_area_in_m^2/kg,1132244.6
specific_work_in_kJ/kg,1076.016428889016
purity,0.9015965232396816
recovery,0.0
