,p_des_in_Pa,sigma,epsilon,rho,pore_size_in_Angstrom,specific_surface_area_in_m^2/kg,specific_work_in_kJ/kg,purity,recovery
value,1000.0,4.25153231,148.706117,0.08,5.94126718,1229192.5,484.8563003034758,0.8937637722707131,0.0
value,1099.999,4.25153231,148.706117,0.08,5.94126718,1229192.5,472.28074205105224,0.8904972576528917,0.0
value,3564.2908247217524,4.25153231,148.706117,0.08,5.94126718,1229192.5,341.60693273133546,0.8232494601168279,0.0
value,3664.289824721752,4.25153231,148.706117,0.08,5.94126718,1229192.5,338.9587927924336,0.8206462705217968,0.0
value,4073.255966850358,4.25153231,148.706117,0.08,5.94126718,1229192.5,328.9701053714681,0.8099266501278505,0.0
value,4173.254966850358,4.25153231,148.706117,0.08,5.94126718,1229192.5,326.7101061674856,0.8072826418918699,0.0
value,4070.481802320438,4.25153231,148.706117,0.08,5.94126718,1229192.5,329.0337408216646,0.8099998701975523,0.0
value,4170.480802320439,4.25153231,148.706117,0.08,5.94126718,1229192.5,326.7720690252891,0.8073559097380453,0.0
