,p_des_in_Pa,sigma,epsilon,rho,pore_size_in_Angstrom,specific_surface_area_in_m^2/kg,specific_work_in_kJ/kg,purity,recovery
value,1000.0,4.25153231,148.706117,0.08,5.94126718,1229192.5,484.8563003034758,0.8937637722707131,0.0
value,1099.999,4.25153231,148.706117,0.08,5.94126718,1229192.5,472.28074205105224,0.8904972576528917,0.0
value,196.8208186220488,4.25153231,148.706117,0.08,5.94126718,1229192.5,767.7574260202813,0.9296013859992388,0.0
value,296.8198186220488,4.25153231,148.706117,0.08,5.94126718,1229192.5,682.488038676382,0.9230220635605677,0.0
value,342.7521067581288,4.25153231,148.706117,0.08,5.94126718,1229192.5,655.0013198131682,0.9204214908644877,0.0
value,442.75110675812874,4.25153231,148.706117,0.08,5.94126718,1229192.5,608.995163208353,0.9153371627272082,0.0
value,351.0420250757261,4.25153231,148.706117,0.08,5.94126718,1229192.5,650.5512297337383,0.9199726114765442,0.0
value,451.04102507572605,4.25153231,148.706117,0.08,5.94126718,1229192.5,605.801315736358,0.9149435881104611,0.0
value,350.4974213310862,4.25153231,148.706117,0.08,5.94126718,1229192.5,650.8393480101025,0.9200019271932738,0.0
value,450.4964213310862,4.25153231,148.706117,0.08,5.94126718,1229192.5,606.0087643120291,0.9149693286145119,0.0
value,250.49842133108618,4.25153231,148.706117,0.08,5.94126718,1229192.5,716.4645025970344,0.9258808713889591,0.0
