,value
p_des_in_Pa,1610.2353796878217
sigma,8.66779986
epsilon,10.000001
rho,0.08
pore_size_in_Angstrom,20.5791399
specific_surface_area_in_m^2/kg,219277.875
specific_work_in_kJ/kg,422.85070885259483
purity,0.9100986258414453
recovery,0.0
