,p_des_in_Pa,sigma,epsilon,rho,pore_size_in_Angstrom,specific_surface_area_in_m^2/kg,specific_work_in_kJ/kg,purity,recovery
value,1000.0,4.25153231,148.706117,0.08,5.94126718,1229192.5,484.8563003034758,0.8937637722707131,0.0
value,1099.999,4.25153231,148.706117,0.08,5.94126718,1229192.5,472.28074205105224,0.8904972576528917,0.0
value,502.9544555402005,4.25153231,148.706117,0.08,5.94126718,1229192.5,587.4145960957695,0.9125568577592242,0.0
value,602.9534555402005,4.25153231,148.706117,0.08,5.94126718,1229192.5,558.1709965139703,0.9082743009717544,0.0
value,562.6578597805732,4.25153231,148.706117,0.08,5.94126718,1229192.5,569.1287507109687,0.9099561192355907,0.0
value,662.6568597805732,4.25153231,148.706117,0.08,5.94126718,1229192.5,543.5935442085571,0.9058749507569974,0.0
value,561.582669529746,4.25153231,148.706117,0.08,5.94126718,1229192.5,569.4351753631331,0.9100017548441387,0.0
value,661.581669529746,4.25153231,148.706117,0.08,5.94126718,1229192.5,543.840614384646,0.905917270602618,0.0
value,461.58366952974603,4.25153231,148.706117,0.08,5.94126718,1229192.5,601.8491289209077,0.9144482725942054,0.0
