,value
p_des_in_Pa,1792.3534496122136
sigma,4.25153231
epsilon,148.706117
rho,0.08
pore_size_in_Angstrom,5.94126718
specific_surface_area_in_m^2/kg,1229192.5
specific_work_in_kJ/kg,413.08218315104165
purity,0.8700000365388109
recovery,0.0
