,value
p_des_in_Pa,4995.197439340402
sigma,6.66117357
epsilon,25.5656726
rho,0.08
pore_size_in_Angstrom,9.28500239
specific_surface_area_in_m^2/kg,1422594.91
specific_work_in_kJ/kg,307.2721819882415
purity,0.8400000208204765
recovery,0.0
