,value
p_des_in_Pa,111.27551737097066
sigma,3.78028367
epsilon,325.20927
rho,0.08
pore_size_in_Angstrom,12.2819171
specific_surface_area_in_m^2/kg,512876.09
specific_work_in_kJ/kg,816.2548092589282
purity,0.9000127474100881
recovery,0.0
