,p_des_in_Pa,sigma,epsilon,rho,pore_size_in_Angstrom,specific_surface_area_in_m^2/kg,specific_work_in_kJ/kg,purity,recovery
value,1000.0,4.11172461,151.16352,0.08,8.8404214,739366.56,472.94717236801637,0.8667449933277349,0.0
value,1099.999,4.11172461,151.16352,0.08,8.8404214,739366.56,461.89931138253604,0.8629895747767213,0.0
value,114.48820762673647,4.11172461,151.16352,0.08,8.8404214,739366.56,788.9522624121994,0.9072007019733835,0.0
value,214.48720762673648,4.11172461,151.16352,0.08,8.8404214,739366.56,683.938408796703,0.8958560172318056,0.0
value,177.95960529346672,4.11172461,151.16352,0.08,8.8404214,739366.56,713.8599077617681,0.9034640165057979,0.0
value,277.95860529346675,4.11172461,151.16352,0.08,8.8404214,739366.56,643.8299781041903,0.8980270211314898,0.0
value,241.67093162641646,4.11172461,151.16352,0.08,8.8404214,739366.56,665.1862168732204,0.8999452895061069,0.0
value,341.6699316264164,4.11172461,151.16352,0.08,8.8404214,739366.56,613.3250315986062,0.894786136344159,0.0
value,240.61048730404693,4.11172461,151.16352,0.08,8.8404214,739366.56,665.8665271487954,0.9000022206202448,0.0
value,340.6094873040469,4.11172461,151.16352,0.08,8.8404214,739366.56,613.7757698719954,0.8948388903810627,0.0
