,p_des_in_Pa,sigma,epsilon,rho,pore_size_in_Angstrom,specific_surface_area_in_m^2/kg,specific_work_in_kJ/kg,purity,recovery
value,1000.0,8.66779986,10.000001,0.08,20.5791399,219277.875,479.8146168292181,0.922649949963131,0.0
value,1099.999,8.66779986,10.000001,0.08,20.5791399,219277.875,468.1110525882782,0.9206187285278586,0.0
value,5068.937144341912,8.66779986,10.000001,0.08,20.5791399,219277.875,303.6638625399583,0.8400058736572733,0.0
value,5168.936144341913,8.66779986,10.000001,0.08,20.5791399,219277.875,301.8184141359993,0.8380511972716063,0.0
value,5069.237633905292,8.66779986,10.000001,0.08,20.5791399,219277.875,303.5256972909887,0.8404434481628938,0.0
value,5169.2366339052915,8.66779986,10.000001,0.08,20.5791399,219277.875,301.7010073462592,0.8384286019819078,0.0
value,5080.242040410289,8.66779986,10.000001,0.08,20.5791399,219277.875,303.31228657353597,0.8402492225685106,0.0
value,5180.241040410289,8.66779986,10.000001,0.08,20.5791399,219277.875,301.6926252012642,0.83756057955864,0.0
value,4980.243040410289,8.66779986,10.000001,0.08,20.5791399,219277.875,305.2290539090299,0.8420776562627879,0.0
value,5089.511403258761,8.66779986,10.000001,0.08,20.5791399,219277.875,303.186089560346,0.8399342295563803,0.0
value,5087.06519579746,8.66779986,10.000001,0.08,20.5791399,219277.875,303.3330333113862,0.8396193276244108,0.0
value,5084.876721834525,8.66779986,10.000001,0.08,20.5791399,219277.875,303.3574701246349,0.8397415920525217,0.0
value,5082.559381122407,8.66779986,10.000001,0.08,20.5791399,219277.875,303.3675497390337,0.8399079722638737,0.0
value,5081.400710766347,8.66779986,10.000001,0.08,20.5791399,219277.875,303.37474779164063,0.8399553440845795,0.0
value,5080.821375588318,8.66779986,10.000001,0.08,20.5791399,219277.875,303.36235770474957,0.8400416866583259,0.0
value,5080.531707999304,8.66779986,10.000001,0.08,20.5791399,219277.875,303.5061116045414,0.8396386325476194,0.0
value,5080.386874204796,8.66779986,10.000001,0.08,20.5791399,219277.875,303.34038293541147,0.8401489703761285,0.0
