,p_des_in_Pa,sigma,epsilon,rho,pore_size_in_Angstrom,specific_surface_area_in_m^2/kg,specific_work_in_kJ/kg,purity,recovery
value,1000.0,8.66779986,10.000001,0.08,20.5791399,219277.875,479.8146168292181,0.922649949963131,0.0
value,1099.999,8.66779986,10.000001,0.08,20.5791399,219277.875,468.1110525882782,0.9206187285278586,0.0
value,9007.414683560755,8.66779986,10.000001,0.08,20.5791399,219277.875,253.19164015652962,0.7422934634494072,0.0
value,9107.413683560755,8.66779986,10.000001,0.08,20.5791399,219277.875,252.21409227962323,0.7398276379788251,0.0
value,8289.344418796729,8.66779986,10.000001,0.08,20.5791399,219277.875,260.2211106655447,0.7632630581377956,0.0
value,8389.343418796729,8.66779986,10.000001,0.08,20.5791399,219277.875,259.198554516034,0.7605370400125671,0.0
value,8409.043751571366,8.66779986,10.000001,0.08,20.5791399,219277.875,259.0465804834049,0.7594881782584609,0.0
value,8390.268505046592,8.66779986,10.000001,0.08,20.5791399,219277.875,259.3390280838557,0.7591328288779146,0.0
value,8349.194085184046,8.66779986,10.000001,0.08,20.5791399,219277.875,259.69080382514244,0.7608993831089647,0.0
value,8449.193085184046,8.66779986,10.000001,0.08,20.5791399,219277.875,258.58772366942907,0.7587754559817869,0.0
value,8391.538952087678,8.66779986,10.000001,0.08,20.5791399,219277.875,259.15977277137216,0.7605512100202818,0.0
value,8491.537952087678,8.66779986,10.000001,0.08,20.5791399,219277.875,258.1978411657973,0.7572664204364629,0.0
value,8291.539952087678,8.66779986,10.000001,0.08,20.5791399,219277.875,260.2712906989867,0.7624304834387279,0.0
value,8408.319464023567,8.66779986,10.000001,0.08,20.5791399,219277.875,259.0239392720263,0.7597659379037605,0.0
value,8401.19390088943,8.66779986,10.000001,0.08,20.5791399,219277.875,259.07432661311276,0.760157268482922,0.0
value,8501.19290088943,8.66779986,10.000001,0.08,20.5791399,219277.875,258.1095003543569,0.7568242172785088,0.0
value,8301.19490088943,8.66779986,10.000001,0.08,20.5791399,219277.875,260.1285952771775,0.7626570899115896,0.0
