No,MOF,Molecule,T_ref [K],DFT_parameters_fit,geometry,density_in_kg/m^3,cp_adsorb_in_J/kgK,POAVF,CCDC,max_purity
16,RSM0068,CO2,298.15,[6.66117357e+00 2.55656726e+01 9.28500239e+00 1.42259491e+06],Spherical,1538.51,961.280916,0.30195,BUSQIQ_clean,0.986488531447413
332,RSM0841,CO2,298.15,[4.25153231e+00 1.48706117e+02 5.94126718e+00 1.22919250e+06],Spherical,1930.48,541.290832,0.42004,NOSHIO_clean,0.984876590799546
946,RSM2531,CO2,298.15,[4.55743346e+00 1.78783269e+02 7.79881627e+00 5.92639903e+05],Spherical,1475.54,781.097877,0.26402,NISBEX_clean,0.983951189282555
662,RSM1676,CO2,298.15,[4.30654597e+00 3.37965544e+02 9.20068579e+00 3.86403805e+05],Spherical,1791.19,715.0423,0.23418,RAVDID_clean,0.982188600088984
878,RSM2339,CO2,298.15,[4.40592348e+00 1.80397502e+02 7.71781674e+00 9.19650646e+05],Spherical,1418.5,780.411929,0.39237,CUKXIR_clean,0.981030571488775
174,RSM0462,CO2,298.15,[5.19755868e+00 6.30281973e+01 7.36964017e+00 7.49981267e+05],Spherical,2153.82,564.997514,0.34621,HORCUN_clean,0.979091265641866
1130,RSM3120,CO2,298.15,[4.15096311e+00 1.77563611e+02 7.01340498e+00 5.98335869e+05],Spherical,2127.89,511.708344,0.27364,HUFYIS_clean,0.972299840823682
518,RSM1260,CO2,298.15,[4.25860184e+00 1.82562031e+02 8.20811368e+00 9.58172721e+05],Spherical,2009.78,418.970465,0.50179,SOKWAS_clean,0.967821749852379
812,RSM2114,CO2,298.15,[3.96548591e+00 3.58229008e+02 9.90938679e+00 6.39797184e+05],Spherical,1531.21,775.906997,0.33263,ZEDQEG_clean,0.962204816733481
204,RSM0532,CO2,298.15,[8.60839997e+00 1.00000128e+01 1.68604811e+01 3.50341539e+05],Spherical,1974.9,594.908967,0.28473,CAKXUJ_clean,0.961387072745143
194,RSM0497,CO2,298.15,[8.20344780e+00 1.00000003e+01 1.50824370e+01 4.43648780e+05],Spherical,1887.05,609.806284,0.30163,CAKXET_clean,0.953225578980101
554,RSM1351,CO2,298.15,[4.87351949e+00 1.14287621e+02 1.06740709e+01 6.34236912e+05],Spherical,1771.01,687.519637,0.24195,HEKTUO01_clean,0.951483276012044
1052,RSM2891,CO2,298.15,[6.34872905e+00 2.61330569e+01 1.11103201e+01 7.63377788e+05],Spherical,1621.11,743.635876,0.28452,XUCSAR01_clean,0.946585699258382
338,RSM0850,CO2,298.15,[3.46812968e+00 3.32951408e+02 7.28589610e+00 7.43988638e+05],Spherical,1416.19,744.721424,0.35883,WODXEU_clean,0.943861925455896
990,RSM2729,CO2,298.15,[7.00060234e+00 2.70234568e+01 1.73542674e+01 3.26585506e+05],Spherical,1348.57,960.053323,0.15297,RONSIY_clean,0.941554032701578
736,RSM1911,CO2,298.15,[8.66779986e+00 1.00000010e+01 2.05791399e+01 2.19277875e+05],Spherical,1335.36,896.538991,0.21439,NAXLII_clean,0.941037058156471
1122,RSM3083,CO2,298.15,[7.34897477e+00 1.49410548e+01 1.37037803e+01 4.80283418e+05],Spherical,1233.67,915.956153,0.24041,POKGEC_clean,0.93945852632848
52,RSM0191,CO2,298.15,[4.35298195e+00 1.58484265e+02 9.96542122e+00 1.05850876e+06],Spherical,1702.3,611.101987,0.41043,UCEGEQ_clean,0.937496093563968
566,RSM1382,CO2,298.15,[4.14978378e+00 2.08082999e+02 1.02008724e+01 6.31494269e+05],Spherical,1717.12,711.568789,0.31435,COYTEQ_clean,0.935582901292724
536,RSM1301,CO2,298.15,[3.79580511e+00 1.94482817e+02 7.45060787e+00 1.42511669e+06],Spherical,1386.99,856.909063,0.2575,LIVREP_clean,0.932644332441998
450,RSM1114,CO2,298.15,[7.37114179e+00 1.51327929e+01 1.50432201e+01 6.99312116e+05],Spherical,1246.79,877.50816,0.28923,ESEHIV_clean,0.932210958580692
986,RSM2724,CO2,298.15,[3.87255931e+00 2.86718200e+02 1.03129105e+01 7.09831421e+05],Spherical,1567.59,653.811267,0.35414,YAJXIT_clean,0.932147187249946
288,RSM0716,CO2,298.15,[6.46113666e+00 2.47779983e+01 1.24097298e+01 4.98126995e+05],Spherical,2151.48,509.921922,0.35727,YUBGUZ_clean,0.932109352711854
180,RSM0478,CO2,298.15,[8.43471704e+00 1.00004174e+01 2.05198098e+01 3.67540635e+05],Spherical,1488.01,809.60484,0.30017,WOWMEC_clean,0.931802181919852
620,RSM1577,CO2,298.15,[7.68296542e+00 1.00000001e+01 1.33234310e+01 6.37341052e+05],Spherical,1575.92,747.237206,0.26157,DOJXIK_clean,0.931728254087829
108,RSM0313,CO2,298.15,[7.90543806e+00 1.00000002e+01 1.51168251e+01 6.29571995e+05],Spherical,1397.82,755.35,0.38594,DAXKIY_clean,0.930322029734933
360,RSM0903,CO2,298.15,[5.13706882e+00 9.18426694e+01 1.30674780e+01 3.35389662e+05],Spherical,1666.22,837.814258,0.19214,ZALMIL_clean,0.928965633993762
264,RSM0658,CO2,298.15,[4.85113951e+00 8.70283256e+01 1.00371883e+01 5.82098578e+05],Spherical,1530.34,724.053506,0.23136,LEDHIN_clean,0.928405299879243
290,RSM0718,CO2,298.15,[6.26608619e+00 4.06158188e+01 1.65728363e+01 3.53152745e+05],Spherical,1652.6,682.311792,0.34554,HURQUG_clean,0.927880428718086
56,RSM0199,CO2,298.15,[4.28396008e+00 1.68132515e+02 1.06658267e+01 4.45857844e+05],Spherical,2326.91,435.12314,0.36196,RORRIB_clean,0.92178773959506
238,RSM0622,CO2,298.15,[6.86155408e+00 1.81206177e+01 1.31494026e+01 4.03443195e+05],Spherical,1617.36,820.056475,0.24328,SISFEH_clean,0.921011526582014
648,RSM1639,CO2,298.15,[7.73710294e+00 1.00000004e+01 1.44319067e+01 4.03938794e+05],Spherical,1815.19,677.522889,0.2361,ELUJEC_clean,0.918564641293547
1364,RSM3898,CO2,298.15,[4.58119126e+00 1.01680864e+02 9.61089592e+00 8.38909313e+05],Spherical,1413.35,773.597971,0.26068,LAHYOL_clean,0.918166957639012
622,RSM1579,CO2,298.15,[7.20758655e+00 1.49080353e+01 1.46487178e+01 3.96222565e+05],Spherical,1732.81,693.520035,0.22907,ATUYAR_clean,0.913106859429946
0,RSM0011,CO2,298.15,[4.11172461e+00 1.51163520e+02 8.84042140e+00 7.39366560e+05],Spherical,1679.97,721.502512,0.35551,OLOKEF_clean,0.9122610143677
82,RSM0258,CO2,298.15,[3.72772606e+00 1.85723276e+02 7.44072605e+00 1.13224460e+06],Spherical,2007.54,595.094115,0.3167,DIKPOD_clean,0.911753587973693
232,RSM0594,CO2,298.15,[4.24276332e+00 1.00871049e+02 7.62557356e+00 7.45237120e+05],Spherical,1674.44,726.812068,0.2574,SABWEA_clean,0.91112037903013
112,RSM0322,CO2,298.15,[3.78028367e+00 3.25209270e+02 1.22819171e+01 5.12876090e+05],Spherical,1554.74,690.644955,0.33544,QEKLID01_clean,0.908122598219525
962,RSM2636,CO2,298.15,[2.90388939e+00 5.71498848e+02 7.07627143e+00 4.99911217e+05],Spherical,1998.01,764.507039,0.19196,MIKJAR_clean,0.90749170929058
468,RSM1150,CO2,298.15,[7.54568228e+00 1.00000001e+01 1.37270838e+01 5.51445952e+05],Spherical,1643.92,791.965931,0.25938,VIPYOK_clean,0.905615757803867
1138,RSM3148,CO2,298.15,[4.40243454e+00 2.01618003e+02 1.62312434e+01 2.39601216e+05],Spherical,1379.86,910.74709,0.12287,CUCTAX_clean,0.900671745372016
