,value
p_des_in_Pa,1117.6830768539548
sigma,5.19755868
epsilon,63.0281973
rho,0.08
pore_size_in_Angstrom,7.36964017
specific_surface_area_in_m^2/kg,749981.267
specific_work_in_kJ/kg,478.77367064339654
purity,0.8999998635261193
recovery,0.0
