,value
p_des_in_Pa,479.1957845359181
sigma,6.66117357
epsilon,25.5656726
rho,0.08
pore_size_in_Angstrom,9.28500239
specific_surface_area_in_m^2/kg,1422594.91
specific_work_in_kJ/kg,593.507806205916
purity,0.9400019823759114
recovery,0.0
