,value
p_des_in_Pa,116.12883697702287
sigma,2.90388939
epsilon,571.498848
rho,0.08
pore_size_in_Angstrom,7.07627143
specific_surface_area_in_m^2/kg,499911.217
specific_work_in_kJ/kg,879.6859910671624
purity,0.9000037899355845
recovery,0.0
