,p_des_in_Pa,sigma,epsilon,rho,pore_size_in_Angstrom,specific_surface_area_in_m^2/kg,specific_work_in_kJ/kg,purity,recovery
value,1000.0,7.37114179,15.1327929,0.08,15.0432201,699312.116,457.78688292565016,0.9049778068992854,0.0
value,1099.999,7.37114179,15.1327929,0.08,15.0432201,699312.116,447.33785626830723,0.9024613372226463,0.0
value,1197.8071568843425,7.37114179,15.1327929,0.08,15.0432201,699312.116,438.1361240682834,0.9000374973969114,0.0
value,1297.8061568843423,7.37114179,15.1327929,0.08,15.0432201,699312.116,429.8221820449659,0.8974633497499209,0.0
value,1199.2638340870374,7.37114179,15.1327929,0.08,15.0432201,699312.116,438.00662157452757,0.9000039204181917,0.0
value,1299.2628340870374,7.37114179,15.1327929,0.08,15.0432201,699312.116,429.47292692207037,0.8975692076956561,0.0
value,1199.4248542743956,7.37114179,15.1327929,0.08,15.0432201,699312.116,437.98933030947103,0.9000058459705913,0.0
value,1299.4238542743956,7.37114179,15.1327929,0.08,15.0432201,699312.116,429.46686477904075,0.897556480414492,0.0
value,1099.4258542743953,7.37114179,15.1327929,0.08,15.0432201,699312.116,447.39849563296906,0.902473620448147,0.0
