,p_des_in_Pa,sigma,epsilon,rho,pore_size_in_Angstrom,specific_surface_area_in_m^2/kg,specific_work_in_kJ/kg,purity,recovery
value,6294.271337571991,6.66117357,25.5656726,0.08,9.28500239,1422594.91,286.8071832245638,0.8100005926029642,0.0
value,6394.270337571992,6.66117357,25.5656726,0.08,9.28500239,1422594.91,285.4395207657665,0.8075476475125736,0.0
value,3440.6115603034036,6.66117357,25.5656726,0.08,9.28500239,1422594.91,342.1854658473786,0.8727409267759736,0.0
value,3540.6105603034034,6.66117357,25.5656726,0.08,9.28500239,1422594.91,339.4070639800444,0.8706933597362558,0.0
value,3086.093222564641,6.66117357,25.5656726,0.08,9.28500239,1422594.91,352.8917131002703,0.879967962870761,0.0
value,3186.0922225646414,6.66117357,25.5656726,0.08,9.28500239,1422594.91,349.7252746185938,0.8779322842136519,0.0
value,3084.5194570414887,6.66117357,25.5656726,0.08,9.28500239,1422594.91,352.9425665107402,0.8799998631485441,0.0
value,3184.5184570414885,6.66117357,25.5656726,0.08,9.28500239,1422594.91,349.77411115437866,0.877964382440089,0.0
value,3084.512733809632,6.66117357,25.5656726,0.08,9.28500239,1422594.91,352.94309943962537,0.8799996471192574,0.0
