,value
p_des_in_Pa,7811.401804407924
sigma,6.66117357
epsilon,25.5656726
rho,0.08
pore_size_in_Angstrom,9.28500239
specific_surface_area_in_m^2/kg,1422594.91
specific_work_in_kJ/kg,268.3117122719201
purity,0.7700059266051245
recovery,0.0
