{
    "heat_source": {"temperature [°C]": 300.0, "specification": {"heat_capacity_rate [kW/K]": 4.63}, "min_approach_temperature [K]": 30.0},
    "min_heat_source_outlet_temperature [°C]": 200.0,
    "isentropic_turbine_efficiency": 0.85,
    "isentropic_pump_efficiency": 0.7,
    "min_abs_pressure [bar]": 1.0,
    "min_red_pressure": 1e-05,
    "max_abs_pressure [bar]": 50.0,
    "max_red_pressure": 0.8,
    "cooling": {"temperature [°C]": 80.0, "specification": "constant", "min_approach_temperature [K]": -0.0},
    "min_temperature_difference_recuperator [K]": 30.0,
    "min_heat_transfer_rate_recuperator [kW]": 5.0
}