60
bufogenin
C      14.661   -5.752   30.328
C      14.498   -5.799   28.800
O      15.249   -4.590   30.907
C      16.167   -5.639   30.604
C      13.768   -6.688   31.141
C      12.987   -9.037   31.368
C      15.752   -5.051   28.318
C      13.926   -8.111   30.596
C      16.824   -5.693   29.217
C      15.638   -3.571   28.577
C      13.399   -9.044   32.840
C      14.605   -7.257   28.344
C      16.425   -2.985   29.503
C      15.468   -0.895   29.081
C      14.716   -2.799   27.850
O      16.340   -1.669   29.749
C      13.595   -8.119   29.104
C      14.151   -6.669   32.621
C      13.007  -10.443   30.787
C      14.631   -1.461   28.102
C      13.237   -7.621   33.397
C      14.868   -9.447   32.971
O      15.406    0.299   29.320
C      13.205   -5.126   28.334
C      14.085  -11.286   31.465
C      15.267  -10.401   31.850
C      11.564   -8.484   31.275
O      16.350  -11.223   32.291
H      16.648   -6.188   31.413
H      12.729   -6.376   31.036
H      15.949   -5.250   27.264
H      14.955   -8.441   30.737
H      12.776   -9.734   33.408
H      17.744   -5.109   29.201
H      17.015   -6.724   28.918
H      14.400   -7.317   27.275
H      15.613   -7.623   28.539
H      17.134   -3.584   30.055
H      14.084   -3.257   27.104
H      13.636   -9.141   28.728
H      12.592   -7.719   28.953
H      15.187   -6.988   32.733
H      14.038   -5.658   33.012
H      12.034  -10.911   30.942
H      13.211  -10.389   29.718
H      13.930   -0.845   27.558
H      12.201   -7.303   33.285
H      13.511   -7.610   34.452
H      15.491   -8.554   32.920
H      15.022   -9.938   33.932
H      13.184   -4.095   28.687
H      13.162   -5.138   27.245
H      12.348   -5.666   28.738
H      13.672  -11.750   32.361
H      14.422  -12.063   30.779
H      15.583   -9.825   30.980
H      11.247   -8.470   30.233
H      10.890   -9.119   31.851
H      11.540   -7.471   31.677
H      16.029  -11.721   33.056
