{
  "annotations": {
    "list": [
      {
        "builtIn": 1,
        "datasource": {
          "type": "datasource",
          "uid": "grafana"
        },
        "enable": true,
        "hide": true,
        "iconColor": "rgba(0, 211, 255, 1)",
        "name": "Annotations & Alerts",
        "type": "dashboard"
      }
    ]
  },
  "editable": true,
  "fiscalYearStartMonth": 0,
  "graphTooltip": 0,
  "id": 7,
  "links": [],
  "panels": [
    {
      "datasource": {
        "type": "prometheus",
        "uid": "prometheus"
      },
      "fieldConfig": {
        "defaults": {
          "color": {
            "mode": "palette-classic"
          },
          "custom": {
            "axisBorderShow": false,
            "axisCenteredZero": false,
            "axisColorMode": "text",
            "axisLabel": "",
            "axisPlacement": "auto",
            "barAlignment": 0,
            "drawStyle": "line",
            "fillOpacity": 0,
            "gradientMode": "none",
            "hideFrom": {
              "legend": false,
              "tooltip": false,
              "viz": false
            },
            "insertNulls": false,
            "lineInterpolation": "linear",
            "lineWidth": 1,
            "pointSize": 5,
            "scaleDistribution": {
              "type": "linear"
            },
            "showPoints": "never",
            "spanNulls": false,
            "stacking": {
              "group": "A",
              "mode": "none"
            },
            "thresholdsStyle": {
              "mode": "off"
            }
          },
          "mappings": [],
          "min": 0,
          "thresholds": {
            "mode": "absolute",
            "steps": [
              {
                "color": "green",
                "value": null
              },
              {
                "color": "red",
                "value": 80
              }
            ]
          },
          "unit": "cpu"
        },
        "overrides": [
          {
            "matcher": {
              "id": "byName",
              "options": "{{pod}}"
            },
            "properties": [
              {
                "id": "color",
                "value": {
                  "fixedColor": "#3797d5",
                  "mode": "fixed"
                }
              }
            ]
          }
        ]
      },
      "gridPos": {
        "h": 7,
        "w": 8,
        "x": 0,
        "y": 0
      },
      "id": 2,
      "options": {
        "legend": {
          "calcs": [],
          "displayMode": "list",
          "placement": "bottom",
          "showLegend": false
        },
        "tooltip": {
          "mode": "multi",
          "sort": "none"
        }
      },
      "pluginVersion": "10.4.9",
      "targets": [
        {
          "datasource": {
            "type": "prometheus",
            "uid": "prometheus"
          },
          "editorMode": "code",
          "expr": "(sum(rate(container_cpu_cfs_throttled_seconds_total{namespace=~\"goemaxima\",container=\"\"}[$__rate_interval])) by (pod)) * on(pod) kube_pod_info{namespace=~\"goemaxima\"}",
          "interval": "",
          "legendFormat": "CFS throttled ({{pod}})",
          "range": true,
          "refId": "A"
        },
        {
          "datasource": {
            "type": "prometheus",
            "uid": "prometheus"
          },
          "editorMode": "code",
          "expr": "(sum(rate(container_cpu_system_seconds_total{namespace=~\"goemaxima\",container=\"\"}[$__rate_interval])) by (pod) OR sum(rate(windows_container_cpu_usage_seconds_kernelmode{namespace=~\"goemaxima\"}[$__rate_interval])) by (pod)) * on(pod) kube_pod_info{namespace=~\"goemaxima\"}",
          "interval": "",
          "legendFormat": "System ({{pod}})",
          "range": true,
          "refId": "B"
        },
        {
          "datasource": {
            "type": "prometheus",
            "uid": "prometheus"
          },
          "editorMode": "code",
          "expr": "(sum(rate(container_cpu_usage_seconds_total{namespace=~\"goemaxima\",container=\"\"}[$__rate_interval])) by (pod) OR sum(rate(windows_container_cpu_usage_seconds_total{namespace=~\"goemaxima\"}[$__rate_interval])) by (pod)) * on(pod) kube_pod_info{namespace=~\"goemaxima\"}",
          "interval": "",
          "legendFormat": "Total ({{pod}})",
          "range": true,
          "refId": "C"
        },
        {
          "datasource": {
            "type": "prometheus",
            "uid": "prometheus"
          },
          "editorMode": "code",
          "expr": "(sum(rate(container_cpu_user_seconds_total{namespace=~\"goemaxima\",container=\"\"}[$__rate_interval])) by (pod) OR sum(rate(windows_container_cpu_usage_seconds_usermode{namespace=~\"goemaxima\"}[$__rate_interval])) by (pod)) * on(pod) kube_pod_info{namespace=~\"goemaxima\"}",
          "interval": "",
          "legendFormat": "User ({{pod}})",
          "range": true,
          "refId": "D"
        }
      ],
      "title": "CPU Utilization",
      "type": "timeseries"
    },
    {
      "datasource": {
            "type": "prometheus",
            "uid": "prometheus"
      },
      "fieldConfig": {
        "defaults": {
          "color": {
            "mode": "palette-classic"
          },
          "custom": {
            "axisBorderShow": false,
            "axisCenteredZero": false,
            "axisColorMode": "text",
            "axisLabel": "",
            "axisPlacement": "auto",
            "barAlignment": 0,
            "drawStyle": "line",
            "fillOpacity": 0,
            "gradientMode": "none",
            "hideFrom": {
              "legend": false,
              "tooltip": false,
              "viz": false
            },
            "insertNulls": false,
            "lineInterpolation": "linear",
            "lineWidth": 1,
            "pointSize": 5,
            "scaleDistribution": {
              "type": "linear"
            },
            "showPoints": "never",
            "spanNulls": false,
            "stacking": {
              "group": "A",
              "mode": "none"
            },
            "thresholdsStyle": {
              "mode": "off"
            }
          },
          "decimals": 1,
          "mappings": [],
          "min": 0,
          "thresholds": {
            "mode": "absolute",
            "steps": [
              {
                "color": "green",
                "value": null
              },
              {
                "color": "red",
                "value": 80
              }
            ]
          },
          "unit": "bytes"
        },
        "overrides": [
          {
            "matcher": {
              "id": "byName",
              "options": "{{pod}}"
            },
            "properties": [
              {
                "id": "color",
                "value": {
                  "fixedColor": "#3797d5",
                  "mode": "fixed"
                }
              }
            ]
          }
        ]
      },
      "gridPos": {
        "h": 7,
        "w": 8,
        "x": 8,
        "y": 0
      },
      "id": 4,
      "options": {
        "legend": {
          "calcs": [],
          "displayMode": "list",
          "placement": "bottom",
          "showLegend": false
        },
        "tooltip": {
          "mode": "multi",
          "sort": "none"
        }
      },
      "pluginVersion": "10.4.9",
      "targets": [
        {
          "datasource": {
              "type": "prometheus",
              "uid": "prometheus"
          },
          "editorMode": "code",
          "expr": "(sum(container_memory_working_set_bytes{namespace=~\"goemaxima\",container=\"\"} OR windows_container_memory_usage_commit_bytes{namespace=~\"goemaxima\"}) by (pod)) * on(pod) kube_pod_info{namespace=~\"goemaxima\"}",
          "interval": "",
          "legendFormat": "({{pod}})",
          "range": true,
          "refId": "A"
        }
      ],
      "title": "Memory Utilization",
      "type": "timeseries"
    },
    {
      "datasource": {
        "type": "prometheus",
        "uid": "prometheus"
      },
      "fieldConfig": {
        "defaults": {
          "color": {
            "mode": "palette-classic"
          },
          "custom": {
            "axisBorderShow": false,
            "axisCenteredZero": false,
            "axisColorMode": "text",
            "axisLabel": "",
            "axisPlacement": "auto",
            "barAlignment": 0,
            "drawStyle": "line",
            "fillOpacity": 0,
            "gradientMode": "none",
            "hideFrom": {
              "legend": false,
              "tooltip": false,
              "viz": false
            },
            "insertNulls": false,
            "lineInterpolation": "linear",
            "lineWidth": 1,
            "pointSize": 5,
            "scaleDistribution": {
              "type": "linear"
            },
            "showPoints": "never",
            "spanNulls": false,
            "stacking": {
              "group": "A",
              "mode": "none"
            },
            "thresholdsStyle": {
              "mode": "off"
            }
          },
          "decimals": 1,
          "mappings": [],
          "min": 0,
          "thresholds": {
            "mode": "absolute",
            "steps": [
              {
                "color": "green",
                "value": null
              },
              {
                "color": "red",
                "value": 80
              }
            ]
          },
          "unit": "pps"
        },
        "overrides": [
          {
            "matcher": {
              "id": "byName",
              "options": "{{pod}}"
            },
            "properties": [
              {
                "id": "color",
                "value": {
                  "fixedColor": "#3797d5",
                  "mode": "fixed"
                }
              }
            ]
          }
        ]
      },
      "gridPos": {
        "h": 7,
        "w": 8,
        "x": 16,
        "y": 0
      },
      "id": 7,
      "options": {
        "legend": {
          "calcs": [],
          "displayMode": "list",
          "placement": "bottom",
          "showLegend": false
        },
        "tooltip": {
          "mode": "multi",
          "sort": "none"
        }
      },
      "pluginVersion": "10.4.9",
      "targets": [
        {
          "datasource": {
            "type": "prometheus",
            "uid": "prometheus"
          },
          "editorMode": "code",
          "expr": "(sum(irate(container_network_receive_packets_total{namespace=~\"goemaxima\"}[$__rate_interval])) by (pod) OR sum(irate(windows_container_network_receive_packets_total{namespace=~\"goemaxima\"}[$__rate_interval])) by (pod)) * on(pod) kube_pod_info{namespace=~\"goemaxima\"}",
          "interval": "",
          "legendFormat": "Receive Total ({{pod}})",
          "range": true,
          "refId": "A"
        },
        {
          "datasource": {
            "type": "prometheus",
            "uid": "prometheus"
          },
          "editorMode": "code",
          "expr": "(sum(irate(container_network_transmit_packets_total{namespace=~\"goemaxima\"}[$__rate_interval])) by (pod) OR sum(irate(windows_container_network_transmit_packets_total{namespace=~\"goemaxima\"}[$__rate_interval])) by (pod)) * on(pod) kube_pod_info{namespace=~\"goemaxima\"}",
          "interval": "",
          "legendFormat": "Transmit Total ({{pod}})",
          "range": true,
          "refId": "B"
        },
        {
          "datasource": {
            "type": "prometheus",
            "uid": "prometheus"
          },
          "editorMode": "code",
          "expr": "(sum(irate(container_network_receive_packets_dropped_total{namespace=~\"goemaxima\"}[$__rate_interval])) by (pod) OR sum(irate(windows_container_network_receive_packets_dropped_total{namespace=~\"goemaxima\"}[$__rate_interval])) by (pod)) * on(pod) kube_pod_info{namespace=~\"goemaxima\"}",
          "interval": "",
          "legendFormat": "Receive Dropped ({{pod}})",
          "range": true,
          "refId": "C"
        },
        {
          "datasource": {
            "type": "prometheus",
            "uid": "prometheus"
          },
          "editorMode": "code",
          "expr": "(sum(irate(container_network_receive_errors_total{namespace=~\"goemaxima\"}[$__rate_interval])) by (pod)) * on(pod) kube_pod_info{namespace=~\"goemaxima\"}",
          "interval": "",
          "legendFormat": "Receive Errors ({{pod}})",
          "range": true,
          "refId": "D"
        },
        {
          "datasource": {
            "type": "prometheus",
            "uid": "prometheus"
          },
          "editorMode": "code",
          "expr": "(sum(irate(container_network_transmit_errors_total{namespace=~\"goemaxima\"}[$__rate_interval])) by (pod)) * on(pod) kube_pod_info{namespace=~\"goemaxima\"}",
          "interval": "",
          "legendFormat": "Transmit Errors ({{pod}})",
          "range": true,
          "refId": "E"
        },
        {
          "datasource": {
            "type": "prometheus",
            "uid": "prometheus"
          },
          "editorMode": "code",
          "expr": "(sum(irate(container_network_transmit_packets_dropped_total{namespace=~\"goemaxima\"}[$__rate_interval])) by (pod) OR sum(irate(windows_container_network_transmit_packets_dropped_total{namespace=~\"goemaxima\"}[$__rate_interval])) by (pod)) * on(pod) kube_pod_info{namespace=~\"goemaxima\"}",
          "interval": "",
          "legendFormat": "Transmit Dropped ({{pod}})",
          "range": true,
          "refId": "F"
        }
      ],
      "title": "Network Traffic",
      "type": "timeseries"
    },
    {
      "datasource": {
        "type": "prometheus",
        "uid": "prometheus"
      },
      "fieldConfig": {
        "defaults": {
          "color": {
            "mode": "palette-classic"
          },
          "custom": {
            "axisBorderShow": false,
            "axisCenteredZero": false,
            "axisColorMode": "text",
            "axisLabel": "",
            "axisPlacement": "auto",
            "barAlignment": 0,
            "drawStyle": "line",
            "fillOpacity": 0,
            "gradientMode": "none",
            "hideFrom": {
              "legend": false,
              "tooltip": false,
              "viz": false
            },
            "insertNulls": false,
            "lineInterpolation": "linear",
            "lineWidth": 1,
            "pointSize": 5,
            "scaleDistribution": {
              "type": "linear"
            },
            "showPoints": "never",
            "spanNulls": false,
            "stacking": {
              "group": "A",
              "mode": "none"
            },
            "thresholdsStyle": {
              "mode": "off"
            }
          },
          "decimals": 1,
          "mappings": [],
          "min": 0,
          "thresholds": {
            "mode": "absolute",
            "steps": [
              {
                "color": "green",
                "value": null
              },
              {
                "color": "red",
                "value": 80
              }
            ]
          },
          "unit": "Bps"
        },
        "overrides": [
          {
            "matcher": {
              "id": "byName",
              "options": "{{pod}}"
            },
            "properties": [
              {
                "id": "color",
                "value": {
                  "fixedColor": "#3797d5",
                  "mode": "fixed"
                }
              }
            ]
          }
        ]
      },
      "gridPos": {
        "h": 7,
        "w": 8,
        "x": 0,
        "y": 7
      },
      "id": 8,
      "options": {
        "legend": {
          "calcs": [],
          "displayMode": "list",
          "placement": "bottom",
          "showLegend": false
        },
        "tooltip": {
          "mode": "multi",
          "sort": "none"
        }
      },
      "pluginVersion": "10.4.9",
      "targets": [
        {
          "datasource": {
              "type": "prometheus",
              "uid": "prometheus"
          },
          "editorMode": "code",
          "expr": "(sum(irate(container_network_receive_bytes_total{namespace=~\"goemaxima\"}[$__rate_interval])) by (pod) OR sum(irate(windows_container_network_receive_bytes_total{namespace=~\"goemaxima\"}[$__rate_interval])) by (pod)) * on(pod) kube_pod_info{namespace=~\"goemaxima\"}",
          "interval": "",
          "legendFormat": "Receive Total ({{pod}})",
          "range": true,
          "refId": "A"
        },
        {
          "datasource": {
              "type": "prometheus",
              "uid": "prometheus"
          },
          "editorMode": "code",
          "expr": "(sum(irate(container_network_transmit_bytes_total{namespace=~\"goemaxima\"}[$__rate_interval])) by (pod) OR sum(irate(windows_container_network_transmit_bytes_total{namespace=~\"goemaxima\"}[$__rate_interval])) by (pod)) * on(pod) kube_pod_info{namespace=~\"goemaxima\"}",
          "interval": "",
          "legendFormat": "Transmit Total ({{pod}})",
          "range": true,
          "refId": "B"
        }
      ],
      "title": "Network I/O",
      "type": "timeseries"
    },
    {
      "datasource": {
        "type": "prometheus",
        "uid": "prometheus"
      },
      "fieldConfig": {
        "defaults": {
          "color": {
            "mode": "palette-classic"
          },
          "custom": {
            "axisBorderShow": false,
            "axisCenteredZero": false,
            "axisColorMode": "text",
            "axisLabel": "",
            "axisPlacement": "auto",
            "barAlignment": 0,
            "drawStyle": "line",
            "fillOpacity": 0,
            "gradientMode": "none",
            "hideFrom": {
              "legend": false,
              "tooltip": false,
              "viz": false
            },
            "insertNulls": false,
            "lineInterpolation": "linear",
            "lineWidth": 1,
            "pointSize": 5,
            "scaleDistribution": {
              "type": "linear"
            },
            "showPoints": "never",
            "spanNulls": false,
            "stacking": {
              "group": "A",
              "mode": "none"
            },
            "thresholdsStyle": {
              "mode": "off"
            }
          },
          "decimals": 1,
          "mappings": [],
          "min": 0,
          "thresholds": {
            "mode": "absolute",
            "steps": [
              {
                "color": "green",
                "value": null
              },
              {
                "color": "red",
                "value": 80
              }
            ]
          },
          "unit": "Bps"
        },
        "overrides": [
          {
            "matcher": {
              "id": "byName",
              "options": "{{pod}}"
            },
            "properties": [
              {
                "id": "color",
                "value": {
                  "fixedColor": "#3797d5",
                  "mode": "fixed"
                }
              }
            ]
          }
        ]
      },
      "gridPos": {
        "h": 7,
        "w": 8,
        "x": 8,
        "y": 7
      },
      "id": 6,
      "options": {
        "legend": {
          "calcs": [],
          "displayMode": "list",
          "placement": "bottom",
          "showLegend": false
        },
        "tooltip": {
          "mode": "multi",
          "sort": "none"
        }
      },
      "pluginVersion": "10.4.9",
      "targets": [
        {
          "datasource": {
              "type": "prometheus",
              "uid": "prometheus"
          },
          "editorMode": "code",
          "expr": "(sum(rate(container_fs_writes_bytes_total{namespace=~\"goemaxima\"}[$__rate_interval])) by (pod)) * on(pod) kube_pod_info{namespace=~\"goemaxima\"}",
          "interval": "",
          "legendFormat": "Write ({{pod}})",
          "range": true,
          "refId": "A"
        },
        {
          "datasource": {
              "type": "prometheus",
              "uid": "prometheus"
          },
          "editorMode": "code",
          "expr": "(sum(rate(container_fs_reads_bytes_total{namespace=~\"goemaxima\"}[$__rate_interval])) by (pod)) * on(pod) kube_pod_info{namespace=~\"goemaxima\"}",
          "interval": "",
          "legendFormat": "Read ({{pod}})",
          "range": true,
          "refId": "B"
        }
      ],
      "title": "Disk I/O",
      "type": "timeseries"
    }
  ],
  "refresh": "30s",
  "schemaVersion": 39,
  "tags": [],
  "templating": {
    "list": []
  },
  "time": {
    "from": "now-1h",
    "to": "now"
  },
  "timepicker": {
    "refresh_intervals": [
      "5s",
      "10s",
      "30s",
      "1m",
      "5m",
      "15m",
      "30m",
      "1h",
      "2h",
      "1d"
    ]
  },
  "timezone": "",
  "title": "Goemaxima",
  "uid": "goemxima-1",
  "version": 1,
  "weekStart": ""
}
