{
    "tests": [
        {
            "name": "Public Tests",
            "visibility": "visible",
            "output": "q1 results: All test cases passed!\n\nq2 results: All test cases passed!\n\nq3 results:\n    q3 - 1 result:\n        \u274c Test case failed\n        Trying:\n            len(data['flavor'].unique()) == 4\n        Expecting:\n            True\n        **********************************************************************\n        Line 1, in q3 0\n        Failed example:\n            len(data['flavor'].unique()) == 4\n        Exception raised:\n            Traceback (most recent call last):\n              File \"/opt/conda/lib/python3.10/doctest.py\", line 1350, in __run\n                exec(compile(example.source, filename, \"single\",\n              File \"<doctest q3 0[0]>\", line 1, in <module>\n                len(data['flavor'].unique()) == 4\n            TypeError: 'ellipsis' object is not subscriptable\n\n    q3 - 2 result:\n        \u274c Test case failed\n        Trying:\n            for l in ['chocolate', 'vanilla', 'strawberry', 'mint']:\n                assert l in data['flavor'].unique()\n        Expecting nothing\n        **********************************************************************\n        Line 1, in q3 1\n        Failed example:\n            for l in ['chocolate', 'vanilla', 'strawberry', 'mint']:\n                assert l in data['flavor'].unique()\n        Exception raised:\n            Traceback (most recent call last):\n              File \"/opt/conda/lib/python3.10/doctest.py\", line 1350, in __run\n                exec(compile(example.source, filename, \"single\",\n              File \"<doctest q3 1[0]>\", line 2, in <module>\n                assert l in data['flavor'].unique()\n            TypeError: 'ellipsis' object is not subscriptable\n\n    q3 - 3 result:\n        \u274c Test case failed\n        Trying:\n            assert type(price_by_flavor) == pd.Series\n        Expecting nothing\n        **********************************************************************\n        Line 1, in q3 2\n        Failed example:\n            assert type(price_by_flavor) == pd.Series\n        Exception raised:\n            Traceback (most recent call last):\n              File \"/opt/conda/lib/python3.10/doctest.py\", line 1350, in __run\n                exec(compile(example.source, filename, \"single\",\n              File \"<doctest q3 2[0]>\", line 1, in <module>\n                assert type(price_by_flavor) == pd.Series\n            AssertionError\n\n    q3 - 4 result:\n        \u274c Test case failed\n        Trying:\n            assert len(price_by_flavor) == 4\n        Expecting nothing\n        **********************************************************************\n        Line 1, in q3 3\n        Failed example:\n            assert len(price_by_flavor) == 4\n        Exception raised:\n            Traceback (most recent call last):\n              File \"/opt/conda/lib/python3.10/doctest.py\", line 1350, in __run\n                exec(compile(example.source, filename, \"single\",\n              File \"<doctest q3 3[0]>\", line 1, in <module>\n                assert len(price_by_flavor) == 4\n            TypeError: object of type 'ellipsis' has no len()",
            "status": "failed"
        },
        {
            "name": "q1",
            "score": 1.0,
            "max_score": 1.0,
            "visibility": "hidden",
            "output": "q1 results: All test cases passed!"
        },
        {
            "name": "q2",
            "score": 1.0,
            "max_score": 1.0,
            "visibility": "hidden",
            "output": "q2 results: All test cases passed!"
        },
        {
            "name": "q3",
            "score": 0,
            "max_score": 1.0,
            "visibility": "hidden",
            "output": "q3 results:\n    q3 - 1 result:\n        \u274c Test case failed\n        Trying:\n            len(data['flavor'].unique()) == 4\n        Expecting:\n            True\n        **********************************************************************\n        Line 1, in q3 0\n        Failed example:\n            len(data['flavor'].unique()) == 4\n        Exception raised:\n            Traceback (most recent call last):\n              File \"/opt/conda/lib/python3.10/doctest.py\", line 1350, in __run\n                exec(compile(example.source, filename, \"single\",\n              File \"<doctest q3 0[0]>\", line 1, in <module>\n                len(data['flavor'].unique()) == 4\n            TypeError: 'ellipsis' object is not subscriptable\n\n    q3 - 2 result:\n        \u274c Test case failed\n        Trying:\n            for l in ['chocolate', 'vanilla', 'strawberry', 'mint']:\n                assert l in data['flavor'].unique()\n        Expecting nothing\n        **********************************************************************\n        Line 1, in q3 1\n        Failed example:\n            for l in ['chocolate', 'vanilla', 'strawberry', 'mint']:\n                assert l in data['flavor'].unique()\n        Exception raised:\n            Traceback (most recent call last):\n              File \"/opt/conda/lib/python3.10/doctest.py\", line 1350, in __run\n                exec(compile(example.source, filename, \"single\",\n              File \"<doctest q3 1[0]>\", line 2, in <module>\n                assert l in data['flavor'].unique()\n            TypeError: 'ellipsis' object is not subscriptable\n\n    q3 - 3 result:\n        \u274c Test case failed\n        Trying:\n            assert type(price_by_flavor) == pd.Series\n        Expecting nothing\n        **********************************************************************\n        Line 1, in q3 2\n        Failed example:\n            assert type(price_by_flavor) == pd.Series\n        Exception raised:\n            Traceback (most recent call last):\n              File \"/opt/conda/lib/python3.10/doctest.py\", line 1350, in __run\n                exec(compile(example.source, filename, \"single\",\n              File \"<doctest q3 2[0]>\", line 1, in <module>\n                assert type(price_by_flavor) == pd.Series\n            AssertionError\n\n    q3 - 4 result:\n        \u274c Test case failed\n        Trying:\n            assert len(price_by_flavor) == 4\n        Expecting nothing\n        **********************************************************************\n        Line 1, in q3 3\n        Failed example:\n            assert len(price_by_flavor) == 4\n        Exception raised:\n            Traceback (most recent call last):\n              File \"/opt/conda/lib/python3.10/doctest.py\", line 1350, in __run\n                exec(compile(example.source, filename, \"single\",\n              File \"<doctest q3 3[0]>\", line 1, in <module>\n                assert len(price_by_flavor) == 4\n            TypeError: object of type 'ellipsis' has no len()\n\n    q3 - 5 result:\n        \u274c Test case failed\n        Trying:\n            np.isclose(price_by_flavor['chocolate'], 3.33333333)\n        Expecting:\n            True\n        **********************************************************************\n        Line 1, in q3 4\n        Failed example:\n            np.isclose(price_by_flavor['chocolate'], 3.33333333)\n        Exception raised:\n            Traceback (most recent call last):\n              File \"/opt/conda/lib/python3.10/doctest.py\", line 1350, in __run\n                exec(compile(example.source, filename, \"single\",\n              File \"<doctest q3 4[0]>\", line 1, in <module>\n                np.isclose(price_by_flavor['chocolate'], 3.33333333)\n            TypeError: 'ellipsis' object is not subscriptable\n\n    q3 - 6 result:\n        \u274c Test case failed\n        Trying:\n            np.isclose(price_by_flavor['mint'], 4.5)\n        Expecting:\n            True\n        **********************************************************************\n        Line 1, in q3 5\n        Failed example:\n            np.isclose(price_by_flavor['mint'], 4.5)\n        Exception raised:\n            Traceback (most recent call last):\n              File \"/opt/conda/lib/python3.10/doctest.py\", line 1350, in __run\n                exec(compile(example.source, filename, \"single\",\n              File \"<doctest q3 5[0]>\", line 1, in <module>\n                np.isclose(price_by_flavor['mint'], 4.5)\n            TypeError: 'ellipsis' object is not subscriptable\n\n    q3 - 7 result:\n        \u274c Test case failed\n        Trying:\n            np.isclose(price_by_flavor['strawberry'], 3)\n        Expecting:\n            True\n        **********************************************************************\n        Line 1, in q3 6\n        Failed example:\n            np.isclose(price_by_flavor['strawberry'], 3)\n        Exception raised:\n            Traceback (most recent call last):\n              File \"/opt/conda/lib/python3.10/doctest.py\", line 1350, in __run\n                exec(compile(example.source, filename, \"single\",\n              File \"<doctest q3 6[0]>\", line 1, in <module>\n                np.isclose(price_by_flavor['strawberry'], 3)\n            TypeError: 'ellipsis' object is not subscriptable\n\n    q3 - 8 result:\n        \u274c Test case failed\n        Trying:\n            np.isclose(price_by_flavor['vanilla'], 1.75)\n        Expecting:\n            True\n        **********************************************************************\n        Line 1, in q3 7\n        Failed example:\n            np.isclose(price_by_flavor['vanilla'], 1.75)\n        Exception raised:\n            Traceback (most recent call last):\n              File \"/opt/conda/lib/python3.10/doctest.py\", line 1350, in __run\n                exec(compile(example.source, filename, \"single\",\n              File \"<doctest q3 7[0]>\", line 1, in <module>\n                np.isclose(price_by_flavor['vanilla'], 1.75)\n            TypeError: 'ellipsis' object is not subscriptable"
        }
    ]
}
