<?xml version="1.0" standalone="no"?>
<!DOCTYPE svg PUBLIC "-//W3C//DTD SVG 20010904//EN" "http://www.w3.org/TR/2001/REC-SVG-20010904/DTD/svg10.dtd">
<svg version="1.0" xmlns="http://www.w3.org/2000/svg" width="90%" height="50%" viewBox="0 0 110 110">
    <g class="svg-fill light" stroke-width="1">
        <rect x="5" y="5" width="100" height="80"/>
        <text x="6" y="3" fill="red" stroke="none" font-size="0.2em" font-family="arial">GLC E38.1</text>
        <path transform="translate(05,65)" d="M40,20 a20,20 0 0,1 -20,20"/>
        <line transform="translate(25,85)" x1="0" y1="0" x2="0" y2="20.5"/>
        <g stroke-width="0.5">
            <rect id="slabglc220" x="6" y="15" width="7" height="11" class="seat" />
            <rect id="slabglc221" x="6" y="39" width="7" height="11" class="seat" />
            <rect id="slabglc222" x="6" y="63" width="7" height="11" class="seat" />
            <rect id="slabglc219" x="50" y="6" width="11" height="7" class="seat" />
            <rect id="slabglc218" x="97" y="15" width="7" height="11" class="seat" />
            <rect id="slabglc227" x="97" y="39" width="7" height="11" class="seat" />
            <rect id="slabglc216" x="97" y="63" width="7" height="11" class="seat" />
        </g>
    </g>
</svg>