<?xml version="1.0" standalone="no"?>
<!DOCTYPE svg PUBLIC "-//W3C//DTD SVG 20010904//EN" "http://www.w3.org/TR/2001/REC-SVG-20010904/DTD/svg10.dtd">
<svg version="1.0" xmlns="http://www.w3.org/2000/svg" width="90%" height="50%" viewBox="0 0 110 110">
    <g class="svg-fill light" stroke-width="1">
        <rect x="5" y="5" width="100" height="80"/>
        <text x="6" y="3" fill="red" stroke="none" font-size="0.2em" font-family="arial">HG G26.1</text>
        <path transform="translate(45,65)" d="M40,20 a20,20 0 0,1 -20,20"/>
        <line transform="translate(65,85)" x1="0" y1="0" x2="0" y2="20.5"/>
        <g stroke-width="0.5">
            <rect id="slabhgg195" x="10" y="6" width="11" height="7" class="seat" />
            <rect id="slabhgg194" x="26" y="6" width="11" height="7" class="seat" />
            <rect id="slabhgg193" x="42" y="6" width="11" height="7" class="seat" />
            <rect id="slabhgg192" x="58" y="6" width="11" height="7" class="seat" />
            <rect id="slabhgg191" x="74" y="6" width="11" height="7" class="seat" />
            <rect id="slabhgg190" x="90" y="6" width="11" height="7" class="seat" />
        </g>
    </g>
</svg>