<?xml version="1.0" standalone="no"?>
<!DOCTYPE svg PUBLIC "-//W3C//DTD SVG 20010904//EN" "http://www.w3.org/TR/2001/REC-SVG-20010904/DTD/svg10.dtd">
<svg version="1.0" xmlns="http://www.w3.org/2000/svg" width="90%" height="50%" viewBox="0 0 350 350">
    <g class="svg-fill light" stroke-width="1" transform="translate(100,0)">
        <text x="6" y="3" fill="red" stroke="none" font-size="0.2em" font-family="arial">HG G1</text>
        <!-- Linie oben -->
        <line transform="translate(20,9)" x1="0" y1="0" x2="110" y2="0"/>
        
        <line transform="translate(20,9)" x1="0" y1="0" x2="-110" y2="101"/>
        <line transform="translate(130,9)" x1="0" y1="0" x2="110" y2="101"/>

        <line transform="translate(-90,110)" x1="0" y1="0" x2="0" y2="30"/>
        <line transform="translate(240,110)" x1="0" y1="0" x2="0" y2="30"/>

        <line transform="translate(-90,140)" x1="0" y1="0" x2="90" y2="40"/>
        <line transform="translate(240,140)" x1="0" y1="0" x2="-90" y2="40"/>

        <line transform="translate(0,180)" x1="0" y1="0" x2="0" y2="20"/>
        <line transform="translate(150,180)" x1="0" y1="0" x2="0" y2="20"/>
        <!-- Linie unten -->
        <line transform="translate(0,200)" x1="0" y1="0" x2="150" y2="0"/>
        <!-- Türen -->
        <path transform="translate(-10,180)" d="M40,20 a20,20 0 0,1 -20,20"/>
        <line transform="translate(10,200)" x1="0" y1="0" x2="0" y2="20.5"/>
        <path transform="translate(120,180)" d="M20,40 a20,20 0 0,1 -20,-20"/>
        <line transform="translate(140, 200)" x1="0" y1="0" x2="0" y2="20.5"/>

        <g stroke-width="0.5">
        <!-- Mitte -->
            <rect id="slabhgg096" x="27" y="10" width="11" height="7" class="seat" />
            <rect id="slabhgg095" x="39" y="10" width="11" height="7" class="seat" />
            <rect id="slabhgg094" x="51" y="10" width="11" height="7" class="seat" />
            <rect id="slabhgg093" x="63" y="10" width="11" height="7" class="seat" />
            <rect id="slabhgg092" x="75" y="10" width="11" height="7" class="seat" />
            <rect id="slabhgg091" x="87" y="10" width="11" height="7" class="seat" />
            <rect id="slabhgg090" x="99" y="10" width="11" height="7" class="seat" />
            <rect id="slabhgg089" x="111" y="10" width="11" height="7" class="seat" />

            <rect id="slabhgg081" x="33" y="32" width="11" height="7" class="seat" />
            <rect id="slabhgg082" x="45" y="32" width="11" height="7" class="seat" />
            <rect id="slabhgg083" x="57" y="32" width="11" height="7" class="seat" />
            <rect id="slabhgg084" x="69" y="32" width="11" height="7" class="seat" />
            <rect id="slabhgg085" x="81" y="32" width="11" height="7" class="seat" />
            <rect id="slabhgg086" x="93" y="32" width="11" height="7" class="seat" />
            <rect id="slabhgg087" x="105" y="32" width="11" height="7" class="seat" />

            <rect id="slabhgg080" x="33" y="40" width="11" height="7" class="seat" />
            <rect id="slabhgg079" x="45" y="40" width="11" height="7" class="seat" />
            <rect id="slabhgg078" x="57" y="40" width="11" height="7" class="seat" />
            <rect id="slabhgg077" x="69" y="40" width="11" height="7" class="seat" />
            <rect id="slabhgg076" x="81" y="40" width="11" height="7" class="seat" />
            <rect id="slabhgg075" x="93" y="40" width="11" height="7" class="seat" />
            <rect id="slabhgg074" x="105" y="40" width="11" height="7" class="seat" />

            <rect id="slabhgg067" x="33" y="60" width="11" height="7" class="seat" />
            <rect id="slabhgg068" x="45" y="60" width="11" height="7" class="seat" />
            <rect id="slabhgg069" x="57" y="60" width="11" height="7" class="seat" />
            <rect id="slabhgg070" x="69" y="60" width="11" height="7" class="seat" />
            <rect id="slabhgg071" x="81" y="60" width="11" height="7" class="seat" />
            <rect id="slabhgg072" x="93" y="60" width="11" height="7" class="seat" />
            <rect id="slabhgg073" x="105" y="60" width="11" height="7" class="seat" />

            <rect id="slabhgg066" x="33" y="68" width="11" height="7" class="seat" />
            <rect id="slabhgg065" x="45" y="68" width="11" height="7" class="seat" />
            <rect id="slabhgg064" x="57" y="68" width="11" height="7" class="seat" />
            <rect id="slabhgg063" x="69" y="68" width="11" height="7" class="seat" />
            <rect id="slabhgg062" x="81" y="68" width="11" height="7" class="seat" />
            <rect id="slabhgg061" x="93" y="68" width="11" height="7" class="seat" />
            <rect id="slabhgg060" x="105" y="68" width="11" height="7" class="seat" />

            <rect id="slabhgg053" x="33" y="88" width="11" height="7" class="seat" />
            <rect id="slabhgg054" x="45" y="88" width="11" height="7" class="seat" />
            <rect id="slabhgg055" x="57" y="88" width="11" height="7" class="seat" />
            <rect id="slabhgg056" x="69" y="88" width="11" height="7" class="seat" />
            <rect id="slabhgg057" x="81" y="88" width="11" height="7" class="seat" />
            <rect id="slabhgg058" x="93" y="88" width="11" height="7" class="seat" />
            <rect id="slabhgg059" x="105" y="88" width="11" height="7" class="seat" />

            <rect id="slabhgg052" x="33" y="96" width="11" height="7" class="seat" />
            <rect id="slabhgg051" x="45" y="96" width="11" height="7" class="seat" />
            <rect id="slabhgg050" x="57" y="96" width="11" height="7" class="seat" />
            <rect id="slabhgg049" x="69" y="96" width="11" height="7" class="seat" />
            <rect id="slabhgg048" x="81" y="96" width="11" height="7" class="seat" />
            <rect id="slabhgg047" x="93" y="96" width="11" height="7" class="seat" />
            <rect id="slabhgg046" x="105" y="96" width="11" height="7" class="seat" />

            <rect id="slabhgg040" x="39" y="116" width="11" height="7" class="seat" />
            <rect id="slabhgg041" x="51" y="116" width="11" height="7" class="seat" />
            <rect id="slabhgg042" x="63" y="116" width="11" height="7" class="seat" />
            <rect id="slabhgg043" x="75" y="116" width="11" height="7" class="seat" />
            <rect id="slabhgg044" x="87" y="116" width="11" height="7" class="seat" />
            <rect id="slabhgg045" x="99" y="116" width="11" height="7" class="seat" />

            <rect id="slabhgg039" x="39" y="124" width="11" height="7" class="seat" />
            <rect id="slabhgg038" x="51" y="124" width="11" height="7" class="seat" />
            <rect id="slabhgg037" x="63" y="124" width="11" height="7" class="seat" />
            <rect id="slabhgg036" x="75" y="124" width="11" height="7" class="seat" />
            <rect id="slabhgg035" x="87" y="124" width="11" height="7" class="seat" />
            <rect id="slabhgg034" x="99" y="124" width="11" height="7" class="seat" />

            <rect id="slabhgg027" x="33" y="144" width="11" height="7" class="seat" />
            <rect id="slabhgg028" x="45" y="144" width="11" height="7" class="seat" />
            <rect id="slabhgg029" x="57" y="144" width="11" height="7" class="seat" />
            <rect id="slabhgg030" x="69" y="144" width="11" height="7" class="seat" />
            <rect id="slabhgg031" x="81" y="144" width="11" height="7" class="seat" />
            <rect id="slabhgg032" x="93" y="144" width="11" height="7" class="seat" />
            <rect id="slabhgg033" x="105" y="144" width="11" height="7" class="seat" />
                      
            <rect id="slabhgg026" x="33" y="152" width="11" height="7" class="seat" />
            <rect id="slabhgg025" x="45" y="152" width="11" height="7" class="seat" />
            <rect id="slabhgg024" x="57" y="152" width="11" height="7" class="seat" />
            <rect id="slabhgg023" x="69" y="152" width="11" height="7" class="seat" />
            <rect id="slabhgg022" x="81" y="152" width="11" height="7" class="seat" />
            <rect id="slabhgg021" x="93" y="152" width="11" height="7" class="seat" />
            <rect id="slabhgg020" x="105" y="152" width="11" height="7" class="seat" />

            <!-- Links -->
            <g transform="rotate(-43)">
            <rect id="slabhgg097" x="-6" y="21.5" width="11" height="7" class="seat" />
            <rect id="slabhgg143" x="-18" y="21.5" width="11" height="7" class="seat" />
            </g>
            <g transform="rotate(24)">          
            <rect id="slabhgg142" x="12" y="36" width="11" height="7" class="seat" />
            <rect id="slabhgg141" x="24" y="36" width="11" height="7" class="seat" />
            
            <rect id="slabhgg140" x="12" y="44" width="11" height="7" class="seat" />
            <rect id="slabhgg139" x="24" y="44" width="11" height="7" class="seat" />

            <rect id="slabhgg138" x="-2" y="66" width="11" height="7" class="seat" />           
            <rect id="slabhgg137" x="10" y="66" width="11" height="7" class="seat" />
            <rect id="slabhgg136" x="22" y="66" width="11" height="7" class="seat" />
            <rect id="slabhgg135" x="34" y="66" width="11" height="7" class="seat" />
            
            <rect id="slabhgg131" x="-2" y="74" width="11" height="7" class="seat" />
            <rect id="slabhgg132" x="10" y="74" width="11" height="7" class="seat" />
            <rect id="slabhgg133" x="22" y="74" width="11" height="7" class="seat" />
            <rect id="slabhgg134" x="34" y="74" width="11" height="7" class="seat" />

            <rect id="slabhgg130" x="-16" y="96" width="11" height="7" class="seat" />
            <rect id="slabhgg129" x="-4" y="96" width="11" height="7" class="seat" />
            <rect id="slabhgg128" x="8" y="96" width="11" height="7" class="seat" />
            <rect id="slabhgg127" x="20" y="96" width="11" height="7" class="seat" />
            <rect id="slabhgg126" x="32" y="96" width="11" height="7" class="seat" />
            <rect id="slabhgg125" x="44" y="96" width="11" height="7" class="seat" />
            
            <rect id="slabhgg119" x="-16" y="104" width="11" height="7" class="seat" />
            <rect id="slabhgg120" x="-4" y="104" width="11" height="7" class="seat" />
            <rect id="slabhgg121" x="8" y="104" width="11" height="7" class="seat" />
            <rect id="slabhgg122" x="20" y="104" width="11" height="7" class="seat" />
            <rect id="slabhgg123" x="32" y="104" width="11" height="7" class="seat" />
            <rect id="slabhgg124" x="44" y="104" width="11" height="7" class="seat" />

            <rect id="slabhgg118" x="-26" y="126" width="11" height="7" class="seat" />
            <rect id="slabhgg117" x="-14" y="126" width="11" height="7" class="seat" />
            <rect id="slabhgg116" x="-2" y="126" width="11" height="7" class="seat" />
            <rect id="slabhgg115" x="10" y="126" width="11" height="7" class="seat" />
            <rect id="slabhgg114" x="22" y="126" width="11" height="7" class="seat" />
            <rect id="slabhgg113" x="34" y="126" width="11" height="7" class="seat" />
            <rect id="slabhgg112" x="46" y="126" width="11" height="7" class="seat" />

            <rect id="slabhgg105" x="-26" y="134" width="11" height="7" class="seat" />
            <rect id="slabhgg106" x="-14" y="134" width="11" height="7" class="seat" />
            <rect id="slabhgg107" x="-2" y="134" width="11" height="7" class="seat" />
            <rect id="slabhgg108" x="10" y="134" width="11" height="7" class="seat" />
            <rect id="slabhgg109" x="22" y="134" width="11" height="7" class="seat" />
            <rect id="slabhgg110" x="34" y="134" width="11" height="7" class="seat" />
            <rect id="slabhgg111" x="46" y="134" width="11" height="7" class="seat" />

            <rect id="slabhgg104" x="-20" y="156" width="11" height="7" class="seat" />
            <rect id="slabhgg103" x="-8" y="156" width="11" height="7" class="seat" />
            <rect id="slabhgg102" x="4" y="156" width="11" height="7" class="seat" />
            <rect id="slabhgg101" x="16" y="156" width="11" height="7" class="seat" />
            <rect id="slabhgg100" x="28" y="156" width="11" height="7" class="seat" />
            <rect id="slabhgg099" x="40" y="156" width="11" height="7" class="seat" />
            <rect id="slabhgg098" x="52" y="156" width="11" height="7" class="seat" />
            </g>
            <!-- Rechts -->
            <g transform="rotate(43)">
            <rect id="slabhgg088" x="105" y="-81" width="11" height="7" class="seat" />
            <rect id="slabhgg189" x="117" y="-81" width="11" height="7" class="seat" />
            </g>
            <g transform="rotate(-24)">          
            <rect id="slabhgg187" x="102" y="97" width="11" height="7" class="seat" />
            <rect id="slabhgg188" x="114" y="97" width="11" height="7" class="seat" />
            
            <rect id="slabhgg186" x="102" y="105" width="11" height="7" class="seat" />
            <rect id="slabhgg185" x="114" y="105" width="11" height="7" class="seat" />

            <rect id="slabhgg181" x="92" y="127" width="11" height="7" class="seat" />           
            <rect id="slabhgg182" x="104" y="127" width="11" height="7" class="seat" />
            <rect id="slabhgg183" x="116" y="127" width="11" height="7" class="seat" />
            <rect id="slabhgg184" x="128" y="127" width="11" height="7" class="seat" />
            
            <rect id="slabhgg180" x="92" y="135" width="11" height="7" class="seat" />
            <rect id="slabhgg179" x="104" y="135" width="11" height="7" class="seat" />
            <rect id="slabhgg178" x="116" y="135" width="11" height="7" class="seat" />
            <rect id="slabhgg177" x="128" y="135" width="11" height="7" class="seat" />

            <rect id="slabhgg171" x="82" y="157" width="11" height="7" class="seat" />
            <rect id="slabhgg172" x="94" y="157" width="11" height="7" class="seat" />
            <rect id="slabhgg173" x="106" y="157" width="11" height="7" class="seat" />
            <rect id="slabhgg174" x="118" y="157" width="11" height="7" class="seat" />
            <rect id="slabhgg175" x="130" y="157" width="11" height="7" class="seat" />
            <rect id="slabhgg176" x="142" y="157" width="11" height="7" class="seat" />
            
            <rect id="slabhgg170" x="82" y="165" width="11" height="7" class="seat" />
            <rect id="slabhgg169" x="94" y="165" width="11" height="7" class="seat" />
            <rect id="slabhgg168" x="106" y="165" width="11" height="7" class="seat" />
            <rect id="slabhgg167" x="118" y="165" width="11" height="7" class="seat" />
            <rect id="slabhgg166" x="130" y="165" width="11" height="7" class="seat" />
            <rect id="slabhgg165" x="142" y="165" width="11" height="7" class="seat" />

            <rect id="slabhgg158" x="80" y="187" width="11" height="7" class="seat" />
            <rect id="slabhgg159" x="92" y="187" width="11" height="7" class="seat" />
            <rect id="slabhgg160" x="104" y="187" width="11" height="7" class="seat" />
            <rect id="slabhgg161" x="116" y="187" width="11" height="7" class="seat" />
            <rect id="slabhgg162" x="128" y="187" width="11" height="7" class="seat" />
            <rect id="slabhgg163" x="140" y="187" width="11" height="7" class="seat" />
            <rect id="slabhgg164" x="152" y="187" width="11" height="7" class="seat" />

            <rect id="slabhgg157" x="80" y="195" width="11" height="7" class="seat" />
            <rect id="slabhgg156" x="92" y="195" width="11" height="7" class="seat" />
            <rect id="slabhgg155" x="104" y="195" width="11" height="7" class="seat" />
            <rect id="slabhgg154" x="116" y="195" width="11" height="7" class="seat" />
            <rect id="slabhgg153" x="128" y="195" width="11" height="7" class="seat" />
            <rect id="slabhgg152" x="140" y="195" width="11" height="7" class="seat" />
            <rect id="slabhgg151" x="152" y="195" width="11" height="7" class="seat" />

            <rect id="slabhgg144" x="74" y="217" width="11" height="7" class="seat" />
            <rect id="slabhgg145" x="86" y="217" width="11" height="7" class="seat" />
            <rect id="slabhgg146" x="98" y="217" width="11" height="7" class="seat" />
            <rect id="slabhgg147" x="110" y="217" width="11" height="7" class="seat" />
            <rect id="slabhgg148" x="122" y="217" width="11" height="7" class="seat" />
            <rect id="slabhgg149" x="134" y="217" width="11" height="7" class="seat" />
            <rect id="slabhgg150" x="146" y="217" width="11" height="7" class="seat" />
            </g>
        </g>
    </g>
</svg>