<?xml version="1.0" standalone="no"?>
<!DOCTYPE svg PUBLIC "-//W3C//DTD SVG 20010904//EN" "http://www.w3.org/TR/2001/REC-SVG-20010904/DTD/svg10.dtd">
<svg version="1.0" xmlns="http://www.w3.org/2000/svg" width="90%" height="50%" viewBox="0 0 180 180">
    <g class="svg-fill light" stroke-width="1">
        <rect id="slabglc0" x="5" y="30" width="120" height="120"/>
        <text x="6" y="3" fill="red" stroke="none" font-size="0.2em" font-family="arial">GLC E24</text>
        
        <path transform="translate(-20,10)" d="M40,20 a20,20 0 0,1 20,-20"/>    
        <line transform="translate(40,10)" x1="0" y1="0" x2="0" y2="20.5"/>
        
        <path transform="translate(70,-30)" d="M20,40 a20,20 0 0,1 20,20"/>
        <line transform="translate(90,10)" x1="0" y1="0" x2="0" y2="20.5"/>
        
        <path transform="translate(70,130)" d="M40,20 a20,20 0 0,1 -20,20"/>    
        <line transform="translate(90,150)" x1="0" y1="0" x2="0" y2="20.5"/>

        <g stroke-width="0.5">
            <rect id="slabglc046" x="33" y="54" width="7" height="11" class="seat"/>
            <rect id="slabglc047" x="33" y="66" width="7" height="11" class="seat"/>
            <rect id="slabglc048" x="33" y="78" width="7" height="11" class="seat"/>
            <rect id="slabglc049" x="33" y="90" width="7" height="11" class="seat" />
            <rect id="slabglc050" x="33" y="102" width="7" height="11" class="seat" />
            <rect id="slabglc051" x="33" y="114" width="7" height="11" class="seat" />

            <rect id="slabglc045" x="41" y="54" width="7" height="11" class="seat" />
            <rect id="slabglc044" x="41" y="66" width="7" height="11" class="seat" />
            <rect id="slabglc043" x="41" y="78" width="7" height="11" class="seat" />
            <rect id="slabglc042" x="41" y="90" width="7" height="11" class="seat" />
            <rect id="slabglc041" x="41" y="102" width="7" height="11" class="seat" />
            <rect id="slabglc040" x="41" y="114" width="7" height="11" class="seat" />
            
            <rect id="slabglc034" x="61" y="54" width="7" height="11" class="seat" />
            <rect id="slabglc035" x="61" y="66" width="7" height="11" class="seat" />
            <rect id="slabglc036" x="61" y="78" width="7" height="11" class="seat" />
            <rect id="slabglc037" x="61" y="90" width="7" height="11" class="seat" />
            <rect id="slabglc038" x="61" y="102" width="7" height="11" class="seat" />
            <rect id="slabglc039" x="61" y="114" width="7" height="11" class="seat" />

            <rect id="slabglc033" x="69" y="54" width="7" height="11" class="seat" />
            <rect id="slabglc032" x="69" y="66" width="7" height="11" class="seat" />
            <rect id="slabglc031" x="69" y="78" width="7" height="11" class="seat" />
            <rect id="slabglc030" x="69" y="90" width="7" height="11" class="seat" />
            <rect id="slabglc029" x="69" y="102" width="7" height="11" class="seat" />
            <rect id="slabglc028" x="69" y="114" width="7" height="11" class="seat" />
            
            <rect id="slabglc022" x="89" y="54" width="7" height="11" class="seat" />
            <rect id="slabglc023" x="89" y="66" width="7" height="11" class="seat" />
            <rect id="slabglc024" x="89" y="78" width="7" height="11" class="seat" />
            <rect id="slabglc025" x="89" y="90" width="7" height="11" class="seat" />
            <rect id="slabglc026" x="89" y="102" width="7" height="11" class="seat" />
            <rect id="slabglc027" x="89" y="114" width="7" height="11" class="seat" />

            <rect id="slabglc021" x="97" y="54" width="7" height="11" class="seat" />
            <rect id="slabglc020" x="97" y="66" width="7" height="11" class="seat" />
            <rect id="slabglc019" x="97" y="78" width="7" height="11" class="seat" />
            <rect id="slabglc018" x="97" y="90" width="7" height="11" class="seat" />
            <rect id="slabglc017" x="97" y="102" width="7" height="11" class="seat" />
            <rect id="slabglc016" x="97" y="114" width="7" height="11" class="seat" />

            <rect id="slabglc010" x="117" y="54" width="7" height="11" class="seat" />
            <rect id="slabglc011" x="117" y="66" width="7" height="11" class="seat" />
            <rect id="slabglc012" x="117" y="78" width="7" height="11" class="seat" />
            <rect id="slabglc013" x="117" y="90" width="7" height="11" class="seat" />
            <rect id="slabglc014" x="117" y="102" width="7" height="11" class="seat" />
            <rect id="slabglc015" x="117" y="114" width="7" height="11" class="seat" />
        </g>
    </g>
</svg>