# File generated on 29.09.2022 at 12:04 using /media/mhlobil/Samsung_T5/Work/Python/Image_processing/affinity-hydration-model_v2.py
# File contains: calculated hydration time, heat rate, and cumul heat, Qpot=532 J 
#
# time[Hrs]	Qdot [W/g]	Q[J/g] 
##########################################################
0.00000000	0.00002180	0.00000000
2.05817441	0.00030669	2.27236181
3.16343262	0.00057110	4.54472362
3.93686285	0.00081612	6.81708543
4.54217915	0.00104278	9.08944724
5.04631627	0.00125206	11.36180905
5.48316861	0.00144491	13.63417085
5.87227477	0.00162221	15.90653266
6.22593074	0.00178482	18.17889447
6.55238337	0.00193355	20.45125628
6.85743879	0.00206917	22.72361809
7.14534463	0.00219242	24.99597990
7.41930684	0.00230401	27.26834171
7.68180898	0.00240460	29.54070352
7.93481800	0.00249482	31.81306533
8.17992182	0.00257528	34.08542714
8.41842414	0.00264656	36.35778894
8.65141148	0.00270921	38.63015075
8.87980173	0.00276374	40.90251256
9.10437993	0.00281065	43.17487437
9.32582523	0.00285042	45.44723618
9.54473141	0.00288348	47.71959799
9.76162280	0.00291027	49.99195980
9.97696677	0.00293118	52.26432161
10.19118363	0.00294660	54.53668342
10.40465459	0.00295690	56.80904523
10.61772819	0.00296241	59.08140704
10.83072559	0.00296347	61.35376884
11.04394490	0.00296039	63.62613065
11.25766484	0.00295345	65.89849246
11.47214773	0.00294295	68.17085427
11.68764210	0.00292913	70.44321608
11.90438487	0.00291226	72.71557789
12.12260321	0.00289257	74.98793970
12.34251619	0.00287028	77.26030151
12.56433616	0.00284560	79.53266332
12.78827001	0.00281874	81.80502513
13.01452028	0.00278988	84.07738693
13.24328606	0.00275920	86.34974874
13.47476393	0.00272688	88.62211055
13.70914873	0.00269306	90.89447236
13.94663422	0.00265790	93.16683417
14.18741378	0.00262153	95.43919598
14.43168101	0.00258410	97.71155779
14.67963024	0.00254573	99.98391960
14.93145709	0.00250653	102.25628141
15.18735895	0.00246662	104.52864322
15.44753544	0.00242609	106.80100503
15.71218883	0.00238505	109.07336683
15.98152453	0.00234359	111.34572864
16.25575141	0.00230179	113.61809045
16.53508228	0.00225973	115.89045226
16.81973426	0.00221749	118.16281407
17.10992915	0.00217513	120.43517588
17.40589385	0.00213273	122.70753769
17.70786069	0.00209033	124.97989950
18.01606787	0.00204801	127.25226131
18.33075983	0.00200581	129.52462312
18.65218761	0.00196377	131.79698492
18.98060930	0.00192195	134.06934673
19.31629038	0.00188039	136.34170854
19.65950417	0.00183912	138.61407035
20.01053226	0.00179818	140.88643216
20.36966489	0.00175760	143.15879397
20.73720143	0.00171741	145.43115578
21.11345082	0.00167764	147.70351759
21.49873204	0.00163831	149.97587940
21.89337462	0.00159945	152.24824121
22.29771907	0.00156107	154.52060302
22.71211749	0.00152320	156.79296482
23.13693402	0.00148585	159.06532663
23.57254548	0.00144902	161.33768844
24.01934188	0.00141275	163.61005025
24.47772707	0.00137703	165.88241206
24.94811935	0.00134188	168.15477387
25.43095212	0.00130731	170.42713568
25.92667461	0.00127332	172.69949749
26.43575251	0.00123991	174.97185930
26.95866880	0.00120710	177.24422111
27.49592447	0.00117488	179.51658291
28.04803938	0.00114326	181.78894472
28.61555309	0.00111224	184.06130653
29.19902573	0.00108182	186.33366834
29.79903899	0.00105200	188.60603015
30.41619705	0.00102277	190.87839196
31.05112764	0.00099414	193.15075377
31.70448311	0.00096611	195.42311558
32.37694154	0.00093866	197.69547739
33.06920795	0.00091180	199.96783920
33.78201556	0.00088553	202.24020101
34.51612705	0.00085983	204.51256281
35.27233598	0.00083471	206.78492462
36.05146825	0.00081015	209.05728643
36.85438355	0.00078615	211.32964824
37.68197706	0.00076271	213.60201005
38.53518107	0.00073981	215.87437186
39.41496677	0.00071746	218.14673367
40.32234615	0.00069564	220.41909548
41.25837396	0.00067435	222.69145729
42.22414976	0.00065358	224.96381910
43.22082019	0.00063332	227.23618090
44.24958122	0.00061356	229.50854271
45.31168065	0.00059431	231.78090452
46.40842066	0.00057553	234.05326633
47.54116059	0.00055724	236.32562814
48.71131979	0.00053942	238.59798995
49.92038071	0.00052207	240.87035176
51.16989215	0.00050517	243.14271357
52.46147265	0.00048871	245.41507538
53.79681420	0.00047270	247.68743719
55.17768602	0.00045711	249.95979899
56.60593871	0.00044195	252.23216080
58.08350855	0.00042720	254.50452261
59.61242217	0.00041285	256.77688442
61.19480140	0.00039890	259.04924623
62.83286849	0.00038534	261.32160804
64.52895169	0.00037216	263.59396985
66.28549109	0.00035935	265.86633166
68.10504499	0.00034690	268.13869347
69.99029653	0.00033482	270.41105528
71.94406086	0.00032307	272.68341709
73.96929279	0.00031167	274.95577889
76.06909493	0.00030061	277.22814070
78.24672638	0.00028986	279.50050251
80.50561208	0.00027943	281.77286432
82.84935277	0.00026932	284.04522613
85.28173566	0.00025950	286.31758794
87.80674593	0.00024998	288.58994975
90.42857902	0.00024075	290.86231156
93.15165381	0.00023180	293.13467337
95.98062683	0.00022312	295.40703518
98.92040759	0.00021471	297.67939698
101.97617497	0.00020656	299.95175879
105.15339502	0.00019867	302.22412060
108.45784007	0.00019102	304.49648241
111.89560944	0.00018361	306.76884422
115.47315183	0.00017644	309.04120603
119.19728953	0.00016949	311.31356784
123.07524468	0.00016277	313.58592965
127.11466777	0.00015626	315.85829146
131.32366863	0.00014997	318.13065327
135.71085011	0.00014388	320.40301508
140.28534481	0.00013798	322.67537688
145.05685507	0.00013229	324.94773869
150.03569683	0.00012678	327.22010050
155.23284740	0.00012145	329.49246231
160.65999797	0.00011631	331.76482412
166.32961118	0.00011133	334.03718593
172.25498445	0.00010653	336.30954774
178.45031963	0.00010188	338.58190955
184.93079995	0.00009740	340.85427136
191.71267506	0.00009307	343.12663317
198.81335511	0.00008889	345.39899497
206.25151531	0.00008486	347.67135678
214.04721207	0.00008097	349.94371859
222.22201256	0.00007721	352.21608040
230.79913936	0.00007359	354.48844221
239.80363251	0.00007010	356.76080402
249.26253144	0.00006673	359.03316583
259.20507978	0.00006349	361.30552764
269.66295653	0.00006036	363.57788945
280.67053786	0.00005734	365.85025126
292.26519438	0.00005444	368.12261307
304.48762998	0.00005164	370.39497487
317.38226908	0.00004895	372.66733668
330.99770121	0.00004636	374.93969849
345.38719299	0.00004387	377.21206030
360.60928045	0.00004147	379.48442211
376.72845699	0.00003916	381.75678392
393.81597634	0.00003694	384.02914573
411.95079419	0.00003481	386.30150754
431.22067821	0.00003276	388.57386935
451.72352394	0.00003079	390.84623116
473.56892407	0.00002889	393.11859296
496.88005189	0.00002708	395.39095477
521.79593747	0.00002533	397.66331658
548.47423907	0.00002366	399.93567839
577.09464483	0.00002205	402.20804020
607.86308480	0.00002051	404.48040201
641.01699651	0.00001904	406.75276382
676.83197668	0.00001762	409.02512563
715.63028127	0.00001627	411.29748744
757.79182606	0.00001497	413.56984925
803.76862571	0.00001373	415.84221106
854.10404645	0.00001254	418.11457286
909.45893568	0.00001140	420.38693467
970.64780223	0.00001032	422.65929648
1038.69007277	0.00000928	424.93165829
1114.88464772	0.00000828	427.20402010
1200.92173644	0.00000734	429.47638191
1299.05682448	0.00000643	431.74874372
1412.39337211	0.00000557	434.02110553
1545.36744238	0.00000475	436.29346734
1704.63618831	0.00000396	438.56582915
1900.85483013	0.00000322	440.83819095
2152.67485811	0.00000251	443.11055276
2497.40591182	0.00000183	445.38291457
3028.33236569	0.00000119	447.65527638
4118.61285918	0.00000058	449.92763819
5208.89335268	0.00000058	452.20000000
