## Data from Vinkler:2016ASCE
# days	RH_ambient
0.121	51.803
0.991	53.497
1.666	49.276
4.211	49.203
7.27	43.902
10.467	61.544
15.649	49.014
23.896	47.714
30.146	45.319
37.334	51.804
44.489	57.573
50.735	47.978
62.077	50.008
81.699	51.615
93.948	64.497
101.331	38.956
109.57	50.2
124.147	50.966
138.669	44.961
154.013	46.098
168.534	38.007
182.971	34.006
204.688	31.964
218.98	39.03
251.086	31.009
280.111	32.003
