#day	RH_ambient
0	28.5319
0.723	28.0282
1.611	27.4878
2.283	29.054
2.391	28.1472
3.065	30.5561
4.184	33.3954
4.393	28.0282
4.954	30.0249
5.963	33.0565
6.167	26.2879
7.734	30.1531
9.399	28.8891
9.623	29.7592
10.837	26.0406
14.067	28.3854
15.619	26.3795
18.392	23.8607
21.39	22.0655
24.048	18.1363
26.965	27.9182
28.736	24.8591
33.075	25.7658
34.514	23.3478
36.408	24.6667
38.63	24.0073
40.642	28.0648
43.625	20.7008
45.963	21.7633
46.846	19.4369
49.97	23.6134
51.739	19.7758
54.953	15.5992
55.983	26.4711
57.986	27.1397
60.223	32.3238
63.224	31.7926
65.979	22.148
66.882	27.2863
69.428	23.2379
71.924	41.9684
73.009	31.8201
75.252	38.9825
77.557	27.7167
79.783	28.4403
80.994	23.7234
83.111	25.2987
84.693	35.0807
86.472	34.7876
88.145	36.9675
90.568	27.9091
92.591	36.2531
95.122	26.1963
96.131	29.2005
98.571	27.0848
99.706	35.5845
102.963	48.0959
105.692	28.7975
107.839	41.5471
110.883	57.5206
112.86	48.0867
115.398	40.9792
117.054	36.2897
119.507	38.8909
123.166	34.7785
124.394	36.6652
126.762	49.1034
128.738	39.7244
131.988	49.3415
133.739	38.4879
135.993	49.8636
137.979	43.9285
139.113	52.4556
141.968	38.6253
143.204	43.7728
144.994	47.6929
146.003	50.7429
150.355	56.9436
154.298	34.1831
155.556	47.2624
159.223	46.3282
160.343	49.4423
162.106	43.4247
164.468	53.5547
166.895	46.3648
172.243	50.1017
174.343	45.2657
178.422	32.0582
180.813	53.2616
183.145	52.1992
184.594	53.6188
187.911	46.4472
190.361	47.7478
194.212	32.1498
196.456	40.045
199.002	35.4471
202.702	47.1616
207.03	44.0384
210.125	36.8942
211.256	44.2582
213.474	41.7852
216.963	57.8687
220.591	42.1333
221.949	51.1825
225.716	45.8977
227.633	56.1559
232.161	44.1758
235.041	40.0725
236.834	45.3573
243.77	61.2301
246.432	58.977
250.402	46.1633
252.643	52.6846
255.194	50.5047
259.731	42.0417
263.666	58.2351
266.911	66.2035
269.307	46.8777
272.265	30.2172
273.167	34.9708
274.304	44.3589
276.278	34.1923
281.184	39.0741
285.774	50.8803
287.211	47.9035
289.656	47.3998
294.618	31.3621
298.242	56.2933
301.327	45.6779
304.989	42.8477
305.909	54.3424
311.127	51.155
314.96	28.9074
320.795	48.8561
324.325	38.1765
328.358	49.543
330.754	30.5103
333.549	36.2439
339.021	45.2291
341.447	37.7094
343.565	39.7427
345.783	37.2606
346.907	42.1424
350.964	20.4169
352.322	29.0906
356.412	20.0689
362.565	34.4396
367.323	25.5002
370.976	19.0247
373.194	17.1013
377.807	37.4896
380.346	30.5744
383.823	41.6936
386.901	28.4678
389.474	34.1648
393.903	27.2588
396.92	32.8001
399.354	27.9549
403.612	40.4022
408.791	22.7891
410.814	30.84
413.363	27.6893
415.249	25.9673
416.489	32.2414
419.48	27.9915
421.154	30.4645
425.032	25.2713
426.93	28.1472
429.26	25.9673
431.272	30.0249
435.051	29.4478
436.402	35.6944
440.616	31.6643
442.2	41.8676
445.405	34.348
447.55	46.6396
450.408	34.2197
453.994	44.5238
457.324	42.6279
458.911	54.0402
461.517	30.1439
465.863	33.661
469.075	29.054
471.635	29.7959
472.842	23.705
477.223	40.7319
479.992	36.5279
484.476	50.4498
487.876	32.3971
492.467	44.4505
496.283	57.9511
499.167	55.2034
500.961	61.0561
502.841	57.0902
507.3	61.4316
510.139	41.7486
512.814	44.0384
515.511	54.8553
517.282	51.613
519.749	59.6181
521.389	49.0851
524.515	53.7379
526.74	54.1501
528.752	58.0885
531.51	49.772
534.971	55.1942
537.598	39.5229
540.149	36.8942
544.971	52.2724
549.29	45.861
550.317	55.8262
554.422	52.1351
558.001	59.8654
559.988	54.608
563.999	57.5023
565.861	46.9327
568.669	57.3649
572.539	49.1309
575.522	41.886
576.786	57.5573
578.992	50.5597
581.306	42.5546
585.562	54.3333
590.772	48.3157
592.579	58.7297
595.653	43.9376
600.24	54.3791
605.365	58.116
609.018	52.1076
610.218	43.214
611.714	62.2926
616.685	49.9185
619.365	54.1867
625.379	57.8687
627.722	61.0378
630.14	50.404
632.713	56.2292
636.452	40.164
640.827	55.011
643.838	58.345
646.592	48.5722
650.861	65.1594
653.175	56.852
656.799	39.8526
659.666	30.4828
663.355	37.9658
664.77	26.4894
666.119	31.9941
669.881	25.1155
672.706	42.0325
677.695	36.5187
678.938	43.9468
686.218	21.9923
688.351	29.5211
691.559	23.2746
693.342	24.7675
695.821	37.1415
701.021	27.0207
704.679	23.0456
711.95	39.4038
714.048	33.8717
717.353	22.1205
721.26	27.7076
723.007	15.6908
726.362	23.1097
728.566	15.4252
730.372	25.5185
736.798	16.9364
741.926	21.7358
747.253	17.66
752.96	31.5636
757.044	20.0872
759.615	25.1064
762.61	22.3403
766.09	34.8975
768.876	37.3797
772.318	35.2181
773.513	24.7217
776.087	30.8492
779.074	25.2804
781.991	34.9525
789.191	24.5202
793.23	38.2956
796.125	39.7427
800.789	37.4713
803.871	25.3354
806.797	38.8543
809.596	46.1358
812.025	39.6053
813.898	33.0474
816.82	44.6337
819.474	39.0558
821.685	34.2014
824.249	36.6927
826.771	23.3845
829.355	33.3679
834.221	23.1921
835.471	33.2672
838.793	28.3029
842.411	50.6971
847.139	30.5927
851.648	53.8845
854.184	45.5496
859.28	38.6253
860.178	41.5654
864.178	40.6678
864.857	44.9268
868.183	41.483
868.208	50.9627
870.832	33.9267
872.096	49.5155
876.622	36.9583
878.195	43.2415
881.071	37.1965
882.529	41.9409
883.319	46.4381
885.19	39.2206
890.109	49.2316
890.639	39.2023
893.869	41.4463
896.139	58.8579
901.327	44.5421
905.573	52.2816
908.576	52.5197
912.549	41.2631
915.478	55.4232
921.347	46.4106
925.602	57.7221
928.029	50.2391
932.386	57.8779
936.337	38.3231
940.273	54.9286
944.7	47.1158
947.515	60.5065
950.69	41.831
954.851	59.499
957.931	46.9418
961.185	58.0427
964.715	47.0792
974.417	57.8504
979.051	44.3315
987.096	58.9586
991.173	44.881
994.076	49.5797
996.955	44.8627
1008.659	55.7071
1012.298	44.3315
1016.549	53.7929
1020.503	35.2914
1030.866	43.7086
1035.061	32.3146
1036.741	36.6836
1041.067	32.8825
1046.871	41.08
1053.612	25.1247
1056.744	32.1773
1061.043	18.0722
1065.406	27.964
1070.289	24.5477
1075.653	34.5495
1081.408	24.3279
1088.34	38.8176
1090.433	31.014
1097.081	22.1113
1110.794	36.0699
1117.872	21.2687

