#time[day]	Temperature of ambient air [deg C]
0.0000	15.7
0.01824	15.7236
0.04077	15.8225
0.05954	16.0891
0.08207	16.2642
0.11103	16.3174
0.1459	16.2639
0.16682	16.3018
0.18773	16.4693
0.21348	16.8349
0.23976	17.109
0.26283	17.246
0.29018	17.4744
0.32237	17.7333
0.34543	17.8703
0.38459	17.9767
0.41302	18.0147
0.45593	17.7935
0.48221	17.5115
0.51225	17.1533
0.54389	16.9322
0.58359	16.8101
0.63132	16.7109
0.67692	16.5811
0.70964	16.4057
0.73485	16.238
0.76381	15.8874
0.79653	15.4911
0.8137	15.1558
0.84051	14.7139
0.87055	14.2795
0.89147	14.1042
0.92151	14.3935
0.94994	14.7895
0.97783	15.3683
1.01859	15.7719
1.05346	16.145
1.08564	16.5257
1.11675	16.9598
1.14035	17.173
1.17736	17.5461
1.20472	17.9192
1.24334	18.2542
1.27445	18.5816
1.31414	18.9014
1.35223	18.8784
1.38012	18.5202
1.41445	18.1848
1.44824	17.8494
1.47667	17.6284
1.51421	17.392
1.55122	17.1252
1.58448	16.8889
1.61237	16.6678
1.6467	16.4315
1.67513	16.2789
1.70302	16.1569
1.74218	16.1262
1.76685	15.8366
1.79206	15.547
1.82103	15.4707
1.86286	15.3257
1.91328	15.2569
1.95351	15.2567
1.98999	15.3099
2.03987	15.6829
2.07474	16.0408
2.10424	16.4977
2.13857	16.848
2.16109	17.1906
2.19918	17.5561
2.22814	17.8836
2.25228	18.1348
2.27749	18.4318
2.32737	18.7515
2.35848	19.0408
2.37833	19.2312
2.41963	19.4443
2.44913	19.2156
2.46415	18.9108
2.4899	18.6821
2.5194	18.4534
2.54997	18.1333
2.57357	17.9808
2.60629	17.8055
2.62936	17.5006
2.65725	17.2034
2.68085	16.929
2.71035	16.6851
2.74629	16.4487
2.78062	16.281
2.82031	16.1589
2.86537	16.0291
2.90345	15.9832
2.94475	15.9602
2.99303	15.8533
3.02789	15.716
3.06061	15.8072
3.08046	16.0357
3.12122	16.0507
3.14804	15.9058
3.18559	15.9361
3.22206	15.9892
3.25264	15.8139
3.27356	15.7223
3.29984	15.8822
3.31593	16.2173
3.34329	16.5676
3.37547	17.0245
3.40122	16.9177
3.43608	16.7576
3.46236	16.567
3.49723	16.3154
3.50796	16.003
3.54282	15.7895
3.5852	15.7131
3.63723	15.6367
3.67477	15.5984
3.72358	15.522
3.75416	15.3466
3.78473	15.1865
3.82121	14.9577
3.86358	14.6909
3.89898	14.5917
3.93438	14.6067
3.97032	14.8351
3.99768	15.1168
4.02932	15.589
4.05239	15.9317
4.06955	16.3354
4.08725	16.7314
4.10978	17.1198
4.13177	17.4777
4.1602	17.8509
4.18541	18.1479
4.20687	18.3611
4.23476	18.6809
4.25514	19.0541
4.27767	19.3434
4.30932	19.6632
4.3297	19.8764
4.37797	19.9143
4.42464	19.8683
4.45843	19.5939
4.47935	19.3729
4.50295	19.1061
4.52494	18.8013
4.54318	18.4889
4.56732	18.1231
4.59092	17.742
4.61559	17.3839
4.63383	16.9876
4.65636	16.6523
4.68157	16.3399
4.70731	15.9741
4.73896	15.692
4.77865	15.3719
4.80011	15.0137
4.81888	14.7089
4.84624	14.3355
4.87359	14.023
4.89344	14.0915
4.92133	14.3579
4.9519	14.7235
4.9798	15.1423
5.01198	15.6221
5.03129	15.9648
5.05864	16.5513
5.07635	16.894
5.0919	17.4043
5.09995	17.7318
5.11228	18.2041
5.12569	18.5468
5.14178	19.0724
5.15627	19.499
5.17611	19.895
5.2024	20.2529
5.23404	20.6337
5.25389	21.0221
5.27856	21.1667
5.31235	21.3494
5.33542	21.6616
5.3558	21.8976
5.38745	22.027
5.42017	21.8897
5.44913	21.6686
5.47381	21.4552
5.50116	21.0132
5.51457	20.7313
5.53549	20.2131
5.55748	19.855
5.57947	19.4511
5.60629	18.9939
5.61917	18.6891
5.63794	18.3538
5.6653	18.0032
5.69909	17.7136
5.72591	17.3935
5.7656	17.1876
5.79993	16.9589
5.81602	16.6541
5.85839	16.2958
5.89916	16.1356
5.93671	16.3182
5.97854	16.4933
6.00000	16.6608

