{
  "server_url": "http://localhost:5000",
  "snipeit_url": "https://snipeit-let.ethz.ch/api/v1/hardware",
  "default_os": {
    "name": "redhat",
    "release": "8"
  },
  "ssh_keys": [
    "ssh-ed25519 AAAAC3NzaC1lZDI1NTE5AAAAIK4ViMtAG+UOKBpFWSFnARRfydVMze0H3qP/CyOI60hE ansible"
  ],
  "available_os":
  [
    {
      "name": "debian", "release": "12", "release_name": "bookworm",
      "family": "debian",
      "repo_server": "debian.ethz.ch"
    },
    {
      "name":  "redhat", "release":  "8",
      "family": "redhat",
      "kickstart_base_uri": "http://id-sat-prd.ethz.ch/pulp/repos/LET/Library/content/dist/rhel8/8/x86_64/baseos/kickstart/",
      "kickstart_appstream_uri": "http://id-sat-prd.ethz.ch/pulp/repos/LET/Library/content/dist/rhel8/8/x86_64/appstream/kickstart/"
    },
    {
      "name":  "redhat", "release":  "9",
      "family": "redhat",
      "kickstart_base_uri": "http://id-sat-prd.ethz.ch/pulp/repos/LET/Library/content/dist/rhel9/9/x86_64/baseos/kickstart/",
      "kickstart_appstream_uri": "http://id-sat-prd.ethz.ch/pulp/repos/LET/Library/content/dist/rhel9/9/x86_64/appstream/kickstart/"
    }
  ],
  "partition_schemes":
  {
    "debian": {
      "eine Disk": [
        "boot-root ::",
        "  128 100 256 ext3",
        "  $primary{ } $bootable{ }",
        "  method{ format } format{ }",
        "  use_filesystem{ } filesystem{ ext4 }",
        "  mountpoint{ /boot }",
        "  .",
        "  500 10000 1000000000 ext4",
        "  $lvmok{ }",
        "  lv_name{ root }",
        "  method{ format } format{ }",
        "  use_filesystem{ } filesystem{ ext4 }",
        "  mountpoint{ / }",
        "  .",
        "  64 512 200% linux-swap",
        "  $lvmok{ }",
        "  lv_name{ swap }",
        "  method{ swap } format{ }",
        "  ."      ]
    },
    "redhat": {
      "eine Disk": [
        "zerombr",
        "clearpart --all --initlabel",
        "part /boot --size 1024 --asprimary --fstype=xfs --ondrive=sda",
        "part pv.1 --size 1 --grow --fstype=xfs --ondrive=sda",
        "volgroup system --pesize=4096 pv.1",
        "logvol swap --vgname system --size=4096 --name=swap",
        "logvol / --fstype xfs --vgname system --size=1 --grow --name=root"
      ],
      "eine Disk + data_1": [
        "zerombr",
        "clearpart --all --initlabel",
        "part /boot --size 1024 --asprimary --fstype=xfs --ondrive=sda",
        "part pv.1 --size 1 --grow --fstype=xfs --ondrive=sda",
        "volgroup system --pesize=4096 pv.1",
        "logvol swap --vgname system --size=4096 --name=swap",
        "logvol / --fstype xfs --vgname system --size=1 --grow --name=root",
        "part pv.2 --size 1 --grow --fstype=xfs --ondrive=sdb",
        "volgroup data --pesize=4096 pv.2",
        "logvol /data_1 --fstype xfs --vgname data --size=1 --grow --name=data_1"
      ],
      "CodeExpert": [
        "zerombr",
        "clearpart --all --initlabel",
        "part /boot --size 1024 --asprimary --fstype=xfs --ondrive=sda",
        "part pv.1 --size 1 --grow --fstype=xfs --ondrive=sda",
        "volgroup system --pesize=4096 pv.1",
        "logvol / --fstype=ext4 --vgname=system --size=16384 --name=root",
        "logvol swap --vgname=system --size=8192 --name=swap",
        "logvol /var --fstype=ext4 --vgname=system --size=1 --grow --name=var"
      ],
      "CodeExpert delete sda": [
        "zerombr",
        "clearpart --drives=sda --all --initlabel",
        "part /boot --size 1024 --asprimary --fstype=ext4 --ondrive=sda",
        "part pv.1 --size 1 --grow --ondrive=sda",
        "volgroup system --pesize=4096 pv.1",
        "logvol / --fstype=ext4 --vgname=system --size=16384 --name=root",
        "logvol swap --vgname=system --size=8192 --name=swap",
        "logvol /var --fstype=ext4 --vgname=system --size=1 --grow --name=var"
      ],
      "GroundWork": [
        "zerombr",
        "clearpart --all --initlabel",
        "part /boot --fstype=ext4 --ondisk=sda --size=1024",
        "part pv.1 --size 1 --grow --fstype=lvmpv --ondrive=sda",
        "volgroup system1 --pesize=4096 pv.1",
        "logvol swap --vgname system1 --size=4096 --name=swap",
        "logvol /var/lib/docker --fstype ext4 --vgname system1 --size=179200 --name=dockerdata",
        "logvol / --fstype ext4 --vgname system1 --size=18432 --name=root",
        "part pv.3 --size=204800 --fstype=ext4 --ondrive=sdb",
        "volgroup system2 --pesize=4096 pv.3",
        "logvol /tmp --fstype ext4 --vgname system2 --size=51200 --name=tmp",
        "logvol /home --fstype ext4 --vgname system2 --size=102400 --name=home",
        "part pv.2 --size=512000 --fstype=ext4 --ondrive=sdb",
        "volgroup data1 --pesize=32768 pv.2",
        "logvol /data_1 --fstype ext4 --vgname data1 --size=1 --grow --name=data_1"
      ],
      "Groundwork keep data": [
        "zerombr",
        "clearpart --list=sda1,sda2,sdb2 --initlabel",
        "part /boot --fstype=ext4 --ondisk=sda --size=1024",
        "part pv.1 --size 1 --grow --fstype=lvmpv --ondrive=sda",
        "volgroup system1 --pesize=4096 pv.1",
        "logvol swap --vgname system1 --size=4096 --name=swap",
        "logvol /var/lib/docker --fstype ext4 --vgname system1 --size=179200 --name=dockerdata",
        "logvol / --fstype ext4 --vgname system1 --size=18432 --name=root",
        "part pv.3 --size=204800 --fstype=ext4 --ondrive=sdb",
        "volgroup system2 --pesize=4096 pv.3",
        "logvol /tmp --fstype ext4 --vgname system2 --size=51200 --name=tmp",
        "logvol /home --fstype ext4 --vgname system2 --size=102400 --name=home"
      ]
    }
  }
}
