<?xml version="1.0" encoding="utf-8"?>
<!-- Generator: Adobe Illustrator 23.0.1, SVG Export Plug-In . SVG Version: 6.00 Build 0)  -->
<svg version="1.1"
     id="svg2"
     xmlns="http://www.w3.org/2000/svg" x="0px" y="0px"
     viewBox="0 0 338 75.5"
     style="enable-background:new 0 0 338 75.5;" xml:space="preserve">
<style type="text/css">
	.st0{display:none;}
	.st1{display:inline;fill:#202E54;}
	.st2{display:inline;fill:#202E54;stroke:#FFFFFF;stroke-miterlimit:10;}
	.st3{display:inline;fill:#FFFFFF;stroke:#FFFFFF;stroke-width:0.25;stroke-miterlimit:10;}
	.st4{display:inline;fill:none;stroke:#9D9D9C;stroke-miterlimit:10;}
	.st5{display:inline;fill:none;stroke:#706F6F;stroke-miterlimit:10;}
	.st6{display:inline;fill:#E8462B;}
	.st7{display:inline;fill:#262B5E;stroke:#FFFFFF;stroke-miterlimit:10;}
	.st8{display:inline;fill:none;}
	.st9{display:inline;enable-background:new    ;}
	.st10{fill:#312783;}
	.st11{fill:none;stroke:#FFFFFF;stroke-width:1.6;stroke-linecap:round;stroke-linejoin:round;}
	.st12{fill:#FCFCFC;stroke:#FFFFFF;stroke-width:1.6;stroke-miterlimit:10;}
	.st13{fill:#FFFFFF;}
	.st14{enable-background:new    ;}
	.st15{fill:#FFFFFF;stroke:#FFFFFF;stroke-width:1.6;stroke-linecap:round;stroke-linejoin:round;}
</style>
	<g id="Layer_4-5" transform="translate(-171.16659,56.11557)" class="st0">
	<rect id="rect9-0" x="42.9" y="-123.7" class="st1" width="432.5" height="127.5"/>
	<rect id="rect11-8" x="-28.4" y="-132.1" class="st2" width="566.9" height="141.7"/>
</g>
<g id="Layer_9-7" transform="translate(-171.16659,56.11557)" class="st0">
	<rect id="rect14-4" x="-28.4" y="-132.1" class="st3" width="566.9" height="141.7"/>
</g>
<g id="Layer_10-3" transform="translate(-171.16659,56.11557)" class="st0">
	<polyline id="polyline17-2" class="st4" points="139,-68.5 148,-76.2 148,-86.1 152.5,-90.5 	"/>
	<polyline id="polyline19-7" class="st4" points="135.2,-73.5 142.8,-80.2 142.8,-87.8 140.4,-90.5 	"/>
	<polyline id="polyline21-3" class="st4" points="146.9,-68 156.1,-75.2 156.1,-81 	"/>
	<polyline id="polyline23-6" class="st4" points="146.7,-59.7 162.3,-71 162.3,-75.5 	"/>
	<polyline id="polyline25-5" class="st4" points="110.9,-48 95.2,-37.3 88,-37.3 83.5,-42.7 	"/>
	<polyline id="polyline27-4" class="st4" points="109.6,-37.8 96.2,-29.7 96.2,-24.3 89.7,-20 	"/>
	<polyline id="polyline29-4" class="st4" points="118.2,-36.9 106.4,-30 106.4,-20 101.4,-16.7 	"/>
	<polyline id="polyline31-5" class="st4" points="119.6,-31.2 113.7,-27.8 113.7,-21.1 116.6,-17.7 	"/>
</g>
<g id="Extensions-3" transform="translate(-171.16659,56.11557)" class="st0">
	<line id="line34-2" class="st5" x1="139" y1="-65.3" x2="157.9" y2="-91"/>
	<line id="line36-6" class="st5" x1="130.9" y1="-67.8" x2="133.3" y2="-89.5"/>
	<line id="line38-3" class="st5" x1="124.6" y1="-69.5" x2="115.9" y2="-100.7"/>
	<line id="line40-1" class="st5" x1="115.4" y1="-63.8" x2="94.3" y2="-84.5"/>
	<line id="line42-8" class="st5" x1="109.3" y1="-53" x2="78.9" y2="-53.9"/>
	<line id="line44-9" class="st5" x1="111.1" y1="-62.8" x2="97.2" y2="-70.6"/>
	<line id="line46-5" class="st5" x1="113.3" y1="-46.4" x2="91.6" y2="-38.6"/>
	<line id="line48-5" class="st5" x1="117.8" y1="-38.6" x2="104.1" y2="-22.3"/>
	<line id="line50-8" class="st5" x1="134.3" y1="-37.1" x2="139.1" y2="-17.3"/>
</g>
<g id="Balls-5" transform="translate(-171.16659,56.11557)" class="st0">
	<path id="path53-0" class="st6" d="M133.1-94.5c-6.4,0-6.4,10,0,10
		C139.5-84.5,139.6-94.5,133.1-94.5z"/>
	<path id="path55-4" class="st6" d="M97.2-75.6c-6.4,0-6.4,10,0,10S103.6-75.6,97.2-75.6z"/>
	<path id="path57-9" class="st6" d="M78.9-58.4c-6.4,0-6.4,10,0,10C85.3-48.4,85.4-58.4,78.9-58.4
		z"/>
	<path id="path59-4" class="st6" d="M104.9-27.3c-6.4,0-6.4,10,0,10
		C111.3-17.3,111.4-27.3,104.9-27.3z"/>
	<path id="path61-1" class="st6" d="M115.9-105.7c-6.4,0-6.4,10,0,10
		C122.3-95.7,122.4-105.7,115.9-105.7z"/>
	<path id="path63-5" class="st2" d="M139.1-22.3c-6.4,0-6.4,10,0,10
		C145.5-12.3,145.6-22.3,139.1-22.3z"/>
	<path id="path65-2" class="st7" d="M94.3-89.5c-6.4,0-6.4,10,0,10
		C100.8-79.5,100.8-89.5,94.3-89.5z"/>
	<path id="path67-0" class="st7" d="M92.4-43.6c-6.4,0-6.4,10,0,10C98.8-33.6,98.8-43.6,92.4-43.6
		z"/>
	<path id="path69-2" class="st7" d="M157.9-96c-6.4,0-6.4,10,0,10C164.3-86,164.3-96,157.9-96z"/>
</g>
<g id="Layer_6-5" transform="translate(-171.16659,56.11557)">
</g>
<g id="Layer_5-1" transform="translate(-171.16659,56.11557)" class="st0">
	<rect id="rect107-3" x="196.6" y="-93.4" class="st8" width="168.5" height="35.7"/>
	<g class="st9">
		<path class="st10" d="M199.2-67.8v-25.8h3.4v12.8l12.8-12.8h4.6l-10.8,10.4l11.3,15.3H216l-9.2-13l-4.2,4.1v8.9H199.2z"/>
	</g>
	<g class="st9">
		<path class="st10" d="M247.2-67.8v-25.8h3.5l13.5,20.2v-20.2h3.3v25.8H264l-13.5-20.2v20.2H247.2z"/>
		<path class="st10" d="M279.8-67.8v-22.7h-8.5v-3h20.4v3h-8.5v22.7H279.8z"/>
		<path class="st10" d="M289.7-67.8l9.9-25.8h3.7l10.5,25.8h-3.9l-3-7.8h-10.8l-2.8,7.8H289.7z M297.2-78.4h8.7l-2.7-7.1
			c-0.8-2.2-1.4-3.9-1.8-5.3c-0.3,1.7-0.8,3.3-1.4,4.9L297.2-78.4z"/>
		<path class="st10" d="M316.4-67.8v-25.8h3.4v12.8l12.8-12.8h4.6l-10.8,10.4l11.3,15.3h-4.5l-9.2-13l-4.2,4.1v8.9H316.4z"/>
		<path class="st10" d="M347.1-67.8v-22.7h-8.5v-3h20.4v3h-8.5v22.7H347.1z"/>
	</g>
	<path id="path117-4" class="st6" d="M243.3-77.7c0.1-0.6,0.1-1.2,0.1-1.8c0-0.6,0-1.2-0.1-1.8
		l-3.2-0.5c-0.1-0.6-0.3-1.2-0.6-1.8l2.3-2.2c-0.3-0.5-0.6-1-1-1.5c-0.4-0.5-0.7-0.9-1.2-1.4l-2.9,1.5c-0.2-0.2-0.5-0.4-0.8-0.6
		c-0.3-0.2-0.5-0.4-0.8-0.5l0.5-3.1c-0.5-0.3-1.1-0.5-1.7-0.7c-0.6-0.2-1.2-0.3-1.8-0.4l-1.5,2.8c-0.7-0.1-1.3-0.1-2,0l-1.5-2.8
		c-0.6,0.1-1.2,0.2-1.8,0.4c-0.6,0.2-1.1,0.4-1.7,0.7l0.5,3.1c-0.6,0.3-1.1,0.7-1.6,1.1l-2.9-1.5c-0.4,0.4-0.8,0.9-1.2,1.4
		c-0.4,0.5-0.7,1-1,1.5l2.3,2.2c-0.3,0.6-0.5,1.2-0.6,1.8l-3.2,0.5c-0.1,0.6-0.1,1.2-0.1,1.8c0,0.6,0,1.2,0.1,1.8l3.2,0.5
		c0.1,0.6,0.3,1.2,0.6,1.8l-2.3,2.2c0.3,0.5,0.6,1,1,1.5c0.4,0.5,0.7,0.9,1.2,1.4l2.9-1.5c0.2,0.2,0.5,0.4,0.8,0.6
		c0.3,0.2,0.5,0.4,0.8,0.5l-0.5,3.1c0.5,0.3,1.1,0.5,1.7,0.7c0.6,0.2,1.2,0.3,1.8,0.4l1.5-2.8c0.7,0.1,1.3,0.1,2,0l1.5,2.8
		c0.6-0.1,1.2-0.2,1.8-0.4c0.6-0.2,1.1-0.4,1.7-0.7l-0.5-3.1c0.6-0.3,1.1-0.7,1.6-1.1l2.9,1.5c0.4-0.4,0.8-0.9,1.2-1.4
		c0.4-0.5,0.7-1,1-1.5l-2.3-2.2c0.3-0.6,0.5-1.2,0.6-1.8L243.3-77.7L243.3-77.7z M222.9-76.3c-1.1-2.4-0.9-5.3,0.8-7.5
		c2.5-3.3,7.2-4.1,10.6-1.7c0.2,0.2,0.5,0.4,0.7,0.6l-2.3,1.7l-2.2-3.1l-2.5,1.8l2.3,3.1l0,0l-7.1,0.7l2.1,2.9L222.9-76.3z
		 M236-75.1c-2.5,3.3-7.2,4.1-10.6,1.7c-0.2-0.2-0.4-0.3-0.6-0.5l2.3-1.6l2.3,3.1l2.8-6.4l2.1,2.8l2.5-1.8l-2.2-3l2.3-1.6
		C237.9-80.1,237.7-77.3,236-75.1L236-75.1z"/>
</g>
<path id="path4095" class="st11" d="M61.2,32.4l18.5-13.5h13.6"/>
<path id="path4101" class="st11" d="M52.7,20l11.1-8.1V6.7"/>
<path id="path4242" class="st12" d="M27.8,38.2L12.3,49.5H6.9"/>
<path id="path4248" class="st11" d="M34.6,51.6l-11.7,8.5v9.4"/>
<path id="path4254" class="st11" d="M26.1,51.7L8.4,64.5v4.2l-7,5.1"/>
<path id="path4256" class="st11" d="M28.3,43.4L3.8,61.2v4.7"/>
<path id="path4262" class="st11" d="M58.4,27.8l20.8-14.8h6.9l8.8-6.3"/>
<path id="path4266" class="st11" d="M54.4,25.5l16.9-12.2V7.7l6.8-5"/>
<g id="Ebene_1-3" transform="translate(-110.02238,-40.257434)">
	<g id="g120-0">
		<path id="path122-2" class="st13" d="M197,80.6h-5.2c-2.4,0-3.7,1.1-3.7,3c0,1.8,1.2,3,3.8,3
			c1.8,0,3-0.2,4.1-1.3c0.7-0.7,1-1.7,1-3.3L197,80.6L197,80.6z M197.2,91.7v-2.3c-1.8,1.8-3.4,2.5-6.4,2.5s-5.1-0.8-6.7-2.3
			c-1.4-1.5-2.2-3.6-2.2-5.9c0-4.2,2.9-7.6,9-7.6h6.2v-1.3c0-2.9-1.4-4.1-4.9-4.1c-2.5,0-3.7,0.6-5,2.2l-4.2-4.1
			c2.6-2.8,5.1-3.6,9.5-3.6c7.4,0,11.2,3.1,11.2,9.3v17.3L197.2,91.7L197.2,91.7L197.2,91.7z"/>
		<path id="path124-2" class="st13" d="M239.1,91.7V75.8c0-3.6-2.3-4.8-4.3-4.8s-4.4,1.2-4.4,4.6
			v16h-6.6V75.8c0-3.6-2.3-4.8-4.3-4.8c-2.1,0-4.4,1.2-4.4,4.8v15.9h-6.6V65.4h6.4v2.5c1.7-1.8,4.1-2.7,6.6-2.7c2.9,0,5.3,1.1,7,3.3
			c2.2-2.3,4.6-3.3,7.9-3.3c2.6,0,5,0.9,6.4,2.3c2.1,2.1,2.9,4.6,2.9,7.5v16.8h-6.6V91.7z"/>
	</g>
	<rect id="rect126-7" x="250.6" y="65.4" class="st13" width="6.6" height="26.3"/>
	<polygon id="polygon128-9" class="st13" points="270.7,91.7 275.8,91.7 285.4,65.4 285.4,65.4 278.5,65.4 273.2,81.7 267.9,65.4 
		261,65.4 	"/>
	<path id="path130-6" class="st13" d="M177.5,80.1c0.1-1.1,0.2-2.1,0.2-3.3c0-1.1-0.1-2.2-0.2-3.3
		l-5.7-0.9c-0.3-1.1-0.6-2.3-1.1-3.4l4.1-4.1c-0.5-0.9-1.1-1.9-1.7-2.8c-0.6-0.9-1.3-1.7-2.1-2.5l-5.2,2.7c-0.4-0.4-0.9-0.8-1.4-1.1
		c-0.5-0.4-1-0.7-1.5-1l0.9-5.7c-1-0.5-2-0.9-3-1.2s-2.1-0.6-3.2-0.8l-2.6,5.2c-1.2-0.1-2.4-0.1-3.5,0l-2.6-5.2
		c-1.1,0.2-2.1,0.5-3.2,0.8c-1,0.3-2.1,0.8-3,1.2l0.9,5.7c-1,0.6-2,1.3-2.9,2.1l-5.2-2.7c-0.7,0.8-1.4,1.6-2.1,2.5
		c-0.6,0.9-1.2,1.8-1.7,2.8l4.1,4.1c-0.5,1.1-0.8,2.2-1.1,3.4l-5.7,0.9c-0.1,1.1-0.2,2.1-0.2,3.3c0,1.1,0.1,2.2,0.2,3.3l5.8,0.9
		c0.3,1.1,0.6,2.3,1.1,3.3l-4.1,4.1c0.5,0.9,1.1,1.9,1.7,2.8c0.6,0.9,1.3,1.7,2.1,2.5l5.2-2.7c0.4,0.4,0.9,0.8,1.4,1.1s1,0.7,1.5,1
		l-0.9,5.7c1,0.5,2,0.9,3,1.2c1,0.3,2.1,0.6,3.2,0.8l2.6-5.2c1.2,0.1,2.4,0.1,3.5,0l2.6,5.2c1.1-0.2,2.1-0.5,3.2-0.8
		c1-0.3,2.1-0.8,3-1.2l-0.9-5.7c1-0.6,2-1.3,2.9-2.1l5.2,2.7c0.7-0.8,1.4-1.6,2.1-2.5c0.6-0.9,1.2-1.8,1.7-2.8l-4.1-4.1
		c0.5-1.1,0.8-2.2,1.1-3.4L177.5,80.1L177.5,80.1z M140.9,82.5c-2-4.4-1.7-9.6,1.4-13.8c4.4-6.1,13-7.5,19.2-3
		c0.4,0.3,0.8,0.7,1.2,1l-4.2,3l-4.1-5.6l-4.5,3.3L154,73l0,0l-12.8,1.2l3.8,5.3L140.9,82.5L140.9,82.5z M164.4,84.9
		c-4.4,6.1-13,7.5-19.2,3c-0.4-0.3-0.8-0.6-1.1-0.9l4.1-3l4.1,5.6l5.1-11.8l3.8,5.2l4.5-3.3l-4-5.6l4.1-3
		C167.8,75.6,167.4,80.8,164.4,84.9L164.4,84.9z"/>
	<g id="text132-3" class="st14">
		<path class="st13" d="M303.8,91.7l-6.8-12l-3.4,4.1v7.9h-5.1V65.4h5.1v11.5l9.3-11.5h6.3l-8.7,10.5l9.4,15.9H303.8z"/>
		<path class="st13" d="M328.7,89c-1.9,1.8-4.1,2.9-7.1,2.9c-3,0-5.3-1-7.1-2.9c-2.7-2.7-2.6-6-2.6-10.5c0-4.6-0.1-7.8,2.6-10.5
			c1.8-1.9,4.1-2.9,7.1-2.9c3,0,5.3,1,7.1,2.9c2.7,2.7,2.6,6,2.6,10.5C331.3,83.1,331.3,86.4,328.7,89z M324.8,71.1
			c-0.7-0.9-1.9-1.4-3.3-1.4c-1.4,0-2.6,0.6-3.3,1.4c-1,1.1-1.3,2.3-1.3,7.4s0.3,6.3,1.3,7.4c0.7,0.9,1.9,1.4,3.3,1.4
			c1.4,0,2.6-0.6,3.3-1.4c1-1.1,1.3-2.3,1.3-7.4S325.8,72.2,324.8,71.1z"/>
		<path class="st13" d="M352.1,91.7l-10.4-16.2v16.2h-5.1V65.4h4.6l10.4,16.1V65.4h5.1v26.3H352.1z"/>
		<path class="st13" d="M372.9,69.9v21.8h-5.1V69.9h-6.9v-4.6h18.9v4.6H372.9z"/>
		<path class="st13" d="M396.7,91.7l-1.6-4.7h-9.4l-1.6,4.7h-5.4l9.6-26.3h4l9.6,26.3H396.7z M390.6,73.1l-3.3,9.6h6.5L390.6,73.1z"
			/>
		<path class="st13" d="M420.7,91.7l-6.8-12l-3.4,4.1v7.9h-5.1V65.4h5.1v11.5l9.3-11.5h6.3l-8.7,10.5l9.4,15.9H420.7z"/>
		<path class="st13" d="M440,69.9v21.8h-5.1V69.9H428v-4.6h18.9v4.6H440z"/>
	</g>
</g>
<circle id="path4192" class="st15" cx="63.8" cy="6.2" r="1.4"/>
<path id="path4192-0" class="st15" d="M78.7,0.8c0.8,0,1.4,0.6,1.4,1.4s-0.6,1.4-1.4,1.4S77.3,3,77.3,2.2
	C77.3,1.4,77.9,0.8,78.7,0.8z"/>
<circle id="path4192-1" class="st15" cx="94.8" cy="6.7" r="1.4"/>
<path id="path4192-6" class="st15" d="M94.6,17.5c0.8,0,1.4,0.6,1.4,1.4c0,0.8-0.6,1.4-1.4,1.4c-0.8,0-1.4-0.6-1.4-1.4
	C93.2,18.1,93.8,17.5,94.6,17.5z"/>
<path id="path4192-2" class="st15" d="M22.9,69.7c0.8,0,1.4,0.6,1.4,1.4c0,0.8-0.6,1.4-1.4,1.4s-1.4-0.6-1.4-1.4
	S22.1,69.7,22.9,69.7z"/>
<circle id="path4192-4" class="st15" cx="2.2" cy="73.3" r="1.4"/>
<path id="path4192-05" class="st15" d="M3.8,64.5c0.8,0,1.4,0.6,1.4,1.4c0,0.8-0.6,1.4-1.4,1.4c-0.8,0-1.4-0.6-1.4-1.4
	C2.4,65.2,3,64.5,3.8,64.5z"/>
<path id="path4192-7" class="st15" d="M6.9,48.1c0.8,0,1.4,0.6,1.4,1.4c0,0.8-0.6,1.4-1.4,1.4c-0.8,0-1.4-0.6-1.4-1.4
	C5.5,48.7,6.1,48.1,6.9,48.1z"/>
</svg>
