<?xml version="1.0" encoding="UTF-8" standalone="no"?>
<svg
   width="344.50601"
   height="64.654999"
   viewBox="0 0 344.50601 64.654999"
   version="1.1"
   xml:space="preserve"
   style="clip-rule:evenodd;fill-rule:evenodd;stroke-linejoin:round;stroke-miterlimit:1.41421"
   id="svg45"
   sodipodi:docname="vseth_white.svg"
   inkscape:version="1.3.2 (091e20ef0f, 2023-11-25)"
   xmlns:inkscape="http://www.inkscape.org/namespaces/inkscape"
   xmlns:sodipodi="http://sodipodi.sourceforge.net/DTD/sodipodi-0.dtd"
   xmlns="http://www.w3.org/2000/svg"
   xmlns:svg="http://www.w3.org/2000/svg"><defs
     id="defs45" /><sodipodi:namedview
     id="namedview45"
     pagecolor="#ffffff"
     bordercolor="#000000"
     borderopacity="0.25"
     inkscape:showpageshadow="2"
     inkscape:pageopacity="0.0"
     inkscape:pagecheckerboard="0"
     inkscape:deskcolor="#d1d1d1"
     inkscape:zoom="2.1977273"
     inkscape:cx="173.1334"
     inkscape:cy="37.993795"
     inkscape:window-width="1920"
     inkscape:window-height="1043"
     inkscape:window-x="0"
     inkscape:window-y="0"
     inkscape:window-maximized="1"
     inkscape:current-layer="svg45" /><g
     id="g45"
     transform="translate(-46.646,-40.133)"><path
       d="m 175.77,70.324 c -1.219,-2.697 -3.741,-4.698 -7.571,-4.698 -3.828,0 -6.349,2.001 -7.568,4.698 -0.695,1.653 -0.957,2.871 -1.045,4.872 h 17.228 c -0.087,-2.001 -0.349,-3.219 -1.044,-4.872 z m -16.184,12.615 c 0,5.83 3.568,10.093 9.92,10.093 4.959,0 7.394,-1.392 10.265,-4.263 l 6.874,6.699 c -4.612,4.612 -9.047,7.135 -17.227,7.135 -10.701,0 -20.969,-4.873 -20.969,-23.23 0,-14.791 8.006,-23.144 19.75,-23.144 12.617,0 19.75,9.223 19.75,21.664 v 5.046 z"
       style="fill:#ffffff;fill-rule:nonzero"
       id="path1" /><path
       d="m 212.568,102.08 c -9.222,0 -13.138,-6.525 -13.138,-12.963 V 66.67 h -4.785 v -8.614 h 4.785 V 44.657 h 11.31 v 13.399 h 8.006 v 8.614 h -8.006 v 21.751 c 0,2.61 1.219,4.089 3.916,4.089 h 4.09 v 9.57 z"
       style="fill:#ffffff;fill-rule:nonzero"
       id="path2" /><path
       d="M 255.023,102.08 V 74.413 c 0,-6.003 -3.828,-8.004 -7.394,-8.004 -3.568,0 -7.309,2.088 -7.309,8.004 V 102.08 H 229.01 V 40.133 h 11.31 v 20.794 c 3.045,-3.132 6.873,-4.698 10.875,-4.698 9.918,0 15.139,6.96 15.139,16.53 v 29.321 z"
       style="fill:#ffffff;fill-rule:nonzero"
       id="path3" /><path
       d="M 71.929,100.679 H 63.156 L 46.646,55.874 h 11.781 l 9.115,27.692 9.03,-27.692 h 11.783 z"
       style="fill:#ffffff;fill-rule:nonzero"
       id="path4" /><path
       d="m 115.763,51.207 c -14.774,0 -26.794,12.11 -26.794,26.995 0,12.461 8.422,22.969 19.831,26.066 v -0.047 c 1.611,0.392 3.347,0.567 5.068,0.567 3.651,0 7.235,-0.791 9.401,-1.999 3.404,-1.899 5.703,-4.467 6.832,-7.634 1.207,-3.394 1.082,-6.738 -0.377,-9.938 -0.764,-1.668 -1.971,-3.376 -3.594,-5.079 l -3.399,-3.556 c -3.402,-3.553 -4.615,-5.223 -5.048,-6.023 -0.496,-0.881 -0.991,-2.205 -0.526,-3.513 0.26,-0.731 1.045,-2.111 3.381,-3.138 1.365,-0.601 2.113,-0.723 2.414,-0.746 l 0.754,-2.945 c -4.119,-1.225 -12.646,-1.103 -16.506,7.93 -1.138,2.658 -1.191,5.555 -0.156,8.376 0.912,2.49 2.852,5.273 5.93,8.503 l 2.931,3.085 c 2.131,2.227 2.916,3.362 3.196,3.916 0.537,1.081 0.574,2.234 0.115,3.526 -0.426,1.195 -1.045,1.939 -2.209,2.654 -0.647,0.395 -4.106,2.303 -8.848,0.934 v 10e-4 C 99.385,96.015 93.098,87.654 93.098,77.808 c 0,-12.517 10.147,-22.665 22.665,-22.665 12.517,0 22.664,10.148 22.664,22.665 0,4.341 -1.223,8.397 -3.34,11.844 l 3.107,3.29 c 2.755,-4.241 4.364,-9.304 4.364,-14.74 0,-14.885 -12.021,-26.995 -26.795,-26.995 z"
       style="fill:#009fe3;fill-rule:nonzero"
       id="path5" /><path
       d="m 295.363,43.707 v -2.574 h -7.986 v 11.748 h 2.887 v -4.538 h 4.356 v -2.574 h -4.356 v -2.062 z"
       style="fill:#ffffff;fill-rule:nonzero"
       id="path6" /><path
       d="m 304.535,52.881 v -5.759 c 0,-2.161 -1.369,-3.217 -3.91,-3.217 -1.502,0 -2.327,0.28 -3.234,1.188 l 1.683,1.683 c 0.429,-0.429 0.726,-0.594 1.419,-0.594 0.94,0 1.336,0.297 1.336,1.105 v 0.231 h -1.798 c -2.112,0 -3.02,1.238 -3.02,2.574 0,0.825 0.264,1.568 0.776,2.079 0.495,0.495 1.237,0.792 2.128,0.792 0.941,0 1.436,-0.264 1.98,-0.808 v 0.726 z m -2.706,-3.333 c 0,0.429 -0.066,0.709 -0.264,0.891 -0.297,0.28 -0.544,0.33 -1.072,0.33 -0.594,0 -0.891,-0.347 -0.891,-0.743 0,-0.412 0.33,-0.709 0.858,-0.709 h 1.369 z"
       style="fill:#ffffff;fill-rule:nonzero"
       id="path7" /><path
       d="m 313.96,51.841 -1.832,-1.831 c -0.346,0.346 -0.643,0.528 -1.089,0.528 -0.363,0 -0.61,-0.116 -0.841,-0.347 -0.314,-0.33 -0.446,-0.907 -0.446,-1.749 0,-0.841 0.132,-1.419 0.446,-1.749 0.231,-0.231 0.478,-0.346 0.841,-0.346 0.446,0 0.743,0.181 1.089,0.528 l 1.832,-1.832 c -0.726,-0.726 -1.683,-1.138 -2.921,-1.138 -1.534,0 -3.993,0.66 -3.993,4.537 0,3.878 2.459,4.538 3.993,4.538 1.238,0 2.195,-0.413 2.921,-1.139 z"
       style="fill:#ffffff;fill-rule:nonzero"
       id="path8" /><path
       d="m 323.78,52.881 v -5.759 c 0,-1.798 -0.924,-3.217 -2.838,-3.217 -0.676,0 -1.386,0.264 -1.947,0.825 v -3.597 h -2.706 v 11.748 h 2.706 v -5.379 c 0,-0.957 0.693,-1.155 1.04,-1.155 0.346,0 1.039,0.198 1.039,1.155 v 5.379 z"
       style="fill:#ffffff;fill-rule:nonzero"
       id="path9" /><path
       d="m 334.157,44.004 h -2.838 l -1.452,4.603 -1.468,-4.603 h -2.838 l 3.267,8.877 h 2.062 z"
       style="fill:#ffffff;fill-rule:nonzero"
       id="path10" /><path
       d="m 343.568,49.317 v -1.205 c 0,-2.326 -1.419,-4.207 -3.993,-4.207 -2.326,0 -3.976,1.633 -3.976,4.537 0,3.828 2.26,4.538 4.224,4.538 1.65,0 2.541,-0.495 3.448,-1.403 l -1.617,-1.617 c -0.478,0.479 -0.891,0.743 -1.831,0.743 -1.007,0 -1.568,-0.66 -1.568,-1.386 z m -2.673,-1.799 h -2.64 c 0,-0.214 0.033,-0.462 0.149,-0.693 0.165,-0.379 0.528,-0.693 1.171,-0.693 0.644,0 1.007,0.314 1.172,0.693 0.115,0.231 0.148,0.479 0.148,0.693 z"
       style="fill:#ffffff;fill-rule:nonzero"
       id="path11" /><path
       d="m 352.994,44.73 c -0.61,-0.611 -1.204,-0.825 -2.079,-0.825 -0.924,0 -1.699,0.429 -2.095,0.825 v -0.726 h -2.64 v 8.877 h 2.706 v -5.313 c 0,-1.007 0.726,-1.221 1.089,-1.221 0.462,0 0.709,0.198 0.973,0.462 z"
       style="fill:#ffffff;fill-rule:nonzero"
       id="path12" /><path
       d="m 362.363,49.317 v -1.205 c 0,-2.326 -1.419,-4.207 -3.993,-4.207 -2.326,0 -3.976,1.633 -3.976,4.537 0,3.828 2.26,4.538 4.224,4.538 1.65,0 2.541,-0.495 3.448,-1.403 l -1.617,-1.617 c -0.478,0.479 -0.891,0.743 -1.831,0.743 -1.007,0 -1.568,-0.66 -1.568,-1.386 z m -2.673,-1.799 h -2.64 c 0,-0.214 0.033,-0.462 0.149,-0.693 0.165,-0.379 0.528,-0.693 1.171,-0.693 0.644,0 1.007,0.314 1.172,0.693 0.115,0.231 0.148,0.479 0.148,0.693 z"
       style="fill:#ffffff;fill-rule:nonzero"
       id="path13" /><path
       d="M 367.695,52.881 V 44.35 h -2.706 v 8.531 z m 0,-9.785 v -2.062 h -2.706 v 2.062 z"
       style="fill:#ffffff;fill-rule:nonzero"
       id="path14" /><path
       d="m 378.259,52.881 v -5.676 c 0,-0.941 -0.132,-1.782 -0.891,-2.541 -0.479,-0.479 -1.155,-0.759 -1.997,-0.759 -0.709,0 -1.518,0.28 -2.062,0.825 v -0.726 h -2.64 v 8.877 h 2.706 v -5.313 c 0,-1.023 0.726,-1.221 1.089,-1.221 0.363,0 1.089,0.198 1.089,1.221 v 5.313 z"
       style="fill:#ffffff;fill-rule:nonzero"
       id="path15" /><path
       d="m 295.412,57.133 h -1.881 l -2.706,8.547 -2.706,-8.547 h -1.848 l 3.861,11.748 h 1.386 z"
       style="fill:#009fe3;fill-rule:nonzero"
       id="path16" /><path
       d="m 303.609,65.185 v -0.743 c 0,-2.376 -1.303,-4.026 -3.547,-4.026 -2.145,0 -3.548,1.568 -3.548,4.274 0,3.184 1.667,4.29 3.762,4.29 1.469,0 2.277,-0.446 3.135,-1.304 l -1.072,-1.006 c -0.594,0.594 -1.089,0.858 -2.03,0.858 -1.369,0 -2.128,-0.908 -2.128,-2.343 z m -1.666,-1.172 h -3.762 c 0.016,-0.511 0.049,-0.759 0.214,-1.138 0.264,-0.627 0.875,-1.056 1.667,-1.056 0.792,0 1.386,0.429 1.65,1.056 0.165,0.379 0.214,0.627 0.231,1.138 z"
       style="fill:#009fe3;fill-rule:nonzero"
       id="path17" /><path
       d="m 312.28,61.208 c -0.578,-0.577 -1.188,-0.792 -1.997,-0.792 -0.94,0 -1.798,0.413 -2.227,1.007 v -0.908 h -1.65 v 8.366 h 1.683 v -5.082 c 0,-1.155 0.759,-1.881 1.666,-1.881 0.578,0 0.875,0.181 1.254,0.561 z"
       style="fill:#009fe3;fill-rule:nonzero"
       id="path18" /><path
       d="m 321.385,64.69 c 0,-1.271 -0.099,-2.69 -0.941,-3.531 -0.462,-0.462 -1.188,-0.743 -2.029,-0.743 -0.891,0 -1.584,0.215 -2.195,0.941 v -4.224 h -1.683 v 11.748 h 1.65 V 67.99 c 0.627,0.759 1.304,0.99 2.211,0.99 0.842,0 1.584,-0.281 2.046,-0.743 0.842,-0.841 0.941,-2.277 0.941,-3.547 z m -1.683,0 c 0,1.485 -0.215,2.788 -1.733,2.788 -1.518,0 -1.749,-1.303 -1.749,-2.788 0,-1.485 0.231,-2.772 1.749,-2.772 1.518,0 1.733,1.287 1.733,2.772 z"
       style="fill:#009fe3;fill-rule:nonzero"
       id="path19" /><path
       d="m 330.537,68.881 v -5.594 c 0,-1.897 -1.155,-2.871 -3.449,-2.871 -1.386,0 -2.211,0.281 -3.003,1.205 l 1.106,1.039 c 0.462,-0.594 0.907,-0.808 1.831,-0.808 1.304,0 1.832,0.511 1.832,1.567 v 0.594 h -2.211 c -1.914,0 -2.888,1.007 -2.888,2.409 0,0.71 0.231,1.353 0.66,1.799 0.512,0.511 1.205,0.759 2.244,0.759 1.04,0 1.617,-0.248 2.228,-0.858 v 0.759 z m -1.683,-3.02 c 0,0.594 -0.116,0.99 -0.363,1.238 -0.446,0.429 -0.924,0.478 -1.568,0.478 -1.056,0 -1.534,-0.429 -1.534,-1.188 0,-0.759 0.511,-1.204 1.501,-1.204 h 1.964 z"
       style="fill:#009fe3;fill-rule:nonzero"
       id="path20" /><path
       d="m 340.469,68.881 v -5.346 c 0,-0.941 -0.198,-1.733 -0.842,-2.36 -0.495,-0.478 -1.204,-0.759 -2.062,-0.759 -0.842,0 -1.65,0.314 -2.228,0.941 v -0.842 h -1.65 v 8.366 h 1.683 v -5.099 c 0,-1.287 0.792,-1.864 1.733,-1.864 0.94,0 1.683,0.561 1.683,1.864 v 5.099 z"
       style="fill:#009fe3;fill-rule:nonzero"
       id="path21" /><path
       d="M 350.143,68.881 V 57.133 h -1.683 v 4.224 c -0.611,-0.726 -1.304,-0.941 -2.195,-0.941 -0.841,0 -1.567,0.281 -2.029,0.743 -0.842,0.841 -0.941,2.26 -0.941,3.531 0,1.27 0.099,2.706 0.941,3.547 0.462,0.462 1.204,0.743 2.046,0.743 0.907,0 1.584,-0.231 2.211,-0.99 v 0.891 z M 348.46,64.69 c 0,1.485 -0.215,2.788 -1.733,2.788 -1.518,0 -1.749,-1.303 -1.749,-2.788 0,-1.485 0.231,-2.772 1.749,-2.772 1.518,0 1.733,1.287 1.733,2.772 z"
       style="fill:#009fe3;fill-rule:nonzero"
       id="path22" /><path
       d="M 364.547,68.881 V 57.133 h -1.683 v 4.224 c -0.611,-0.726 -1.304,-0.941 -2.195,-0.941 -0.841,0 -1.567,0.281 -2.029,0.743 -0.842,0.841 -0.941,2.26 -0.941,3.531 0,1.27 0.099,2.706 0.941,3.547 0.462,0.462 1.204,0.743 2.046,0.743 0.907,0 1.584,-0.231 2.211,-0.99 v 0.891 z m -1.683,-4.191 c 0,1.485 -0.215,2.788 -1.733,2.788 -1.518,0 -1.749,-1.303 -1.749,-2.788 0,-1.485 0.231,-2.772 1.749,-2.772 1.518,0 1.733,1.287 1.733,2.772 z"
       style="fill:#009fe3;fill-rule:nonzero"
       id="path23" /><path
       d="m 374.47,65.185 v -0.743 c 0,-2.376 -1.303,-4.026 -3.547,-4.026 -2.145,0 -3.548,1.568 -3.548,4.274 0,3.184 1.667,4.29 3.762,4.29 1.469,0 2.277,-0.446 3.135,-1.304 L 373.2,66.67 c -0.594,0.594 -1.089,0.858 -2.03,0.858 -1.369,0 -2.128,-0.908 -2.128,-2.343 z m -1.666,-1.172 h -3.762 c 0.016,-0.511 0.049,-0.759 0.214,-1.138 0.264,-0.627 0.875,-1.056 1.667,-1.056 0.792,0 1.386,0.429 1.65,1.056 0.165,0.379 0.214,0.627 0.231,1.138 z"
       style="fill:#009fe3;fill-rule:nonzero"
       id="path24" /><path
       d="m 383.141,61.208 c -0.578,-0.577 -1.188,-0.792 -1.997,-0.792 -0.94,0 -1.798,0.413 -2.227,1.007 v -0.908 h -1.65 v 8.366 h 1.683 v -5.082 c 0,-1.155 0.759,-1.881 1.666,-1.881 0.578,0 0.875,0.181 1.254,0.561 z"
       style="fill:#009fe3;fill-rule:nonzero"
       id="path25" /><path
       d="m 295.066,82.531 c 0,-1.006 -0.314,-1.848 -0.957,-2.409 -0.495,-0.445 -1.106,-0.709 -2.195,-0.874 l -1.336,-0.198 c -0.545,-0.083 -1.023,-0.281 -1.32,-0.545 -0.314,-0.28 -0.446,-0.66 -0.446,-1.089 0,-1.039 0.759,-1.831 2.145,-1.831 0.99,0 1.832,0.214 2.558,0.907 l 1.138,-1.122 c -1.006,-0.94 -2.095,-1.336 -3.646,-1.336 -2.442,0 -3.927,1.402 -3.927,3.448 0,0.957 0.28,1.7 0.858,2.244 0.511,0.479 1.27,0.809 2.227,0.941 l 1.386,0.198 c 0.693,0.099 0.99,0.214 1.287,0.495 0.314,0.28 0.462,0.709 0.462,1.221 0,1.138 -0.891,1.798 -2.425,1.798 -1.205,0 -2.145,-0.264 -3.003,-1.122 l -1.188,1.172 c 1.122,1.138 2.392,1.551 4.158,1.551 2.458,0 4.224,-1.287 4.224,-3.449 z"
       style="fill:#009fe3;fill-rule:nonzero"
       id="path26" /><path
       d="m 301.195,85.881 v -1.436 h -0.693 c -0.627,0 -0.924,-0.363 -0.924,-0.973 v -4.521 h 1.617 v -1.287 h -1.617 v -2.541 h -1.683 v 2.541 h -0.957 v 1.287 h 0.957 v 4.603 c 0,1.205 0.726,2.327 2.293,2.327 z"
       style="fill:#009fe3;fill-rule:nonzero"
       id="path27" /><path
       d="m 310.569,85.881 v -8.366 h -1.683 v 5.099 c 0,1.287 -0.792,1.864 -1.733,1.864 -0.94,0 -1.683,-0.561 -1.683,-1.864 v -5.099 h -1.683 v 5.346 c 0,0.941 0.198,1.733 0.842,2.36 0.495,0.478 1.204,0.759 2.062,0.759 0.842,0 1.65,-0.314 2.228,-0.941 v 0.842 z"
       style="fill:#009fe3;fill-rule:nonzero"
       id="path28" /><path
       d="M 320.324,85.881 V 74.133 h -1.683 v 4.224 c -0.611,-0.726 -1.304,-0.941 -2.195,-0.941 -0.841,0 -1.567,0.281 -2.029,0.743 -0.842,0.841 -0.941,2.26 -0.941,3.531 0,1.27 0.099,2.706 0.941,3.547 0.462,0.462 1.204,0.743 2.046,0.743 0.907,0 1.584,-0.231 2.211,-0.99 v 0.891 z m -1.683,-4.191 c 0,1.485 -0.215,2.788 -1.733,2.788 -1.518,0 -1.749,-1.303 -1.749,-2.788 0,-1.485 0.231,-2.772 1.749,-2.772 1.518,0 1.733,1.287 1.733,2.772 z"
       style="fill:#009fe3;fill-rule:nonzero"
       id="path29" /><path
       d="m 325.214,85.881 v -8.366 h -1.683 v 8.366 z m 0.05,-10.016 v -1.782 h -1.782 v 1.782 z"
       style="fill:#009fe3;fill-rule:nonzero"
       id="path30" /><path
       d="m 335.096,82.185 v -0.743 c 0,-2.376 -1.303,-4.026 -3.547,-4.026 -2.145,0 -3.548,1.568 -3.548,4.274 0,3.184 1.667,4.29 3.762,4.29 1.469,0 2.277,-0.446 3.135,-1.304 l -1.072,-1.006 c -0.594,0.594 -1.089,0.858 -2.03,0.858 -1.369,0 -2.128,-0.908 -2.128,-2.343 z m -1.666,-1.172 h -3.762 c 0.016,-0.511 0.049,-0.759 0.214,-1.138 0.264,-0.627 0.875,-1.056 1.667,-1.056 0.792,0 1.386,0.429 1.65,1.056 0.165,0.379 0.214,0.627 0.231,1.138 z"
       style="fill:#009fe3;fill-rule:nonzero"
       id="path31" /><path
       d="m 343.767,78.208 c -0.578,-0.577 -1.188,-0.792 -1.997,-0.792 -0.94,0 -1.798,0.413 -2.227,1.007 v -0.908 h -1.65 v 8.366 h 1.683 v -5.082 c 0,-1.155 0.759,-1.881 1.666,-1.881 0.578,0 0.875,0.181 1.254,0.561 z"
       style="fill:#009fe3;fill-rule:nonzero"
       id="path32" /><path
       d="m 352.4,82.185 v -0.743 c 0,-2.376 -1.304,-4.026 -3.548,-4.026 -2.145,0 -3.547,1.568 -3.547,4.274 0,3.184 1.666,4.29 3.762,4.29 1.468,0 2.277,-0.446 3.135,-1.304 l -1.073,-1.006 c -0.594,0.594 -1.089,0.858 -2.029,0.858 -1.37,0 -2.129,-0.908 -2.129,-2.343 z m -1.667,-1.172 h -3.762 c 0.017,-0.511 0.05,-0.759 0.215,-1.138 0.264,-0.627 0.874,-1.056 1.666,-1.056 0.792,0 1.386,0.429 1.65,1.056 0.165,0.379 0.215,0.627 0.231,1.138 z"
       style="fill:#009fe3;fill-rule:nonzero"
       id="path33" /><path
       d="m 361.978,85.881 v -5.346 c 0,-0.941 -0.198,-1.733 -0.842,-2.36 -0.495,-0.478 -1.204,-0.759 -2.062,-0.759 -0.842,0 -1.65,0.314 -2.228,0.941 v -0.842 h -1.65 v 8.366 h 1.683 v -5.099 c 0,-1.287 0.792,-1.864 1.733,-1.864 0.94,0 1.683,0.561 1.683,1.864 v 5.099 z"
       style="fill:#009fe3;fill-rule:nonzero"
       id="path34" /><path
       d="M 371.651,85.881 V 74.133 h -1.683 v 4.224 c -0.61,-0.726 -1.303,-0.941 -2.194,-0.941 -0.842,0 -1.568,0.281 -2.03,0.743 -0.841,0.841 -0.94,2.26 -0.94,3.531 0,1.27 0.099,2.706 0.94,3.547 0.462,0.462 1.205,0.743 2.046,0.743 0.908,0 1.584,-0.231 2.211,-0.99 v 0.891 z m -1.683,-4.191 c 0,1.485 -0.214,2.788 -1.732,2.788 -1.518,0 -1.749,-1.303 -1.749,-2.788 0,-1.485 0.231,-2.772 1.749,-2.772 1.518,0 1.732,1.287 1.732,2.772 z"
       style="fill:#009fe3;fill-rule:nonzero"
       id="path35" /><path
       d="m 381.574,82.185 v -0.743 c 0,-2.376 -1.303,-4.026 -3.547,-4.026 -2.145,0 -3.548,1.568 -3.548,4.274 0,3.184 1.667,4.29 3.762,4.29 1.469,0 2.277,-0.446 3.135,-1.304 l -1.072,-1.006 c -0.594,0.594 -1.089,0.858 -2.03,0.858 -1.369,0 -2.128,-0.908 -2.128,-2.343 z m -1.666,-1.172 h -3.762 c 0.016,-0.511 0.049,-0.759 0.214,-1.138 0.264,-0.627 0.875,-1.056 1.667,-1.056 0.792,0 1.386,0.429 1.65,1.056 0.165,0.379 0.214,0.627 0.231,1.138 z"
       style="fill:#009fe3;fill-rule:nonzero"
       id="path36" /><path
       d="m 391.152,85.881 v -5.346 c 0,-0.941 -0.198,-1.733 -0.841,-2.36 -0.495,-0.478 -1.205,-0.759 -2.063,-0.759 -0.841,0 -1.65,0.314 -2.227,0.941 v -0.842 h -1.65 v 8.366 h 1.683 v -5.099 c 0,-1.287 0.792,-1.864 1.732,-1.864 0.941,0 1.683,0.561 1.683,1.864 v 5.099 z"
       style="fill:#009fe3;fill-rule:nonzero"
       id="path37" /><path
       d="m 293.68,101.88 v -5.593 c 0,-1.898 -1.155,-2.871 -3.449,-2.871 -1.386,0 -2.211,0.28 -3.003,1.204 l 1.106,1.04 c 0.462,-0.594 0.907,-0.809 1.831,-0.809 1.304,0 1.832,0.512 1.832,1.568 v 0.594 h -2.211 c -1.914,0 -2.888,1.006 -2.888,2.409 0,0.709 0.231,1.353 0.66,1.798 0.512,0.512 1.205,0.759 2.244,0.759 1.04,0 1.617,-0.247 2.228,-0.858 v 0.759 z m -1.683,-3.019 c 0,0.594 -0.116,0.99 -0.363,1.237 -0.446,0.429 -0.924,0.479 -1.568,0.479 -1.056,0 -1.534,-0.429 -1.534,-1.188 0,-0.759 0.511,-1.205 1.501,-1.205 h 1.964 z"
       style="fill:#009fe3;fill-rule:nonzero"
       id="path38" /><path
       d="m 303.611,101.881 v -5.346 c 0,-0.941 -0.198,-1.733 -0.841,-2.36 -0.495,-0.478 -1.205,-0.759 -2.063,-0.759 -0.841,0 -1.65,0.314 -2.227,0.941 v -0.842 h -1.65 v 8.366 h 1.683 v -5.099 c 0,-1.287 0.792,-1.864 1.732,-1.864 0.941,0 1.683,0.561 1.683,1.864 v 5.099 z"
       style="fill:#009fe3;fill-rule:nonzero"
       id="path39" /><path
       d="M 317.933,101.881 V 90.133 h -1.683 v 4.224 c -0.61,-0.726 -1.303,-0.941 -2.194,-0.941 -0.842,0 -1.568,0.281 -2.03,0.743 -0.841,0.841 -0.94,2.26 -0.94,3.531 0,1.27 0.099,2.706 0.94,3.547 0.462,0.462 1.205,0.743 2.046,0.743 0.908,0 1.584,-0.231 2.211,-0.99 v 0.891 z M 316.25,97.69 c 0,1.485 -0.214,2.788 -1.732,2.788 -1.518,0 -1.749,-1.303 -1.749,-2.788 0,-1.485 0.231,-2.772 1.749,-2.772 1.518,0 1.732,1.287 1.732,2.772 z"
       style="fill:#009fe3;fill-rule:nonzero"
       id="path40" /><path
       d="m 327.856,98.185 v -0.743 c 0,-2.376 -1.303,-4.026 -3.547,-4.026 -2.145,0 -3.548,1.568 -3.548,4.274 0,3.184 1.667,4.29 3.762,4.29 1.469,0 2.277,-0.446 3.135,-1.304 l -1.072,-1.006 c -0.594,0.594 -1.089,0.858 -2.03,0.858 -1.369,0 -2.128,-0.908 -2.128,-2.343 z m -1.666,-1.172 h -3.762 c 0.016,-0.511 0.049,-0.759 0.214,-1.138 0.264,-0.627 0.875,-1.056 1.667,-1.056 0.792,0 1.386,0.429 1.65,1.056 0.165,0.379 0.214,0.627 0.231,1.138 z"
       style="fill:#009fe3;fill-rule:nonzero"
       id="path41" /><path
       d="m 336.526,94.208 c -0.577,-0.577 -1.188,-0.792 -1.996,-0.792 -0.941,0 -1.799,0.413 -2.228,1.007 v -0.908 h -1.65 v 8.366 h 1.683 v -5.082 c 0,-1.155 0.759,-1.881 1.667,-1.881 0.577,0 0.874,0.181 1.254,0.561 z"
       style="fill:#009fe3;fill-rule:nonzero"
       id="path42" /><path
       d="m 350.881,101.881 v -1.601 h -5.725 v -3.531 h 4.884 v -1.584 h -4.884 v -3.432 h 5.725 v -1.6 h -7.507 v 11.748 z"
       style="fill:#009fe3;fill-rule:nonzero"
       id="path43" /><path
       d="m 361.537,91.733 v -1.6 h -8.25 v 1.6 h 3.234 v 10.148 h 1.782 V 91.733 Z"
       style="fill:#009fe3;fill-rule:nonzero"
       id="path44" /><path
       d="M 372.585,101.881 V 90.133 h -1.782 v 5.016 h -4.768 v -5.016 h -1.782 v 11.748 h 1.782 v -5.132 h 4.768 v 5.132 z"
       style="fill:#009fe3;fill-rule:nonzero"
       id="path45" /></g></svg>
