<?xml version="1.0" encoding="UTF-8" standalone="no"?>
<!-- Created with Inkscape (http://www.inkscape.org/) -->

<svg
   width="10.278289mm"
   height="5.5543299mm"
   viewBox="0 0 10.278289 5.5543299"
   version="1.1"
   id="svg1073"
   inkscape:version="1.1 (c68e22c387, 2021-05-23)"
   sodipodi:docname="logo_black.svg"
   xmlns:inkscape="http://www.inkscape.org/namespaces/inkscape"
   xmlns:sodipodi="http://sodipodi.sourceforge.net/DTD/sodipodi-0.dtd"
   xmlns="http://www.w3.org/2000/svg"
   xmlns:svg="http://www.w3.org/2000/svg">
  <sodipodi:namedview
     id="namedview1075"
     pagecolor="#ffffff"
     bordercolor="#666666"
     borderopacity="1.0"
     inkscape:pageshadow="2"
     inkscape:pageopacity="0.0"
     inkscape:pagecheckerboard="0"
     inkscape:document-units="mm"
     showgrid="false"
     inkscape:zoom="11.431425"
     inkscape:cx="34.685089"
     inkscape:cy="17.933022"
     inkscape:window-width="1920"
     inkscape:window-height="1011"
     inkscape:window-x="0"
     inkscape:window-y="0"
     inkscape:window-maximized="1"
     inkscape:current-layer="layer1" />
  <defs
     id="defs1070" />
  <g
     inkscape:label="Layer 1"
     inkscape:groupmode="layer"
     id="layer1"
     transform="translate(-35.226081,-114.24521)">
    <g
       aria-label="blitz"
       id="text3592-0"
       style="font-size:4.23333px;line-height:1.25;font-family:'FG Saga';-inkscape-font-specification:'FG Saga, Normal';letter-spacing:0px;word-spacing:0px;fill:#221500;fill-opacity:1;stroke-width:0.264583">
      <path
         d="m 35.226081,119.48624 q 0,0.008 0.0042,0.0254 0,0.0169 0,0.0169 0.0042,0.008 0.02963,0.0423 0.02117,0.0339 0.02963,0.0466 0.0085,0.0127 0.04657,0.0466 0.03387,0.0381 0.04233,0.0466 0.0085,0.004 0.04233,0.0254 0.03387,0.0254 0.0508,0.0339 0.0085,0.008 0.02963,0.0169 0.02117,0.008 0.02963,0.0127 h 0.01693 0.0127 q 0.0042,-0.004 0.02117,-0.0212 0.01693,-0.0169 0.0381,-0.0381 0.02117,-0.0212 0.0381,-0.0381 0.01693,-0.0169 0.02117,-0.0212 0.0085,-0.008 0.04657,-0.0169 0.0381,-0.008 0.04657,-0.0127 0.0042,-0.008 0.0254,-0.0677 0.0254,-0.055 0.03387,-0.0847 0.0042,-0.008 0.0127,-0.0593 0.0127,-0.0508 0.01693,-0.0593 0.0042,-0.008 0.01693,-0.0423 0.0127,-0.0296 0.0254,-0.0635 0.01693,-0.0339 0.02963,-0.0677 0.0127,-0.0296 0.01693,-0.0381 0.0042,-0.004 0.0127,-0.0254 0.0085,-0.0212 0.01693,-0.0466 0.0127,-0.0254 0.02117,-0.0508 0.0085,-0.0212 0.0085,-0.0254 0.0042,-0.004 0.0127,-0.0254 0.0085,-0.0169 0.01693,-0.0381 0.0127,-0.0169 0.02117,-0.0381 0.0085,-0.0169 0.0085,-0.0212 0.0042,-0.008 0.01693,-0.0466 0.0127,-0.0339 0.01693,-0.0423 0.0042,-0.008 0.0127,-0.0169 0.0127,-0.0127 0.01693,-0.0127 l 0.0889,0.0593 q 0.0042,0 0.0508,0 0.04657,0.004 0.07197,0.004 0.0127,0 0.0381,0 0.02963,0 0.05927,-0.004 0.02963,0 0.0508,0 0.0254,0 0.02963,0 0.0127,0 0.04233,-0.004 0.02963,-0.004 0.05927,-0.008 0.03387,-0.004 0.0635,-0.008 0.02963,-0.004 0.04233,-0.008 0.0127,0 0.0381,-0.008 0.0254,-0.008 0.05503,-0.0169 0.02963,-0.008 0.05503,-0.0169 0.0254,-0.0127 0.03387,-0.0169 0.0042,-0.004 0.02117,-0.0127 0.02117,-0.0127 0.04657,-0.0254 0.0254,-0.0169 0.04657,-0.0296 0.02117,-0.0127 0.03387,-0.0212 0.0085,-0.004 0.0254,-0.0169 0.02117,-0.0169 0.0381,-0.0296 0.02117,-0.0169 0.0381,-0.0296 0.01693,-0.0127 0.02117,-0.0169 0.01693,-0.0169 0.0635,-0.0635 0.0508,-0.0466 0.1016,-0.0974 0.0508,-0.055 0.09737,-0.1016 0.04657,-0.0466 0.06773,-0.0677 0.0042,-0.004 0.0381,-0.0508 0.03387,-0.0466 0.0508,-0.0677 0.0085,-0.0169 0.02963,-0.0466 0.0254,-0.0339 0.02963,-0.0423 0.0085,-0.0169 0.03387,-0.0677 0.0254,-0.055 0.05503,-0.11007 0.02963,-0.0593 0.05503,-0.11006 0.0254,-0.0508 0.0381,-0.072 0.0042,-0.0127 0.0127,-0.0339 0.0085,-0.0212 0.01693,-0.0466 0.0127,-0.0254 0.02117,-0.0423 0.0085,-0.0212 0.0085,-0.0296 0,-0.004 0.0042,-0.0339 0.0042,-0.0339 0.0085,-0.0677 0.0085,-0.0339 0.0127,-0.0635 0.0042,-0.0339 0.0042,-0.0423 0,-0.004 0.0042,-0.0296 0.0042,-0.0296 0.0085,-0.0593 0.0042,-0.0339 0.0085,-0.0593 0.0085,-0.0254 0.0085,-0.0339 v -0.0296 -0.0296 q 0,-0.0127 -0.0042,-0.0423 -0.0042,-0.0339 -0.0127,-0.0677 -0.0042,-0.0339 -0.0085,-0.0635 -0.0042,-0.0296 -0.0042,-0.0381 l -0.02963,-0.0889 q -0.0085,-0.0169 -0.02963,-0.0593 -0.02117,-0.0466 -0.04657,-0.0931 -0.0254,-0.0466 -0.04657,-0.0889 -0.02117,-0.0423 -0.02963,-0.0593 0,-0.004 -0.0127,-0.0127 -0.0085,-0.0127 -0.01693,-0.0169 -0.0127,-0.008 -0.04657,-0.0169 -0.03387,-0.0127 -0.04233,-0.0127 h -0.135467 -0.135466 q -0.0042,0 -0.02963,0.0169 -0.0254,0.0127 -0.02963,0.0127 -0.0085,0.004 -0.04657,0.0169 -0.03387,0.0127 -0.04233,0.0127 -0.0085,0.004 -0.03387,0.0169 -0.02117,0.008 -0.0254,0.0127 -0.0085,0.008 -0.02963,0.0212 -0.01693,0.0127 -0.0381,0.0296 -0.01693,0.0127 -0.03387,0.0254 -0.01693,0.0127 -0.02117,0.0169 -0.02963,0.0254 -0.1016,0.0974 -0.07197,0.072 -0.156633,0.15663 -0.08043,0.0804 -0.1524,0.1524 -0.07197,0.072 -0.09737,0.1016 -0.0085,0.0169 -0.02963,0.0635 -0.02117,0.0423 -0.02963,0.0593 -0.0127,0.0169 -0.0381,0.0635 -0.0254,0.0423 -0.05503,0.0889 -0.02963,0.0466 -0.05503,0.0889 -0.0254,0.0423 -0.03387,0.055 -0.0042,0.008 -0.01693,0.0212 -0.0085,0.008 -0.0127,0.008 v -0.0296 -0.0296 q 0.0042,-0.0169 0.02117,-0.0762 0.01693,-0.0635 0.0381,-0.13124 0.02117,-0.072 0.0381,-0.13123 0.01693,-0.0635 0.02117,-0.0804 0.0042,-0.0127 0.01693,-0.0635 0.0127,-0.055 0.02963,-0.1143 0.01693,-0.0635 0.02963,-0.1143 0.0127,-0.055 0.01693,-0.0677 0,-0.008 0.0127,-0.0423 0.0127,-0.0381 0.01693,-0.0466 0.0042,-0.0127 0.01693,-0.0677 0.0127,-0.055 0.0254,-0.1143 0.01693,-0.0593 0.02963,-0.11006 0.0127,-0.055 0.01693,-0.0677 0,-0.008 0.0127,-0.0339 0.0127,-0.0254 0.02963,-0.055 0.01693,-0.0339 0.02963,-0.0593 0.0127,-0.0254 0.01693,-0.0339 0.0042,-0.008 0.0127,-0.0423 0.0127,-0.0381 0.01693,-0.0466 0.0042,-0.008 0.02117,-0.0423 0.02117,-0.0381 0.0381,-0.0762 0.02117,-0.0423 0.0381,-0.0762 0.02117,-0.0381 0.0254,-0.0466 0,-0.004 0.0085,-0.0212 0.0085,-0.0212 0.01693,-0.0466 0.0085,-0.0254 0.01693,-0.0466 0.0127,-0.0212 0.01693,-0.0339 0.0085,-0.0212 0.01693,-0.0508 0.0127,-0.0339 0.0127,-0.0381 0,-0.008 0,-0.0423 0.0042,-0.0339 0.0042,-0.055 0,-0.0169 -0.0042,-0.0466 0,-0.0339 0,-0.0381 -0.0042,-0.0127 -0.02963,-0.0593 -0.02117,-0.0466 -0.02963,-0.0593 -0.0042,-0.004 -0.0381,-0.0254 -0.03387,-0.0254 -0.05503,-0.0339 -0.0085,-0.008 -0.03387,-0.0169 -0.02117,-0.0127 -0.0254,-0.0169 h -0.02963 -0.02963 q -0.0085,0.004 -0.0254,0.0127 -0.01693,0.008 -0.0381,0.0169 -0.01693,0.008 -0.03387,0.0212 -0.01693,0.008 -0.02117,0.0127 -0.0042,0 -0.01693,0.0254 -0.0085,0.0212 -0.0127,0.0339 -0.0042,0.008 -0.01693,0.0423 -0.0085,0.0339 -0.0127,0.0466 -0.0085,0.0212 -0.02117,0.0677 -0.0085,0.0423 -0.0127,0.0508 0,0.008 -0.0042,0.0423 -0.0042,0.0296 -0.0085,0.0635 -0.0042,0.0339 -0.0127,0.0677 -0.0042,0.0296 -0.0042,0.0381 0,0.008 -0.0127,0.0339 -0.0127,0.0212 -0.01693,0.0254 -0.0042,0.008 -0.01693,0.0635 -0.0085,0.0508 -0.0127,0.0593 -0.0042,0.008 -0.01693,0.0423 -0.0127,0.0339 -0.02963,0.0762 -0.0127,0.0381 -0.0254,0.0762 -0.0127,0.0339 -0.01693,0.0423 -0.0042,0.008 -0.0127,0.0508 -0.0085,0.0381 -0.02117,0.0847 -0.0085,0.0466 -0.01693,0.0889 -0.0085,0.0381 -0.0085,0.0466 -0.0085,0.0212 -0.02963,0.1016 -0.02117,0.0762 -0.04657,0.16934 -0.0254,0.0931 -0.0508,0.17356 -0.02117,0.0762 -0.0254,0.0974 0,0.004 -0.0042,0.0296 -0.0042,0.0212 -0.0127,0.0466 -0.0042,0.0254 -0.0085,0.0466 -0.0042,0.0212 -0.0042,0.0254 0,0.004 -0.0042,0.0254 -0.0042,0.0169 -0.0085,0.0381 -0.0042,0.0169 -0.0127,0.0339 -0.0042,0.0169 -0.0042,0.0212 0,0.008 -0.0042,0.0296 -0.0042,0.0212 -0.0127,0.0466 -0.0042,0.0254 -0.0085,0.0508 -0.0042,0.0212 -0.0042,0.0254 -0.0085,0.0296 -0.02117,0.0847 -0.0127,0.055 -0.02963,0.1143 -0.0127,0.055 -0.0254,0.1016 -0.0085,0.0466 -0.0127,0.0593 -0.0042,0.008 -0.01693,0.0508 -0.0127,0.0381 -0.02963,0.0847 -0.01693,0.0423 -0.02963,0.0847 -0.0127,0.0381 -0.0127,0.0508 -0.0085,0.0212 -0.02963,0.1143 -0.02117,0.0931 -0.04657,0.19897 -0.0254,0.10583 -0.0508,0.19897 -0.02117,0.0931 -0.0254,0.1143 0,0.008 -0.0254,0.0677 -0.02117,0.055 -0.03387,0.0847 -0.0042,0.004 -0.01693,0.0296 -0.0127,0.0254 -0.0127,0.0296 -0.02963,0.072 -0.04233,0.14817 -0.0127,0.0804 -0.04657,0.1524 -0.0085,0.0212 -0.0254,0.055 -0.02117,0.0381 -0.0381,0.0762 -0.02117,0.0381 -0.0381,0.0677 -0.01693,0.0339 -0.02117,0.0423 -0.0042,0.004 -0.02963,0.0254 -0.0254,0.0254 -0.02963,0.0339 -0.0085,0.008 -0.01693,0.0296 -0.0127,0.0212 -0.0127,0.0296 0,0.004 0,0.0212 -0.0042,0.0169 -0.0042,0.0254 z m 1.202265,-1.12607 q 0,-0.008 0.0127,-0.0423 0.0127,-0.0339 0.02117,-0.0466 0.0042,-0.008 0.0254,-0.0423 0.0254,-0.0339 0.03387,-0.0508 l 0.02963,-0.0296 q 0.0042,-0.004 0.0127,-0.0254 0.0127,-0.0254 0.01693,-0.0339 0.0085,-0.0127 0.01693,-0.0466 0.0127,-0.0339 0.0127,-0.0423 v -0.0339 -0.0254 q -0.0085,-0.008 -0.04657,-0.0466 -0.03387,-0.0381 -0.04233,-0.0466 0,0 -0.0042,-0.004 0,-0.004 0,-0.008 0,-0.004 0,-0.008 0.0042,-0.004 0.0042,-0.008 0,-0.008 0.0085,-0.0296 0.0127,-0.0212 0.02117,-0.0296 0.0042,-0.004 0.02117,-0.0296 0.02117,-0.0296 0.0381,-0.0593 0.02117,-0.0296 0.0381,-0.055 0.01693,-0.0254 0.02117,-0.0339 0.0042,-0.008 0.0127,-0.0466 0.0127,-0.0381 0.01693,-0.0466 0.0042,-0.004 0.02963,-0.0339 0.02963,-0.0339 0.0635,-0.072 0.03387,-0.0381 0.0635,-0.072 0.03387,-0.0381 0.05503,-0.0593 0.0042,-0.008 0.02963,-0.0339 0.02963,-0.0296 0.05927,-0.0593 0.02963,-0.0296 0.05503,-0.055 0.0254,-0.0254 0.03387,-0.0339 0.0042,-0.004 0.02117,-0.0254 0.01693,-0.0212 0.0381,-0.0466 0.02117,-0.0254 0.0381,-0.0466 0.01693,-0.0254 0.0254,-0.0296 0.0042,-0.008 0.0508,-0.0296 0.04657,-0.0212 0.06773,-0.0339 l 0.0889,-0.0296 q 0.01693,0.008 0.0508,0.0423 0.03387,0.0339 0.04233,0.0508 0,0.004 0.0042,0.0296 0.0042,0.0212 0.0085,0.0508 0.0085,0.0254 0.0127,0.055 0.0042,0.0254 0.0042,0.0423 v 0.0974 0.0847 q 0,0.008 -0.0127,0.0339 -0.0085,0.0254 -0.01693,0.055 -0.0085,0.0296 -0.02117,0.0593 -0.0085,0.0254 -0.0085,0.0296 -0.0042,0.008 -0.0042,0.0339 0.0042,0.0212 0.0042,0.0254 -0.0042,0.008 -0.0127,0.0296 -0.0085,0.0212 -0.02117,0.0466 -0.0085,0.0254 -0.01693,0.0508 -0.0085,0.0212 -0.0127,0.0254 0,0.008 -0.0085,0.0339 -0.0085,0.0254 -0.02117,0.055 -0.0085,0.0296 -0.01693,0.0593 -0.0085,0.0254 -0.0127,0.0296 -0.0042,0.008 -0.04233,0.0466 -0.0381,0.0381 -0.04657,0.0466 -0.0085,0.008 -0.03387,0.0466 -0.02117,0.0339 -0.0254,0.0423 -0.02117,0.0212 -0.05503,0.0677 -0.02963,0.0466 -0.0381,0.0508 -0.0042,0.004 -0.0508,0.0381 -0.04233,0.0339 -0.06773,0.0508 -0.0127,0.008 -0.04657,0.0339 -0.03387,0.0212 -0.04233,0.0296 -0.0042,0 -0.02963,0.0127 -0.0254,0.0127 -0.02963,0.0169 -0.0085,0.004 -0.03387,0.0296 -0.02117,0.0254 -0.0254,0.0296 -0.0085,0.004 -0.0635,0.0169 -0.0508,0.008 -0.05927,0.0127 -0.0042,0 -0.02963,0.0169 -0.02117,0.0127 -0.02963,0.0127 -0.0042,0 -0.03387,0.004 -0.0254,0 -0.04233,0 -0.0085,0 -0.0381,0 -0.0254,-0.004 -0.03387,-0.004 -0.0085,-0.008 -0.02117,-0.0423 -0.0127,-0.0381 -0.0127,-0.0466 z"
         id="path1151"
         style="fill:#221500;fill-opacity:1" />
      <path
         d="m 38.307943,118.76234 q 0,0.0212 0.0042,0.055 0.0042,0.0339 0.0085,0.0423 0,0.0169 0.0085,0.0508 0.0085,0.0381 0.01693,0.0762 0.0127,0.0381 0.02117,0.0677 0.0085,0.0339 0.0085,0.0381 0.0042,0.0127 0.02963,0.055 0.02963,0.0466 0.0381,0.0593 0.0085,0.008 0.02963,0.0127 0.0254,0.008 0.03387,0.008 0.0042,0 0.0381,0 0.0381,0 0.05927,-0.004 0.01693,-0.004 0.04657,-0.008 0.03387,-0.004 0.0381,-0.004 0.0085,-0.004 0.0508,-0.0339 0.04233,-0.0254 0.05927,-0.0381 0.01693,-0.0169 0.05927,-0.0593 0.04233,-0.0381 0.0508,-0.0466 0,-0.004 0.0085,-0.0296 0.0127,-0.0212 0.02117,-0.0339 0,-0.0127 0.0042,-0.0508 0.0085,-0.0339 0.0127,-0.0423 0,0 -0.0042,-0.0127 0,-0.0127 0,-0.0212 0,-0.004 -0.0042,-0.0169 0,-0.008 0,-0.008 -0.0085,-0.0127 -0.03387,-0.0296 -0.02117,-0.0212 -0.02963,-0.0212 -0.0127,0 -0.0381,0 -0.0254,0 -0.05503,0.004 -0.0254,0.004 -0.05503,0.008 -0.0254,0.004 -0.0381,0.008 0,-0.008 -0.0127,-0.0254 -0.0127,-0.0212 -0.01693,-0.0296 -0.0042,-0.008 -0.0042,-0.0212 v -0.0169 q 0,-0.0127 0,-0.0381 0,-0.0254 0,-0.055 0.0042,-0.0296 0.0042,-0.0508 0.0042,-0.0254 0.0042,-0.0339 0,-0.0169 0.0042,-0.0635 0.0085,-0.0466 0.0085,-0.055 0.0042,-0.008 0.01693,-0.0339 0.0127,-0.0254 0.0085,-0.0339 0,-0.008 -0.0042,-0.0423 -0.0042,-0.0381 -0.0042,-0.0466 0,-0.008 0.0085,-0.0466 0.0127,-0.0381 0.02117,-0.0804 0.0127,-0.0423 0.02117,-0.0804 0.0127,-0.0381 0.0127,-0.0466 0,-0.008 -0.0042,-0.0296 0,-0.0212 0,-0.0296 0.0042,-0.0339 0.02117,-0.1143 0.02117,-0.0847 0.04233,-0.1778 0.0254,-0.0931 0.04657,-0.1778 0.02117,-0.0847 0.02963,-0.11853 0,-0.004 0.0042,-0.0212 0.0085,-0.0212 0.0127,-0.0381 0.0085,-0.0212 0.01693,-0.0381 0.0085,-0.0212 0.0085,-0.0254 0.0042,-0.0169 0.01693,-0.0593 0.01693,-0.0423 0.02963,-0.0931 0.0127,-0.0508 0.0254,-0.0931 0.0127,-0.0466 0.01693,-0.0677 0.0042,-0.0212 0.0254,-0.10584 0.02117,-0.0889 0.04657,-0.18626 0.0254,-0.1016 0.04233,-0.18627 0.02117,-0.0889 0.02963,-0.11006 0,-0.008 0.0085,-0.0339 0.0127,-0.0296 0.0254,-0.0593 0.0127,-0.0339 0.0254,-0.0593 0.0127,-0.0254 0.0127,-0.0339 0.0042,-0.008 0.0127,-0.0423 0.0085,-0.0381 0.01693,-0.0804 0.0127,-0.0466 0.02117,-0.0847 0.0085,-0.0381 0.0127,-0.0466 0,-0.008 0.0085,-0.0381 0.0127,-0.0339 0.02117,-0.0677 0.0127,-0.0339 0.02117,-0.0635 0.0085,-0.0339 0.0127,-0.0423 0,-0.008 0.0042,-0.0466 0.0085,-0.0381 0.0127,-0.0466 0.0042,-0.0169 0.0254,-0.0677 0.0254,-0.0508 0.04657,-0.11007 0.0254,-0.0593 0.04657,-0.11007 0.02117,-0.055 0.02963,-0.0677 0,-0.004 0.0042,-0.0212 0.0085,-0.0212 0.0127,-0.0423 0.0085,-0.0212 0.01693,-0.0381 0.0085,-0.0212 0.0085,-0.0254 0.0508,-0.1143 0.118534,-0.22013 0.07197,-0.11007 0.131233,-0.2286 0.0085,-0.008 0.01693,-0.0296 0.0127,-0.0254 0.0085,-0.0296 0,-0.004 -0.0042,-0.0339 0,-0.0296 -0.0042,-0.0466 0.0042,-0.0127 -0.0042,-0.0381 -0.0085,-0.0296 -0.0085,-0.0339 -0.0042,-0.008 -0.02963,-0.0508 -0.0254,-0.0466 -0.04233,-0.0593 -0.0085,-0.008 -0.02963,-0.0296 -0.02117,-0.0212 -0.02963,-0.0254 -0.0127,-0.008 -0.0508,-0.0127 -0.03387,-0.004 -0.04657,-0.004 -0.0042,0 -0.04233,0.004 -0.0381,0 -0.05927,0.004 -0.01693,-0.004 -0.04657,0.004 -0.02963,0.008 -0.02963,0.008 -0.0085,0 -0.0254,0.0381 -0.01693,0.0339 -0.02117,0.0508 -0.0042,0.008 -0.0127,0.0339 -0.0042,0.0254 -0.0127,0.055 -0.0042,0.0296 -0.0127,0.0593 -0.0042,0.0296 -0.0085,0.0423 0,0 0.0042,0.0127 0.0085,0.0127 0.0042,0.0169 0,0.008 -0.0127,0.0466 -0.0085,0.0381 -0.0085,0.0466 0,0.004 -0.0042,0.0296 0,0.0212 -0.0042,0.0466 0,0.0254 -0.0042,0.0466 0,0.0212 -0.0042,0.0254 0,0.008 -0.0127,0.0339 -0.0085,0.0212 -0.02117,0.0466 -0.0127,0.0254 -0.0254,0.0508 -0.0085,0.0254 -0.0085,0.0296 -0.0085,0.0212 -0.0254,0.0677 -0.01693,0.0466 -0.02117,0.0593 -0.0085,0.008 -0.0127,0.0466 -0.0042,0.0339 -0.0042,0.0423 -0.0042,0.0127 -0.01693,0.0381 -0.0085,0.0212 -0.0085,0.0296 0,0.004 -0.0127,0.0296 -0.0127,0.0212 -0.0254,0.0466 -0.0127,0.0254 -0.0254,0.0508 -0.0085,0.0254 -0.0085,0.0296 0,0.004 -0.0085,0.0423 -0.0085,0.0339 -0.0127,0.0508 0,0.004 -0.0042,0.0254 0,0.0169 -0.0042,0.0381 -0.0042,0.0212 -0.0085,0.0423 0,0.0169 0,0.0212 0,0.004 -0.0085,0.0254 -0.0042,0.0212 -0.0127,0.0466 -0.0042,0.0212 -0.0127,0.0466 -0.0042,0.0212 -0.0085,0.0339 -0.0042,0.008 -0.0127,0.0339 -0.0085,0.0254 -0.0127,0.0296 -0.0085,0.0339 -0.02963,0.0889 -0.01693,0.055 -0.0381,0.11007 -0.01693,0.055 -0.02963,0.1016 -0.0127,0.0423 -0.0127,0.0466 0,0.008 -0.0085,0.0381 -0.0042,0.0254 -0.0127,0.0593 -0.0085,0.0296 -0.01693,0.0593 -0.0042,0.0254 -0.0042,0.0296 -0.0042,0.004 -0.0127,0.0339 -0.0085,0.0254 -0.02117,0.0593 -0.0085,0.0296 -0.01693,0.0593 -0.0085,0.0296 -0.0127,0.0339 -0.0042,0.008 -0.0127,0.0381 -0.0042,0.0254 -0.0127,0.0593 -0.0042,0.0296 -0.0127,0.0593 -0.0042,0.0254 -0.0042,0.0296 -0.0042,0.0127 -0.01693,0.055 -0.0085,0.0423 -0.0254,0.0931 -0.0127,0.0466 -0.0254,0.0931 -0.0085,0.0466 -0.0127,0.072 -0.0042,0.008 -0.01693,0.0423 -0.0085,0.0296 -0.02117,0.0677 -0.0085,0.0339 -0.02117,0.0635 -0.0085,0.0296 -0.0085,0.0381 -0.0042,0.0127 -0.0127,0.0508 -0.0085,0.0339 -0.0085,0.0466 0,0.004 -0.0042,0.0212 -0.0042,0.0169 -0.0085,0.0381 0,0.0212 -0.0042,0.0423 0,0.0212 0,0.0254 0.0042,0 -0.0085,0.0296 -0.0127,0.0254 -0.01693,0.0296 -0.0085,0.0254 -0.02117,0.0762 -0.0127,0.0466 -0.0254,0.0974 -0.0127,0.0466 -0.0254,0.0889 -0.0085,0.0381 -0.0085,0.0466 0,0.004 -0.0042,0.0254 0,0.0169 -0.0042,0.0381 -0.0042,0.0212 -0.0085,0.0381 0,0.0169 0,0.0212 -0.0042,0.008 -0.0127,0.0254 -0.0042,0.0169 -0.0127,0.0381 -0.0085,0.0212 -0.01693,0.0423 -0.0042,0.0169 -0.0042,0.0212 -0.0042,0.008 -0.0085,0.0423 -0.0042,0.0296 -0.0127,0.0677 -0.0042,0.0381 -0.0085,0.0762 -0.0042,0.0381 -0.0085,0.0593 0,0.0254 -0.0042,0.0762 -0.0042,0.0466 -0.0085,0.0974 -0.0042,0.0466 -0.0085,0.0847 -0.0042,0.0381 -0.0042,0.0466 0.0042,0.004 0.0085,0.0381 0,0.0296 0.0042,0.0466 z"
         id="path1153"
         style="fill:#221500;fill-opacity:1" />
      <path
         d="m 39.434001,118.99517 0.0889,0.11854 0.02963,0.0296 q 0.0085,0.004 0.04233,0.0127 0.0381,0.0127 0.0508,0.0169 h 0.02963 0.02963 q 0.02117,-0.0127 0.0635,-0.0593 0.04657,-0.0466 0.05503,-0.0593 0,-0.004 0,-0.0254 0.0042,-0.0169 0.0042,-0.0296 0,-0.008 -0.0042,-0.0381 0,-0.0254 0,-0.0296 0,-0.008 -0.01693,-0.0466 -0.0127,-0.0339 -0.0127,-0.0423 v -0.0423 -0.0466 q 0.0042,-0.0254 0.0127,-0.0847 0.0085,-0.0593 0.01693,-0.12277 0.0085,-0.0677 0.01693,-0.127 0.0085,-0.0593 0.0127,-0.0847 0,-0.004 0.0042,-0.0212 0.0085,-0.0212 0.0127,-0.0381 0.0042,-0.0212 0.0085,-0.0381 0.0042,-0.0212 0.0042,-0.0254 0.0042,-0.008 0.0127,-0.0508 0.0085,-0.0466 0.01693,-0.0974 0.0127,-0.0508 0.02117,-0.0931 0.0085,-0.0423 0.0085,-0.055 0,-0.004 0.0042,-0.0212 0.0085,-0.0212 0.0127,-0.0381 0.0042,-0.0212 0.0085,-0.0381 0.0042,-0.0212 0.0042,-0.0254 0.0042,-0.008 0.0127,-0.0466 0.0085,-0.0423 0.01693,-0.0847 0.0127,-0.0466 0.02117,-0.0847 0.0085,-0.0423 0.0127,-0.0508 0.0042,-0.0254 0.0127,-0.0635 0.0085,-0.0381 0.01693,-0.0762 0.0127,-0.0381 0.02117,-0.0677 0.0085,-0.0296 0.0085,-0.0339 0.0042,-0.0127 0.0254,-0.0635 0.02117,-0.055 0.04657,-0.1143 0.0254,-0.0635 0.04657,-0.1143 0.0254,-0.055 0.02963,-0.0677 0,-0.004 0.0042,-0.0254 0.0042,-0.0212 0.0085,-0.0466 0.0085,-0.0254 0.0127,-0.0466 0.0042,-0.0254 0.0042,-0.0296 0.0085,-0.0212 0.02963,-0.0677 0.02117,-0.0508 0.04233,-0.10159 0.0254,-0.055 0.04657,-0.0974 0.0254,-0.0466 0.03387,-0.0635 0.0085,-0.0169 0.02963,-0.055 0.0254,-0.0381 0.05503,-0.0804 0.02963,-0.0466 0.05503,-0.0847 0.0254,-0.0381 0.0381,-0.0508 0,-0.004 0,-0.0212 0.0042,-0.0169 0.0042,-0.0212 0,-0.008 -0.0042,-0.0254 0,-0.0212 0,-0.0212 -0.0042,-0.008 -0.02963,-0.0423 -0.02117,-0.0339 -0.02963,-0.0466 -0.01693,-0.0212 -0.0508,-0.055 -0.03387,-0.0339 -0.0381,-0.0381 h -0.06773 -0.08467 q -0.0085,0.004 -0.04233,0.0169 -0.03387,0.008 -0.04657,0.0169 -0.0042,0 -0.01693,0.0127 -0.0085,0.008 -0.0127,0.0169 -0.0085,0.008 -0.02963,0.055 -0.02117,0.0466 -0.02963,0.0635 -0.0042,0.008 -0.01693,0.0423 -0.0085,0.0339 -0.0127,0.0466 0,0.004 -0.0085,0.0254 -0.0042,0.0169 -0.0085,0.0381 -0.0042,0.0169 -0.0085,0.0339 -0.0042,0.0169 -0.0042,0.0212 -0.0085,0.0169 -0.02117,0.0508 -0.0085,0.0339 -0.0085,0.0423 -0.0085,0.008 -0.03387,0.0593 -0.02117,0.0508 -0.02963,0.0593 0,0.008 -0.0127,0.0466 -0.0127,0.0339 -0.01693,0.0423 0,0.008 -0.0127,0.0296 -0.0127,0.0212 -0.02963,0.0466 -0.01693,0.0254 -0.02963,0.0508 -0.0127,0.0212 -0.01693,0.0254 -0.0042,0.008 -0.0042,0.0466 0.0042,0.0339 0.0042,0.0423 0,0.004 -0.0127,0.0508 -0.0085,0.0466 -0.01693,0.0677 0,0.008 -0.0127,0.0423 -0.0085,0.0296 -0.01693,0.0635 -0.0085,0.0339 -0.02117,0.0677 -0.0085,0.0296 -0.0085,0.0381 -0.0042,0.008 -0.01693,0.0593 -0.0085,0.0508 -0.0127,0.0593 -0.0042,0.008 -0.01693,0.0466 -0.0127,0.0339 -0.0127,0.0423 0,0.008 -0.0042,0.0339 -0.0042,0.0254 -0.0127,0.0593 -0.0042,0.0296 -0.0085,0.0593 -0.0042,0.0254 -0.0042,0.0296 -0.0042,0.0169 -0.02963,0.0847 -0.02117,0.0635 -0.04657,0.1397 -0.0254,0.0762 -0.0508,0.14393 -0.02117,0.0635 -0.0254,0.0804 -0.0042,0.0169 -0.0127,0.0804 -0.0085,0.0593 -0.01693,0.13123 -0.0085,0.0677 -0.01693,0.13123 -0.0085,0.0593 -0.0127,0.0762 0,0.008 -0.0042,0.0339 -0.0085,0.0254 -0.0127,0.055 -0.0042,0.0296 -0.0085,0.0593 -0.0042,0.0254 -0.0042,0.0339 0,0 0,0.0254 0,0.0212 0,0.055 -0.0042,0.0296 -0.0042,0.0635 0,0.0339 0,0.0508 0,0.008 0,0.0339 0,0.0296 0.0042,0.0593 0,0.0339 0,0.0593 0,0.0296 0,0.0423 z m 0.956733,-4.34339 q 0,0.008 0,0.0339 0,0.0212 0.0042,0.0212 0,0.004 0.0127,0.0169 0.0127,0.0127 0.01693,0.0127 0.0042,0.008 0.0127,0.0339 0.0127,0.0212 0.01693,0.0296 0,0.008 0.0127,0.0466 0.0127,0.0339 0.01693,0.0423 0.0085,0.008 0.0381,0.0423 0.03387,0.0339 0.0508,0.0466 0.0085,0.008 0.02963,0.0212 0.0254,0.008 0.02963,0.008 0.0085,0 0.02963,-0.008 0.02117,-0.0127 0.02963,-0.0212 0.01693,-0.008 0.0508,-0.0423 0.03387,-0.0381 0.04233,-0.0466 0,-0.004 0.0085,-0.0212 0.0085,-0.0212 0.01693,-0.0381 0.0127,-0.0212 0.02117,-0.0381 0.0085,-0.0212 0.0127,-0.0254 0.0042,-0.008 0.02963,-0.0423 0.0254,-0.0381 0.02963,-0.0466 0.0085,-0.008 0.01693,-0.0296 0.0127,-0.0254 0.0127,-0.0296 v -0.0423 -0.0466 q -0.0042,-0.0212 -0.01693,-0.0635 -0.0085,-0.0466 -0.0127,-0.055 -0.0085,-0.008 -0.02963,-0.0296 -0.02117,-0.0254 -0.02963,-0.0339 -0.0085,0 -0.03387,0.004 -0.02117,0 -0.0254,-0.004 -0.0085,-0.004 -0.03387,-0.0296 -0.02117,-0.0254 -0.02963,-0.0296 h -0.0254 -0.03387 q -0.0127,0.004 -0.04657,0.0169 -0.03387,0.008 -0.04233,0.0127 l -0.05927,0.0593 q -0.0085,0.008 -0.0254,0.0296 -0.0127,0.0169 -0.0254,0.0381 -0.0127,0.0169 -0.0254,0.0339 -0.0127,0.0169 -0.0127,0.0212 -0.0085,0.008 -0.02117,0.0423 -0.0085,0.0339 -0.0085,0.0466 -0.0042,0.004 -0.0042,0.0296 0,0.0212 0,0.0339 z"
         id="path1155"
         style="fill:#221500;fill-opacity:1" />
      <path
         d="m 40.636262,119.33384 q 0,0.0212 0.0042,0.0593 0,0.0423 0,0.0423 0,0.0127 0.0127,0.0466 0.0085,0.0381 0.01693,0.0466 0.0127,0.0212 0.04657,0.0677 0.03387,0.0466 0.04233,0.0508 0.0042,0 0.01693,0 0.01693,0.004 0.0254,0.004 0.0085,0 0.0254,-0.004 0.02117,0 0.0254,0 0.0085,-0.004 0.04233,-0.0127 0.0381,-0.008 0.04657,-0.0169 l 0.0889,-0.0593 q 0.0085,-0.004 0.0254,-0.0254 0.01693,-0.0169 0.03387,-0.0381 0.02117,-0.0169 0.0381,-0.0339 0.01693,-0.0169 0.02117,-0.0254 0.0042,0 0.0127,-0.0254 0.0127,-0.0212 0.01693,-0.0339 0.0042,-0.004 0.0127,-0.0254 0.0085,-0.0212 0.01693,-0.0466 0.0127,-0.0254 0.02117,-0.0508 0.0085,-0.0212 0.0127,-0.0254 0.0042,-0.008 0.02117,-0.0466 0.01693,-0.0339 0.0381,-0.0762 0.02117,-0.0381 0.0381,-0.0762 0.01693,-0.0339 0.02117,-0.0423 0.0042,-0.008 0.0127,-0.0677 0.0127,-0.0593 0.01693,-0.0804 v -0.0508 -0.0381 q -0.0042,-0.008 -0.02963,-0.0296 -0.02117,-0.0254 -0.02963,-0.0339 h -0.02963 -0.02963 q -0.0085,0.004 -0.0254,0.0254 -0.01693,0.0169 -0.0381,0.0381 -0.02117,0.0169 -0.0381,0.0381 -0.01693,0.0169 -0.02117,0.0212 h -0.0127 -0.01693 q 0,-0.0127 0.0042,-0.0381 0.0042,-0.0254 0.0085,-0.0508 0.0085,-0.0296 0.0127,-0.055 0.0042,-0.0254 0.0042,-0.0381 0.0042,-0.008 0.01693,-0.0593 0.0127,-0.0508 0.0127,-0.0593 0,-0.004 0.0042,-0.0254 0.0085,-0.0254 0.0127,-0.0508 0.0042,-0.0254 0.0085,-0.0466 0.0085,-0.0212 0.0085,-0.0254 0.0042,-0.0296 0.01693,-0.0847 0.01693,-0.055 0.02963,-0.11007 0.01693,-0.0593 0.0254,-0.10583 0.0127,-0.0466 0.01693,-0.0593 0,-0.008 0.0127,-0.0296 0.0127,-0.0254 0.01693,-0.0339 0.0042,-0.008 0.0127,-0.0466 0.0085,-0.0423 0.01693,-0.0847 0.0127,-0.0466 0.02117,-0.0847 0.0085,-0.0423 0.0085,-0.0508 0.0085,-0.0212 0.01693,-0.0677 0.0127,-0.0466 0.0127,-0.055 0.0042,-0.004 0.01693,-0.0254 0.0127,-0.0254 0.0127,-0.0339 0.0042,-0.0127 0.01693,-0.0635 0.0127,-0.055 0.0254,-0.1143 0.01693,-0.0593 0.02963,-0.1143 0.0127,-0.055 0.01693,-0.0677 0.0042,-0.008 0.0127,-0.0423 0.0127,-0.0339 0.01693,-0.0466 0.0042,-0.0127 0.02117,-0.055 0.02117,-0.0423 0.0381,-0.0931 0.02117,-0.0508 0.0381,-0.0931 0.02117,-0.0466 0.0254,-0.0593 0.0042,-0.0127 0.02117,-0.072 0.01693,-0.0635 0.0381,-0.13546 0.02117,-0.072 0.0381,-0.13124 0.01693,-0.0635 0.02117,-0.0804 0.0042,-0.0169 0.01693,-0.055 0.0127,-0.0381 0.0254,-0.0804 0.01693,-0.0423 0.02963,-0.0804 0.0127,-0.0381 0.01693,-0.055 0.0042,-0.004 0.0127,-0.0254 0.0127,-0.0254 0.01693,-0.0339 0.0085,-0.008 0.02963,-0.0423 0.0254,-0.0381 0.03387,-0.0466 0,-0.004 0.0085,-0.0127 0.0127,-0.0127 0.02117,-0.0169 0.0127,0 0.04233,0.004 0.02963,0 0.05927,0 0.03387,0 0.0635,0 0.02963,-0.004 0.04233,-0.004 0.0085,0 0.05503,-0.008 0.04657,-0.0127 0.06773,-0.0212 0.05503,-0.0212 0.0889,-0.0593 0.0127,-0.0169 0.03387,-0.0508 0.0254,-0.0339 0.0254,-0.0381 0,-0.004 0,-0.0254 0.0042,-0.0212 0.0042,-0.0339 0,-0.0127 -0.0042,-0.0339 0,-0.0254 0,-0.0296 0,-0.008 -0.0127,-0.0296 -0.0085,-0.0212 -0.01693,-0.0296 -0.0085,-0.008 -0.02963,-0.0296 -0.02117,-0.0212 -0.04657,-0.0423 -0.02117,-0.0254 -0.04657,-0.0466 -0.02117,-0.0212 -0.02963,-0.0296 -0.0042,-0.004 -0.02963,-0.0127 -0.0254,-0.0127 -0.02963,-0.0169 0,-0.004 -0.0042,-0.0169 0,-0.0169 0,-0.0254 0,-0.008 0,-0.0254 0.0042,-0.0212 0.0042,-0.0254 0,-0.004 0.0085,-0.0254 0.0127,-0.0212 0.02117,-0.0466 0.0127,-0.0254 0.02117,-0.0466 0.0085,-0.0212 0.0085,-0.0296 0.0042,-0.004 0.0042,-0.0339 0,-0.0296 0,-0.0466 0,-0.0127 0,-0.0381 0,-0.0296 -0.0042,-0.0296 -0.0042,-0.0127 -0.0381,-0.055 -0.02963,-0.0466 -0.0508,-0.0677 -0.0085,-0.008 -0.02963,-0.0169 -0.02117,-0.0127 -0.02963,-0.0127 h -0.0889 -0.0889 q -0.0085,0 -0.03387,0.0127 -0.02117,0.008 -0.02963,0.0169 l -0.02963,0.0296 q -0.0127,0.0212 -0.0381,0.055 -0.02117,0.0339 -0.02117,0.0381 0,0.008 0,0.0339 0,0.0254 0,0.055 0,0.0296 0,0.0593 0,0.0254 0,0.0296 0,0.0212 -0.0127,0.0804 -0.0085,0.055 -0.01693,0.0677 -0.0042,0.0169 -0.01693,0.0466 -0.0127,0.0254 -0.02963,0.055 -0.0127,0.0296 -0.0254,0.055 -0.0127,0.0212 -0.01693,0.0254 -0.0042,0 -0.02117,0.008 -0.0127,0.008 -0.03387,0.0212 -0.01693,0.008 -0.03387,0.0169 -0.01693,0.008 -0.02963,0.0127 -0.0085,0.004 -0.0635,0.0169 -0.0508,0.008 -0.05927,0.0127 -0.0127,0.004 -0.04233,0.0169 -0.0254,0.008 -0.05503,0.0169 -0.0254,0.008 -0.0508,0.0169 -0.0254,0.008 -0.02963,0.008 -0.0042,0 -0.0254,0.0127 -0.01693,0.008 -0.0381,0.0212 -0.01693,0.008 -0.0381,0.0169 -0.01693,0.008 -0.02117,0.008 -0.0085,0.004 -0.0508,0.008 -0.0381,0.004 -0.08467,0.0127 -0.04233,0.004 -0.08467,0.008 -0.0381,0.004 -0.04657,0.004 -0.02117,0 -0.06773,0.0127 -0.04657,0.008 -0.05503,0.0169 -0.01693,0.008 -0.0508,0.0296 -0.02963,0.0212 -0.0381,0.0296 -0.0042,0.004 -0.0127,0.0508 -0.0127,0.0466 -0.01693,0.0677 v 0.0296 0.0296 q 0.0042,0.0127 0.01693,0.0593 0.0085,0.0466 0.0127,0.0635 l 0.02963,0.0593 q 0.0085,0.0127 0.0254,0.0339 0.02117,0.0169 0.0381,0.0381 0.02117,0.0169 0.0381,0.0339 0.01693,0.0127 0.02117,0.0127 0,0 0.0254,0.004 0.02963,0 0.04657,0 0.0127,0 0.04233,0 0.02963,-0.004 0.03387,-0.004 0.0042,0 0.03387,-0.0127 0.03387,-0.0169 0.07197,-0.0339 0.0381,-0.0212 0.0762,-0.0381 0.0381,-0.0212 0.05927,-0.0339 0.0127,-0.008 0.04657,-0.0296 0.03387,-0.0212 0.07197,-0.0423 0.0381,-0.0254 0.07197,-0.0466 0.03387,-0.0254 0.04657,-0.0339 h 0.0254 q 0,0.004 0.0042,0.0169 0.0042,0.008 0,0.0127 0,0.008 -0.0127,0.0466 -0.0127,0.0381 -0.01693,0.0466 0,0.008 -0.0085,0.0423 -0.0085,0.0339 -0.02117,0.0762 -0.0085,0.0423 -0.01693,0.0762 -0.0085,0.0339 -0.0127,0.0423 -0.0042,0.008 -0.01693,0.0466 -0.0085,0.0339 -0.0127,0.0466 0,0.004 -0.0127,0.0254 -0.0085,0.0212 -0.01693,0.0466 -0.0085,0.0254 -0.02117,0.0508 -0.0085,0.0212 -0.0085,0.0254 -0.0042,0.008 -0.0127,0.0423 -0.0085,0.0339 -0.02117,0.0762 -0.0085,0.0423 -0.01693,0.0804 -0.0085,0.0339 -0.0085,0.0423 -0.0042,0.008 -0.01693,0.0466 -0.0127,0.0339 -0.0127,0.0423 -0.0042,0.008 -0.0127,0.0423 -0.0085,0.0339 -0.02117,0.0762 -0.0085,0.0423 -0.01693,0.0762 -0.0085,0.0339 -0.0127,0.0423 0,0.008 -0.0127,0.0466 -0.0085,0.0339 -0.01693,0.0466 0,0.004 -0.0127,0.0254 -0.0085,0.0212 -0.01693,0.0466 -0.0085,0.0254 -0.02117,0.0508 -0.0085,0.0212 -0.0085,0.0254 -0.0042,0.0169 -0.02117,0.0804 -0.01693,0.0593 -0.0381,0.13123 -0.02117,0.0677 -0.0381,0.13124 -0.01693,0.0593 -0.02117,0.0762 0,0.008 -0.0127,0.0339 -0.0085,0.0254 -0.01693,0.055 -0.0085,0.0296 -0.02117,0.0593 -0.0085,0.0254 -0.0085,0.0339 0,0.004 -0.0042,0.0296 -0.0042,0.0212 -0.0127,0.0466 -0.0042,0.0254 -0.0085,0.0466 -0.0042,0.0212 -0.0042,0.0254 -0.0042,0.008 -0.0127,0.0423 -0.0085,0.0296 -0.02117,0.0635 -0.0085,0.0339 -0.01693,0.0677 -0.0085,0.0296 -0.0127,0.0381 0,0.004 -0.0042,0.0254 -0.0042,0.0212 -0.0085,0.0466 -0.0042,0.0254 -0.0127,0.0508 -0.0042,0.0212 -0.0042,0.0254 0,0.008 -0.0127,0.0593 -0.0127,0.0508 -0.01693,0.0593 -0.0042,0.0212 -0.01693,0.0804 -0.0085,0.055 -0.0127,0.072 0,0.008 -0.0042,0.0381 -0.0042,0.0296 -0.0127,0.0635 -0.0042,0.0381 -0.0085,0.0677 -0.0042,0.0296 -0.0042,0.0381 0,0.008 -0.0127,0.0423 -0.0127,0.0381 -0.01693,0.0466 -0.0042,0.0127 -0.0085,0.0339 -0.0042,0.0254 -0.0085,0.0508 -0.0042,0.0254 -0.0085,0.0423 -0.0042,0.0212 -0.0042,0.0254 0,0.004 0,0.0423 -0.0042,0.0423 -0.0042,0.0635 z"
         id="path1157"
         style="fill:#221500;fill-opacity:1" />
      <path
         d="m 42.40156,119.29997 q 0,-0.0169 -0.0042,-0.0466 0,-0.0296 0,-0.0339 0,-0.008 0.0042,-0.0423 0.0085,-0.0339 0.01693,-0.0508 0.0085,-0.0212 0.02963,-0.072 0.02117,-0.0466 0.02117,-0.055 0.0042,-0.004 0.0254,-0.0296 0.02117,-0.0212 0.04657,-0.0466 0.0254,-0.0254 0.04233,-0.0508 0.02117,-0.0212 0.0254,-0.0296 0.0085,-0.0127 0.0381,-0.0677 0.03387,-0.055 0.06773,-0.11853 0.03387,-0.0635 0.0635,-0.11854 0.03387,-0.055 0.04233,-0.0677 0.0085,-0.0127 0.0508,-0.0677 0.04657,-0.055 0.08043,-0.0889 0.0127,-0.0169 0.02117,-0.0254 0.0085,-0.008 0.0127,-0.0127 0.0085,-0.008 0.02963,-0.0466 0.02117,-0.0381 0.02117,-0.0466 0.0042,-0.004 0.01693,-0.0212 0.0127,-0.0212 0.0254,-0.0423 0.0127,-0.0212 0.0254,-0.0381 0.0127,-0.0212 0.01693,-0.0254 0,0 0.0127,-0.0212 0.0127,-0.0254 0.0254,-0.055 0.01693,-0.0296 0.0254,-0.055 0.0127,-0.0254 0.0127,-0.0296 0.0042,-0.004 0.01693,-0.0254 0.01693,-0.0212 0.03387,-0.0466 0.02117,-0.0296 0.0381,-0.0508 0.01693,-0.0254 0.02117,-0.0339 0.0042,-0.008 0.01693,-0.0381 0.0127,-0.0339 0.02963,-0.072 0.01693,-0.0381 0.03387,-0.0677 0.01693,-0.0339 0.0254,-0.0423 0,-0.004 0.01693,-0.0254 0.01693,-0.0254 0.03387,-0.0508 0.02117,-0.0296 0.0381,-0.0508 0.01693,-0.0254 0.01693,-0.0296 0.0042,-0.004 0.0127,-0.0296 0.0127,-0.0296 0.0254,-0.0593 0.0127,-0.0339 0.02117,-0.0593 0.0127,-0.0296 0.01693,-0.0381 0,-0.008 0.02117,-0.0423 0.02117,-0.0381 0.02963,-0.0508 0.0042,-0.0127 0.01693,-0.0296 0.0127,-0.0212 0.0254,-0.0423 0.01693,-0.0212 0.02963,-0.0381 0.0127,-0.0169 0.0127,-0.0169 0,-0.008 0.0254,-0.0339 0.0254,-0.0254 0.0254,-0.0339 0.0042,-0.008 0.0127,-0.0296 0.0127,-0.0212 0.0254,-0.0423 0.0127,-0.0254 0.0254,-0.0466 0.0127,-0.0212 0.01693,-0.0339 h -0.0762 q -0.0127,0 -0.04233,0.004 -0.02963,0.004 -0.02963,0.004 -0.0085,0.004 -0.04657,0.0212 -0.0381,0.0127 -0.04657,0.0169 -0.0085,0 -0.05927,0.0212 -0.04657,0.0169 -0.05503,0.0169 -0.0042,0.004 -0.02963,0.0212 -0.02117,0.0127 -0.0254,0.0127 -0.0085,0.004 -0.04657,0.0169 -0.03387,0.008 -0.07197,0.0212 -0.0381,0.0127 -0.0762,0.0254 -0.03387,0.008 -0.04233,0.0127 -0.0042,0.004 -0.0381,0.0254 -0.02963,0.0212 -0.07197,0.0508 -0.0381,0.0254 -0.08043,0.055 -0.04233,0.0254 -0.06773,0.0423 -0.0085,0.008 -0.04233,0.0339 -0.03387,0.0254 -0.04233,0.0339 -0.0042,0.004 -0.01693,0.0169 -0.0085,0.0127 -0.0127,0.0127 -0.0127,0.0127 -0.04233,0.0381 -0.0254,0.0212 -0.05503,0.0423 -0.0254,0.0212 -0.04657,0.0381 -0.02117,0.0169 -0.0254,0.0212 h -0.02963 q -0.02117,0 -0.02963,0.004 -0.0085,0.004 -0.03387,0.0169 -0.03387,0.0212 -0.08043,0.0466 -0.04233,0.0254 -0.05503,0.0381 -0.0085,-0.004 -0.03387,-0.0127 -0.0254,-0.008 -0.02963,-0.0127 -0.0127,-0.008 -0.0508,-0.0423 -0.0381,-0.0339 -0.0508,-0.0423 -0.0042,-0.004 -0.01693,-0.0254 -0.0085,-0.0254 -0.01693,-0.0339 -0.0042,-0.008 -0.01693,-0.0381 -0.0127,-0.0339 -0.01693,-0.0466 -0.0085,-0.0254 -0.0254,-0.072 -0.0127,-0.0466 -0.0127,-0.0466 0,-0.008 0.01693,-0.055 0.02117,-0.0466 0.02963,-0.072 l 0.02963,-0.0296 q 0.0085,-0.004 0.02963,-0.0169 0.02117,-0.0127 0.0254,-0.0169 0.01693,-0.008 0.05927,-0.0466 0.04657,-0.0423 0.05927,-0.0508 0.01693,0 0.05927,0 0.04233,-0.004 0.0889,-0.008 0.04657,-0.004 0.0889,-0.008 0.04233,-0.004 0.05927,-0.008 0.0042,0 0.0254,-0.008 0.02117,-0.0127 0.04657,-0.0254 0.0254,-0.0127 0.04657,-0.0212 0.02117,-0.0127 0.0254,-0.0127 0.0085,-0.004 0.04233,-0.0212 0.0381,-0.0169 0.04657,-0.0169 0.0042,-0.004 0.0254,-0.0127 0.02117,-0.0127 0.04657,-0.0254 0.0254,-0.0127 0.04657,-0.0212 0.02117,-0.0127 0.0254,-0.0169 0.0085,0 0.0508,-0.0127 0.04657,-0.0169 0.06773,-0.0254 0.0042,0 0.0254,-0.004 0.0254,-0.008 0.04657,-0.0127 0.0254,-0.008 0.04657,-0.0127 0.02117,-0.008 0.02963,-0.0127 0.0042,0 0.0254,-0.0127 0.0254,-0.0127 0.03387,-0.0212 0.0085,-0.004 0.03387,-0.0127 0.0254,-0.0127 0.0508,-0.0254 0.02963,-0.0127 0.0508,-0.0212 0.0254,-0.008 0.03387,-0.0127 l 0.1524,-0.0381 q 0.0042,-0.008 0.05927,-0.0339 0.05503,-0.0254 0.08467,-0.0381 0.0127,-0.008 0.04233,-0.0212 0.02963,-0.0169 0.05927,-0.0296 0.03387,-0.0169 0.0635,-0.0339 0.02963,-0.0169 0.0381,-0.0254 0.0254,-0.0127 0.04233,-0.0254 0.01693,-0.0127 0.03387,-0.0254 0.02117,-0.0212 0.0508,-0.0466 0.02963,-0.0254 0.0381,-0.0339 h 0.01693 q 0,0 0.0042,0 0.0085,-0.004 0.0127,-0.004 0.01693,0 0.04233,0.004 0.02963,0 0.05927,0.004 0.02963,0.004 0.0508,0.008 0.0254,0 0.02963,0 0.0085,0.004 0.02963,0.0127 0.02117,0.008 0.02963,0.0127 0.0085,0.008 0.02963,0.0296 0.0254,0.0169 0.03387,0.0254 0.01693,0.0169 0.04233,0.0508 0.0254,0.0296 0.02963,0.0381 0,0 0,0.0212 0.0042,0.0212 0.0042,0.0339 0,0.0127 0,0.0381 0.0042,0.0212 0.0042,0.0254 -0.0042,0.008 -0.0127,0.0296 -0.0085,0.0212 -0.0127,0.0296 -0.0085,0.008 -0.02963,0.0339 -0.02117,0.0254 -0.02963,0.0296 -0.0042,0.004 -0.02963,0.0169 -0.02117,0.0127 -0.0254,0.0169 -0.0042,0.008 -0.0127,0.0339 -0.0085,0.0254 -0.0127,0.0339 -0.0085,0.008 -0.04233,0.0466 -0.02963,0.0381 -0.0381,0.0466 -0.0085,0.0127 -0.02963,0.0423 -0.01693,0.0254 -0.04233,0.0593 -0.02117,0.0296 -0.04233,0.055 -0.01693,0.0254 -0.0254,0.0339 -0.0042,0.008 -0.0254,0.0508 -0.01693,0.0381 -0.0254,0.0466 -0.0085,0.008 -0.04233,0.0466 -0.03387,0.0381 -0.04233,0.0466 -0.0042,0.0127 -0.01693,0.0339 -0.0127,0.0169 -0.0254,0.0381 -0.0127,0.0169 -0.0254,0.0339 -0.0085,0.0169 -0.0085,0.0212 -0.0085,0.008 -0.02963,0.0635 -0.01693,0.055 -0.0254,0.0635 -0.0042,0.008 -0.0254,0.0466 -0.01693,0.0381 -0.0254,0.0466 0,0.004 -0.0127,0.0169 -0.0127,0.0127 -0.01693,0.0169 -0.0042,0.008 -0.02963,0.0508 -0.02117,0.0423 -0.0508,0.0889 -0.0254,0.0466 -0.0508,0.0889 -0.02117,0.0423 -0.0254,0.055 -0.0042,0.004 -0.01693,0.0254 -0.0127,0.0169 -0.0254,0.0381 -0.0127,0.0169 -0.0254,0.0381 -0.0127,0.0169 -0.01693,0.0212 0,0.008 -0.0085,0.0508 -0.0085,0.0381 -0.0127,0.0423 -0.0042,0.0127 -0.0254,0.0508 -0.01693,0.0381 -0.0254,0.0466 0.0127,0 0.01693,-0.004 h 0.0127 q 0.0085,-0.004 0.0381,-0.0296 0.03387,-0.0254 0.0508,-0.0339 0,-0.004 0.01693,-0.0169 0.01693,-0.0169 0.03387,-0.0339 0.02117,-0.0212 0.0381,-0.0339 0.01693,-0.0169 0.02117,-0.0212 0.0085,-0.004 0.04233,-0.0212 0.03387,-0.0212 0.07197,-0.0423 0.04233,-0.0212 0.0762,-0.0423 0.03387,-0.0212 0.04233,-0.0296 0.0042,-0.004 0.0254,-0.0254 0.0254,-0.0212 0.0508,-0.0423 0.02963,-0.0212 0.05503,-0.0381 0.0254,-0.0212 0.03387,-0.0254 0.0085,-0.008 0.02963,-0.0212 0.02117,-0.0127 0.02963,-0.0127 0.0042,-0.004 0.02963,-0.0127 0.02963,-0.0127 0.05927,-0.0254 0.02963,-0.0127 0.05503,-0.0212 0.0254,-0.0127 0.02963,-0.0169 0.0085,-0.004 0.04233,-0.0339 0.03387,-0.0296 0.04233,-0.0339 0.0085,-0.004 0.04233,-0.0169 0.0381,-0.0127 0.04657,-0.0169 0.0127,-0.008 0.0508,-0.0339 0.04233,-0.0254 0.08467,-0.0508 0.04657,-0.0296 0.0889,-0.0508 0.04233,-0.0254 0.0635,-0.0381 0.0085,-0.004 0.0381,-0.0254 0.02963,-0.0212 0.0635,-0.0466 0.03387,-0.0254 0.05927,-0.0423 0.02963,-0.0212 0.0381,-0.0254 0.0042,0 0.03387,-0.004 0.03387,-0.004 0.0508,-0.004 0.0127,-0.004 0.05503,-0.004 h 0.0381 q 0.0042,0 0.0381,0.0212 0.0381,0.0212 0.05927,0.0339 0.0042,0.004 0.01693,0.0169 0.0127,0.008 0.01693,0.0127 0.0085,0.008 0.01693,0.0423 0.0127,0.0339 0.01693,0.0423 0.0042,0.004 0.0042,0.0296 0,0.0254 0.0042,0.0339 0,0.008 0,0.0339 0.0042,0.0212 0.0042,0.0212 -0.0042,0.008 -0.0254,0.0593 -0.01693,0.0466 -0.0254,0.0677 -0.0085,0.008 -0.0381,0.0593 -0.02963,0.0466 -0.04657,0.0677 -0.0085,0.0296 -0.0254,0.0296 -0.0085,0.008 -0.04657,0.0254 -0.03387,0.0127 -0.04233,0.0127 0,0 -0.0254,0.004 -0.02117,0 -0.03387,0 -0.0085,0 -0.03387,0.004 -0.0254,0 -0.0254,0 -0.0085,0 -0.0635,-0.008 -0.0508,-0.0127 -0.05927,-0.0127 0,0 -0.0127,0.004 -0.0085,0 -0.01693,0 h -0.02963 q -0.02117,0.008 -0.05927,0.0254 -0.0381,0.0169 -0.08043,0.0339 -0.04233,0.0169 -0.0762,0.0339 -0.03387,0.0127 -0.04657,0.0169 -0.02117,0.0127 -0.0762,0.0466 -0.05503,0.0296 -0.118533,0.072 -0.0635,0.0381 -0.122767,0.0762 -0.05927,0.0339 -0.08467,0.0508 -0.0042,0 -0.0254,0.0169 -0.02117,0.0127 -0.04657,0.0381 -0.0254,0.0212 -0.05503,0.0423 -0.0254,0.0212 -0.04233,0.0339 -0.0085,0.008 -0.0381,0.0339 -0.0254,0.0212 -0.05927,0.0508 -0.03387,0.0254 -0.0635,0.0508 -0.02963,0.0254 -0.0381,0.0339 -0.0042,0.004 -0.0254,0.0212 -0.02117,0.0127 -0.04657,0.0296 -0.02117,0.0127 -0.04233,0.0296 -0.02117,0.0127 -0.0254,0.0169 -0.0085,0.004 -0.03387,0.0254 -0.02117,0.0212 -0.05503,0.0466 -0.02963,0.0254 -0.0635,0.055 -0.02963,0.0254 -0.04657,0.0381 -0.0042,0.004 -0.02117,0.0212 -0.01693,0.0127 -0.0381,0.0296 -0.01693,0.0169 -0.03387,0.0339 -0.01693,0.0127 -0.02117,0.0169 -0.0085,0.004 -0.04657,0.0339 -0.03387,0.0254 -0.0381,0.0339 -0.0042,0.004 -0.0254,0.0339 -0.02117,0.0254 -0.02963,0.0296 -0.0085,0.008 -0.04233,0.0296 -0.03387,0.0254 -0.04233,0.0296 -0.0042,0.004 -0.01693,0.0169 -0.0085,0.0127 -0.0127,0.0169 -0.0127,0.0212 -0.0381,0.055 -0.0254,0.0381 -0.05503,0.072 -0.0254,0.0381 -0.04657,0.0635 -0.02117,0.0296 -0.0254,0.0339 -0.0042,0.008 -0.02963,0.0466 -0.02117,0.0381 -0.0508,0.0804 -0.0254,0.0423 -0.0508,0.0804 -0.02117,0.0381 -0.0254,0.0466 -0.0085,0.004 -0.03387,0.0169 -0.0254,0.0169 -0.05503,0.0339 -0.02963,0.0169 -0.05503,0.0296 -0.0254,0.0169 -0.02963,0.0212 -0.0042,0 -0.01693,0.0169 -0.0085,0.0169 -0.0127,0.0169 0,0 -0.02117,0 -0.01693,0.004 -0.0254,0.008 -0.0085,0 -0.0254,-0.004 -0.01693,0 -0.01693,0 -0.01693,0 -0.06773,-0.0212 -0.04657,-0.0169 -0.05927,-0.0254 -0.0085,-0.008 -0.03387,-0.0423 -0.0254,-0.0339 -0.02963,-0.0423 -0.0042,-0.004 -0.0042,-0.0296 0,-0.0296 -0.0042,-0.0423 z"
         id="path1159"
         style="fill:#221500;fill-opacity:1" />
    </g>
  </g>
</svg>
