(export (version D)
  (design
    (source /Users/brett/Documents/KiCad/MSZAIC/MSZAIC_pcb/MSZAIC_pcb.sch)
    (date "Wednesday, December 16, 2020 at 03:57:42 pm")
    (tool "Eeschema (5.1.6-0-10_14)")
    (sheet (number 1) (name /) (tstamps /)
      (title_block
        (title "Sensor impedance analyzer board")
        (company "Menrva Research Group")
        (rev A)
        (date 2020-11-27)
        (source MSZAIC_pcb.sch)
        (comment (number 1) (value "Brett Hannigan"))
        (comment (number 2) (value ""))
        (comment (number 3) (value ""))
        (comment (number 4) (value "")))))
  (components
    (comp (ref U1)
      (value LMH6619MA_NOPB)
      (footprint LMH6619MA:LMH6619MA&slash_NOPB)
      (libsource (lib 2020-11-28_00-11-22) (part LMH6619MA_NOPB) (description ""))
      (sheetpath (names /) (tstamps /))
      (tstamp 5FC19B4F))
    (comp (ref J2)
      (value Conn_02x20_Odd_Even)
      (footprint Pin_Headers:Pin_Header_Straight_2x20_Pitch2.54mm)
      (datasheet ~)
      (libsource (lib Connector_Generic) (part Conn_02x20_Odd_Even) (description "Generic connector, double row, 02x20, odd/even pin numbering scheme (row 1 odd numbers, row 2 even numbers), script generated (kicad-library-utils/schlib/autogen/connector/)"))
      (sheetpath (names /) (tstamps /))
      (tstamp 5FC1A0A0))
    (comp (ref R1)
      (value 100k)
      (footprint Resistors_SMD:R_1206_HandSoldering)
      (datasheet ~)
      (libsource (lib Device) (part R) (description Resistor))
      (sheetpath (names /) (tstamps /))
      (tstamp 5FC23BB7))
    (comp (ref R2)
      (value 100k)
      (footprint Resistors_SMD:R_1206_HandSoldering)
      (datasheet ~)
      (libsource (lib Device) (part R) (description Resistor))
      (sheetpath (names /) (tstamps /))
      (tstamp 5FC24F02))
    (comp (ref R3)
      (value 10k)
      (footprint Resistors_SMD:R_1206_HandSoldering)
      (datasheet ~)
      (libsource (lib Device) (part R) (description Resistor))
      (sheetpath (names /) (tstamps /))
      (tstamp 5FC285C0))
    (comp (ref C1)
      (value 20p)
      (footprint Capacitors_SMD:C_1206_HandSoldering)
      (datasheet ~)
      (libsource (lib Device) (part C) (description "Unpolarized capacitor"))
      (sheetpath (names /) (tstamps /))
      (tstamp 5FC29695))
    (comp (ref R4)
      (value 10k)
      (footprint Resistors_SMD:R_1206_HandSoldering)
      (datasheet ~)
      (libsource (lib Device) (part R) (description Resistor))
      (sheetpath (names /) (tstamps /))
      (tstamp 5FC2FDB5))
    (comp (ref C2)
      (value 20p)
      (footprint Capacitors_SMD:C_1206_HandSoldering)
      (datasheet ~)
      (libsource (lib Device) (part C) (description "Unpolarized capacitor"))
      (sheetpath (names /) (tstamps /))
      (tstamp 5FC30682))
    (comp (ref J3)
      (value Conn_02x04_Odd_Even)
      (footprint Pin_Headers:Pin_Header_Straight_2x04_Pitch2.54mm)
      (datasheet ~)
      (libsource (lib Connector_Generic) (part Conn_02x04_Odd_Even) (description "Generic connector, double row, 02x04, odd/even pin numbering scheme (row 1 odd numbers, row 2 even numbers), script generated (kicad-library-utils/schlib/autogen/connector/)"))
      (sheetpath (names /) (tstamps /))
      (tstamp 5FC38F2E))
    (comp (ref R5)
      (value 10k)
      (footprint Resistors_SMD:R_1206_HandSoldering)
      (datasheet ~)
      (libsource (lib Device) (part R) (description Resistor))
      (sheetpath (names /) (tstamps /))
      (tstamp 5FC3BC13))
    (comp (ref R6)
      (value 1k)
      (footprint Resistors_SMD:R_1206_HandSoldering)
      (datasheet ~)
      (libsource (lib Device) (part R) (description Resistor))
      (sheetpath (names /) (tstamps /))
      (tstamp 5FC3C4D1))
    (comp (ref R7)
      (value 100)
      (footprint Resistors_SMD:R_1206_HandSoldering)
      (datasheet ~)
      (libsource (lib Device) (part R) (description Resistor))
      (sheetpath (names /) (tstamps /))
      (tstamp 5FC3C67B))
    (comp (ref R8)
      (value 10)
      (footprint Resistors_SMD:R_1206_HandSoldering)
      (datasheet ~)
      (libsource (lib Device) (part R) (description Resistor))
      (sheetpath (names /) (tstamps /))
      (tstamp 5FC3CB6D))
    (comp (ref TP2)
      (value I_EXC)
      (footprint Measurement_Points:Measurement_Point_Square-TH_Big)
      (datasheet ~)
      (libsource (lib Connector) (part TestPoint) (description "test point"))
      (sheetpath (names /) (tstamps /))
      (tstamp 5FC4E989))
    (comp (ref C9)
      (value 100n)
      (footprint Capacitors_SMD:C_1206_HandSoldering)
      (datasheet ~)
      (libsource (lib Device) (part C) (description "Unpolarized capacitor"))
      (sheetpath (names /) (tstamps /))
      (tstamp 5FCA200D))
    (comp (ref U4)
      (value TLE2426xD)
      (footprint TLE2426CD:TLE2426CD)
      (datasheet http://www.ti.com/lit/ds/symlink/tle2426.pdf)
      (libsource (lib Reference_Voltage) (part TLE2426xD) (description "Precision virtual ground, noise reduction pin, 4V to 40V input, SOIC-8"))
      (sheetpath (names /) (tstamps /))
      (tstamp 5FCB1F5B))
    (comp (ref C11)
      (value 1u)
      (footprint Capacitors_SMD:C_1206_HandSoldering)
      (datasheet ~)
      (libsource (lib Device) (part C) (description "Unpolarized capacitor"))
      (sheetpath (names /) (tstamps /))
      (tstamp 5FCCA560))
    (comp (ref U3)
      (value LP2985A-10DBVR)
      (footprint LP2985A10DBVR:LP2985A-10DBVR)
      (libsource (lib 2020-11-28_01-19-03) (part LP2985A-10DBVR) (description ""))
      (sheetpath (names /) (tstamps /))
      (tstamp 5FD10D0A))
    (comp (ref C6)
      (value 1u)
      (footprint Capacitors_SMD:C_1206_HandSoldering)
      (datasheet ~)
      (libsource (lib Device) (part C) (description "Unpolarized capacitor"))
      (sheetpath (names /) (tstamps /))
      (tstamp 5FD1AD26))
    (comp (ref C10)
      (value 10n)
      (footprint Capacitors_SMD:C_1206_HandSoldering)
      (datasheet ~)
      (libsource (lib Device) (part C) (description "Unpolarized capacitor"))
      (sheetpath (names /) (tstamps /))
      (tstamp 5FD4245E))
    (comp (ref C7)
      (value 10n)
      (footprint Capacitors_SMD:C_1206_HandSoldering)
      (datasheet ~)
      (libsource (lib Device) (part C) (description "Unpolarized capacitor"))
      (sheetpath (names /) (tstamps /))
      (tstamp 5FD3CA56))
    (comp (ref U2)
      (value MAX903CSA+)
      (footprint MAX903CSA:MAX903CSA&plus_)
      (libsource (lib 2020-11-28_01-42-31) (part MAX903CSA+) (description ""))
      (sheetpath (names /) (tstamps /))
      (tstamp 5FDE77AA))
    (comp (ref C4)
      (value 100n)
      (footprint Capacitors_SMD:C_1206_HandSoldering)
      (datasheet ~)
      (libsource (lib Device) (part C) (description "Unpolarized capacitor"))
      (sheetpath (names /) (tstamps /))
      (tstamp 5FE7F75D))
    (comp (ref C8)
      (value 100n)
      (footprint Capacitors_SMD:C_1206_HandSoldering)
      (datasheet ~)
      (libsource (lib Device) (part C) (description "Unpolarized capacitor"))
      (sheetpath (names /) (tstamps /))
      (tstamp 5FEB1C30))
    (comp (ref C5)
      (value 100n)
      (footprint Capacitors_SMD:C_1206_HandSoldering)
      (datasheet ~)
      (libsource (lib Device) (part C) (description "Unpolarized capacitor"))
      (sheetpath (names /) (tstamps /))
      (tstamp 5FE7EFBF))
    (comp (ref C3)
      (value 100n)
      (footprint Capacitors_SMD:C_1206_HandSoldering)
      (datasheet ~)
      (libsource (lib Device) (part C) (description "Unpolarized capacitor"))
      (sheetpath (names /) (tstamps /))
      (tstamp 5FF24F1E))
    (comp (ref TP1)
      (value DAC_IN)
      (footprint Measurement_Points:Measurement_Point_Square-TH_Big)
      (datasheet ~)
      (libsource (lib Connector) (part TestPoint) (description "test point"))
      (sheetpath (names /) (tstamps /))
      (tstamp 5FC21E24))
    (comp (ref J4)
      (value Screw_Terminal_01x02)
      (footprint TerminalBlocks_Phoenix:TerminalBlock_Phoenix_MPT-2.54mm_2pol)
      (datasheet ~)
      (libsource (lib Connector) (part Screw_Terminal_01x02) (description "Generic screw terminal, single row, 01x02, script generated (kicad-library-utils/schlib/autogen/connector/)"))
      (sheetpath (names /) (tstamps /))
      (tstamp 5FC6C28D))
    (comp (ref R16)
      (value 6.98k)
      (footprint Resistors_SMD:R_1206_HandSoldering)
      (datasheet ~)
      (libsource (lib Device) (part R) (description Resistor))
      (sheetpath (names /) (tstamps /))
      (tstamp 5FC7C554))
    (comp (ref R14)
      (value 4.64k)
      (footprint Resistors_SMD:R_1206_HandSoldering)
      (datasheet ~)
      (libsource (lib Device) (part R) (description Resistor))
      (sheetpath (names /) (tstamps /))
      (tstamp 5FD51CD5))
    (comp (ref R15)
      (value 1.10k)
      (footprint Resistors_SMD:R_1206_HandSoldering)
      (datasheet ~)
      (libsource (lib Device) (part R) (description Resistor))
      (sheetpath (names /) (tstamps /))
      (tstamp 5FE4C96D))
    (comp (ref C13)
      (value 1.5n)
      (footprint Capacitors_SMD:C_1206_HandSoldering)
      (datasheet ~)
      (libsource (lib Device) (part C) (description "Unpolarized capacitor"))
      (sheetpath (names /) (tstamps /))
      (tstamp 5FEDE201))
    (comp (ref TP7)
      (value ADC_OUT)
      (footprint Measurement_Points:Measurement_Point_Square-TH_Big)
      (datasheet ~)
      (libsource (lib Connector) (part TestPoint) (description "test point"))
      (sheetpath (names /) (tstamps /))
      (tstamp 60042A7B))
    (comp (ref J1)
      (value Barrel_Jack)
      (footprint Connectors:BARREL_JACK)
      (datasheet ~)
      (libsource (lib Connector) (part Barrel_Jack) (description "DC Barrel Jack"))
      (sheetpath (names /) (tstamps /))
      (tstamp 60094E31))
    (comp (ref R19)
      (value 1k)
      (footprint Resistors_SMD:R_1206_HandSoldering)
      (datasheet ~)
      (libsource (lib Device) (part R) (description Resistor))
      (sheetpath (names /) (tstamps /))
      (tstamp 600D0597))
    (comp (ref D4)
      (value PWR_ON)
      (footprint LEDs:LED_1206_HandSoldering)
      (datasheet ~)
      (libsource (lib Device) (part LED) (description "Light emitting diode"))
      (sheetpath (names /) (tstamps /))
      (tstamp 600D120D))
    (comp (ref D1)
      (value D_Schottky)
      (footprint Diodes_SMD:D_1206)
      (datasheet ~)
      (libsource (lib Device) (part D_Schottky) (description "Schottky diode"))
      (sheetpath (names /) (tstamps /))
      (tstamp 600F6204))
    (comp (ref D3)
      (value D_Schottky)
      (footprint Diodes_SMD:D_1206)
      (datasheet ~)
      (libsource (lib Device) (part D_Schottky) (description "Schottky diode"))
      (sheetpath (names /) (tstamps /))
      (tstamp 6013DDAA))
    (comp (ref D6)
      (value D_Zener)
      (footprint Diodes_SMD:D_1206)
      (datasheet ~)
      (libsource (lib Device) (part D_Zener) (description "Zener diode"))
      (sheetpath (names /) (tstamps /))
      (tstamp 6013F7B0))
    (comp (ref R18)
      (value 1k)
      (footprint Resistors_SMD:R_1206_HandSoldering)
      (datasheet ~)
      (libsource (lib Device) (part R) (description Resistor))
      (sheetpath (names /) (tstamps /))
      (tstamp 60199401))
    (comp (ref D2)
      (value D_Zener)
      (footprint Diodes_SMD:D_1206)
      (datasheet ~)
      (libsource (lib Device) (part D_Zener) (description "Zener diode"))
      (sheetpath (names /) (tstamps /))
      (tstamp 601B80C9))
    (comp (ref D5)
      (value ENABLE)
      (footprint LEDs:LED_1206_HandSoldering)
      (datasheet ~)
      (libsource (lib Device) (part LED) (description "Light emitting diode"))
      (sheetpath (names /) (tstamps /))
      (tstamp 601DDCA2))
    (comp (ref R17)
      (value 150)
      (footprint Resistors_SMD:R_1206_HandSoldering)
      (datasheet ~)
      (libsource (lib Device) (part R) (description Resistor))
      (sheetpath (names /) (tstamps /))
      (tstamp 601E8705))
    (comp (ref R24)
      (value 28k)
      (footprint Resistors_SMD:R_1206_HandSoldering)
      (datasheet ~)
      (libsource (lib Device) (part R) (description Resistor))
      (sheetpath (names /) (tstamps /))
      (tstamp 603327CD))
    (comp (ref R27)
      (value 28k)
      (footprint Resistors_SMD:R_1206_HandSoldering)
      (datasheet ~)
      (libsource (lib Device) (part R) (description Resistor))
      (sheetpath (names /) (tstamps /))
      (tstamp 60334768))
    (comp (ref C14)
      (value 130p)
      (footprint Capacitors_SMD:C_1206_HandSoldering)
      (datasheet ~)
      (libsource (lib Device) (part C) (description "Unpolarized capacitor"))
      (sheetpath (names /) (tstamps /))
      (tstamp 603351D5))
    (comp (ref C16)
      (value 130p)
      (footprint Capacitors_SMD:C_1206_HandSoldering)
      (datasheet ~)
      (libsource (lib Device) (part C) (description "Unpolarized capacitor"))
      (sheetpath (names /) (tstamps /))
      (tstamp 60335762))
    (comp (ref R25)
      (value 1.58meg)
      (footprint Resistors_SMD:R_1206_HandSoldering)
      (datasheet ~)
      (libsource (lib Device) (part R) (description Resistor))
      (sheetpath (names /) (tstamps /))
      (tstamp 604A9871))
    (comp (ref C15)
      (value 130p)
      (footprint Capacitors_SMD:C_1206_HandSoldering)
      (datasheet ~)
      (libsource (lib Device) (part C) (description "Unpolarized capacitor"))
      (sheetpath (names /) (tstamps /))
      (tstamp 6052A82B))
    (comp (ref R26)
      (value 68.1k)
      (footprint Resistors_SMD:R_1206_HandSoldering)
      (datasheet ~)
      (libsource (lib Device) (part R) (description Resistor))
      (sheetpath (names /) (tstamps /))
      (tstamp 605E25A4))
    (comp (ref R23)
      (value 5.11k)
      (footprint Resistors_SMD:R_1206_HandSoldering)
      (datasheet ~)
      (libsource (lib Device) (part R) (description Resistor))
      (sheetpath (names /) (tstamps /))
      (tstamp 60615187))
    (comp (ref C17)
      (value 390p)
      (footprint Capacitors_SMD:C_1206_HandSoldering)
      (datasheet ~)
      (libsource (lib Device) (part C) (description "Unpolarized capacitor"))
      (sheetpath (names /) (tstamps /))
      (tstamp 6068DCA7))
    (comp (ref TP6)
      (value LF_4)
      (footprint Measurement_Points:Measurement_Point_Square-TH_Big)
      (datasheet ~)
      (libsource (lib Connector) (part TestPoint) (description "test point"))
      (sheetpath (names /) (tstamps /))
      (tstamp 607FDDF8))
    (comp (ref R20)
      (value 0R)
      (footprint Resistors_SMD:R_1206_HandSoldering)
      (datasheet ~)
      (libsource (lib Device) (part R) (description Resistor))
      (sheetpath (names /) (tstamps /))
      (tstamp 6080040C))
    (comp (ref R21)
      (value 0R)
      (footprint Resistors_SMD:R_1206_HandSoldering)
      (datasheet ~)
      (libsource (lib Device) (part R) (description Resistor))
      (sheetpath (names /) (tstamps /))
      (tstamp 608009D6))
    (comp (ref R22)
      (value 0)
      (footprint Resistors_SMD:R_1206_HandSoldering)
      (datasheet ~)
      (libsource (lib Device) (part R) (description Resistor))
      (sheetpath (names /) (tstamps /))
      (tstamp 6081E4E4))
    (comp (ref R29)
      (value 0)
      (footprint Resistors_SMD:R_1206_HandSoldering)
      (datasheet ~)
      (libsource (lib Device) (part R) (description Resistor))
      (sheetpath (names /) (tstamps /))
      (tstamp 607FD617))
    (comp (ref R28)
      (value 5.36k)
      (footprint Resistors_SMD:R_1206_HandSoldering)
      (datasheet ~)
      (libsource (lib Device) (part R) (description Resistor))
      (sheetpath (names /) (tstamps /))
      (tstamp 6077185C))
    (comp (ref C20)
      (value 100n)
      (footprint Capacitors_SMD:C_1206_HandSoldering)
      (datasheet ~)
      (libsource (lib Device) (part C) (description "Unpolarized capacitor"))
      (sheetpath (names /) (tstamps /))
      (tstamp 60AB6D5B))
    (comp (ref C18)
      (value C)
      (footprint Capacitors_SMD:C_1206_HandSoldering)
      (datasheet ~)
      (libsource (lib Device) (part C) (description "Unpolarized capacitor"))
      (sheetpath (names /) (tstamps /))
      (tstamp 60E064E3))
    (comp (ref TP5)
      (value LF_3)
      (footprint Measurement_Points:Measurement_Point_Square-TH_Big)
      (datasheet ~)
      (libsource (lib Connector) (part TestPoint) (description "test point"))
      (sheetpath (names /) (tstamps /))
      (tstamp 60021993))
    (comp (ref RV2)
      (value 47k)
      (footprint 23BR50KLFTR:23BR50KLFTR)
      (datasheet ~)
      (libsource (lib Device) (part R_POT_TRIM) (description Trim-potentiometer))
      (sheetpath (names /) (tstamps /))
      (tstamp 60250E3C))
    (comp (ref C19)
      (value 100n)
      (footprint Capacitors_SMD:C_1206_HandSoldering)
      (datasheet ~)
      (libsource (lib Device) (part C) (description "Unpolarized capacitor"))
      (sheetpath (names /) (tstamps /))
      (tstamp 60DE1B13))
    (comp (ref R10)
      (value 13.7k)
      (footprint Resistors_SMD:R_1206_HandSoldering)
      (datasheet ~)
      (libsource (lib Device) (part R) (description Resistor))
      (sheetpath (names /) (tstamps /))
      (tstamp 5FC7B8C1))
    (comp (ref TP4)
      (value LF_2)
      (footprint Measurement_Points:Measurement_Point_Square-TH_Big)
      (datasheet ~)
      (libsource (lib Connector) (part TestPoint) (description "test point"))
      (sheetpath (names /) (tstamps /))
      (tstamp 5FFFBDD1))
    (comp (ref TP3)
      (value LF_1)
      (footprint Measurement_Points:Measurement_Point_Square-TH_Big)
      (datasheet ~)
      (libsource (lib Connector) (part TestPoint) (description "test point"))
      (sheetpath (names /) (tstamps /))
      (tstamp 5FFFA481))
    (comp (ref RV1)
      (value 10k)
      (footprint 23BR50KLFTR:23BR50KLFTR)
      (datasheet ~)
      (libsource (lib Device) (part R_POT_TRIM) (description Trim-potentiometer))
      (sheetpath (names /) (tstamps /))
      (tstamp 6022FF0D))
    (comp (ref R13)
      (value 806)
      (footprint Resistors_SMD:R_1206_HandSoldering)
      (datasheet ~)
      (libsource (lib Device) (part R) (description Resistor))
      (sheetpath (names /) (tstamps /))
      (tstamp 5FCDA6F4))
    (comp (ref R12)
      (value 750)
      (footprint Resistors_SMD:R_1206_HandSoldering)
      (datasheet ~)
      (libsource (lib Device) (part R) (description Resistor))
      (sheetpath (names /) (tstamps /))
      (tstamp 5FCCEFAC))
    (comp (ref R11)
      (value 14.0k)
      (footprint Resistors_SMD:R_1206_HandSoldering)
      (datasheet ~)
      (libsource (lib Device) (part R) (description Resistor))
      (sheetpath (names /) (tstamps /))
      (tstamp 5FC90376))
    (comp (ref C12)
      (value 680p)
      (footprint Capacitors_SMD:C_1206_HandSoldering)
      (datasheet ~)
      (libsource (lib Device) (part C) (description "Unpolarized capacitor"))
      (sheetpath (names /) (tstamps /))
      (tstamp 5FC8F46B))
    (comp (ref R9)
      (value 4.75k)
      (footprint Resistors_SMD:R_1206_HandSoldering)
      (datasheet ~)
      (libsource (lib Device) (part R) (description Resistor))
      (sheetpath (names /) (tstamps /))
      (tstamp 5FC76002))
    (comp (ref U5)
      (value LM6144AIM_NOPB)
      (footprint LM6144AIM:LM6144AIM&slash_NOPB)
      (libsource (lib 2020-10-07_19-26-36) (part LM6144AIM_NOPB) (description ""))
      (sheetpath (names /) (tstamps /))
      (tstamp 5FC691EC)))
  (libparts
    (libpart (lib 2020-10-07_19-26-36) (part LM6144AIM_NOPB)
      (footprints
        (fp M14A_TEX)
        (fp M14A_TEX-M)
        (fp M14A_TEX-L))
      (fields
        (field (name Reference) U)
        (field (name Value) LM6144AIM_NOPB)
        (field (name Footprint) M14A_TEX))
      (pins
        (pin (num 1) (name OUTA) (type output))
        (pin (num 2) (name -INA) (type input))
        (pin (num 3) (name +INA_) (type input))
        (pin (num 4) (name V+) (type passive))
        (pin (num 5) (name +INB) (type input))
        (pin (num 6) (name -INB) (type input))
        (pin (num 7) (name OUTB) (type output))
        (pin (num 8) (name OUTC) (type output))
        (pin (num 9) (name -INC) (type input))
        (pin (num 10) (name +INC) (type input))
        (pin (num 11) (name V-) (type passive))
        (pin (num 12) (name +IND) (type input))
        (pin (num 13) (name -IND) (type input))
        (pin (num 14) (name OUTD) (type output))))
    (libpart (lib 2020-11-28_00-11-22) (part LMH6619MA_NOPB)
      (footprints
        (fp M08A)
        (fp M08A-M)
        (fp M08A-L))
      (fields
        (field (name Reference) U)
        (field (name Value) LMH6619MA_NOPB)
        (field (name Footprint) M08A))
      (pins
        (pin (num 1) (name OUTA) (type output))
        (pin (num 2) (name INA-) (type input))
        (pin (num 3) (name INA+) (type input))
        (pin (num 4) (name V-) (type power_in))
        (pin (num 5) (name INB+) (type input))
        (pin (num 6) (name INB-) (type input))
        (pin (num 7) (name OUTB) (type output))
        (pin (num 8) (name V+) (type power_in))))
    (libpart (lib 2020-11-28_01-19-03) (part LP2985A-10DBVR)
      (footprints
        (fp DBV5_TEX)
        (fp DBV5_TEX-M)
        (fp DBV5_TEX-L))
      (fields
        (field (name Reference) U)
        (field (name Value) LP2985A-10DBVR)
        (field (name Footprint) DBV5_TEX))
      (pins
        (pin (num 1) (name VIN) (type input))
        (pin (num 2) (name GND) (type power_in))
        (pin (num 3) (name ON/*OFF) (type unspc))
        (pin (num 4) (name BYPASS) (type unspc))
        (pin (num 5) (name VOUT) (type output))))
    (libpart (lib 2020-11-28_01-42-31) (part MAX903CSA+)
      (footprints
        (fp 21-0041B_8_MXM)
        (fp 21-0041B_8_MXM-M)
        (fp 21-0041B_8_MXM-L))
      (fields
        (field (name Reference) U)
        (field (name Value) MAX903CSA+)
        (field (name Footprint) 21-0041B_8_MXM))
      (pins
        (pin (num 1) (name VCC) (type power_in))
        (pin (num 2) (name IN+) (type input))
        (pin (num 3) (name IN-) (type input))
        (pin (num 4) (name VEE) (type power_in))
        (pin (num 5) (name LATCH) (type input))
        (pin (num 6) (name GND) (type power_in))
        (pin (num 7) (name OUT) (type output))
        (pin (num 8) (name VDD) (type power_in))))
    (libpart (lib Connector) (part Barrel_Jack)
      (aliases
        (alias Jack-DC))
      (description "DC Barrel Jack")
      (docs ~)
      (footprints
        (fp BarrelJack*))
      (fields
        (field (name Reference) J)
        (field (name Value) Barrel_Jack))
      (pins
        (pin (num 1) (name ~) (type passive))
        (pin (num 2) (name ~) (type passive))))
    (libpart (lib Connector) (part Screw_Terminal_01x02)
      (description "Generic screw terminal, single row, 01x02, script generated (kicad-library-utils/schlib/autogen/connector/)")
      (docs ~)
      (footprints
        (fp TerminalBlock*:*))
      (fields
        (field (name Reference) J)
        (field (name Value) Screw_Terminal_01x02))
      (pins
        (pin (num 1) (name Pin_1) (type passive))
        (pin (num 2) (name Pin_2) (type passive))))
    (libpart (lib Connector) (part TestPoint)
      (description "test point")
      (docs ~)
      (footprints
        (fp Pin*)
        (fp Test*))
      (fields
        (field (name Reference) TP)
        (field (name Value) TestPoint))
      (pins
        (pin (num 1) (name 1) (type passive))))
    (libpart (lib Connector_Generic) (part Conn_02x04_Odd_Even)
      (description "Generic connector, double row, 02x04, odd/even pin numbering scheme (row 1 odd numbers, row 2 even numbers), script generated (kicad-library-utils/schlib/autogen/connector/)")
      (docs ~)
      (footprints
        (fp Connector*:*_2x??_*))
      (fields
        (field (name Reference) J)
        (field (name Value) Conn_02x04_Odd_Even))
      (pins
        (pin (num 1) (name Pin_1) (type passive))
        (pin (num 2) (name Pin_2) (type passive))
        (pin (num 3) (name Pin_3) (type passive))
        (pin (num 4) (name Pin_4) (type passive))
        (pin (num 5) (name Pin_5) (type passive))
        (pin (num 6) (name Pin_6) (type passive))
        (pin (num 7) (name Pin_7) (type passive))
        (pin (num 8) (name Pin_8) (type passive))))
    (libpart (lib Connector_Generic) (part Conn_02x20_Odd_Even)
      (description "Generic connector, double row, 02x20, odd/even pin numbering scheme (row 1 odd numbers, row 2 even numbers), script generated (kicad-library-utils/schlib/autogen/connector/)")
      (docs ~)
      (footprints
        (fp Connector*:*_2x??_*))
      (fields
        (field (name Reference) J)
        (field (name Value) Conn_02x20_Odd_Even))
      (pins
        (pin (num 1) (name Pin_1) (type passive))
        (pin (num 2) (name Pin_2) (type passive))
        (pin (num 3) (name Pin_3) (type passive))
        (pin (num 4) (name Pin_4) (type passive))
        (pin (num 5) (name Pin_5) (type passive))
        (pin (num 6) (name Pin_6) (type passive))
        (pin (num 7) (name Pin_7) (type passive))
        (pin (num 8) (name Pin_8) (type passive))
        (pin (num 9) (name Pin_9) (type passive))
        (pin (num 10) (name Pin_10) (type passive))
        (pin (num 11) (name Pin_11) (type passive))
        (pin (num 12) (name Pin_12) (type passive))
        (pin (num 13) (name Pin_13) (type passive))
        (pin (num 14) (name Pin_14) (type passive))
        (pin (num 15) (name Pin_15) (type passive))
        (pin (num 16) (name Pin_16) (type passive))
        (pin (num 17) (name Pin_17) (type passive))
        (pin (num 18) (name Pin_18) (type passive))
        (pin (num 19) (name Pin_19) (type passive))
        (pin (num 20) (name Pin_20) (type passive))
        (pin (num 21) (name Pin_21) (type passive))
        (pin (num 22) (name Pin_22) (type passive))
        (pin (num 23) (name Pin_23) (type passive))
        (pin (num 24) (name Pin_24) (type passive))
        (pin (num 25) (name Pin_25) (type passive))
        (pin (num 26) (name Pin_26) (type passive))
        (pin (num 27) (name Pin_27) (type passive))
        (pin (num 28) (name Pin_28) (type passive))
        (pin (num 29) (name Pin_29) (type passive))
        (pin (num 30) (name Pin_30) (type passive))
        (pin (num 31) (name Pin_31) (type passive))
        (pin (num 32) (name Pin_32) (type passive))
        (pin (num 33) (name Pin_33) (type passive))
        (pin (num 34) (name Pin_34) (type passive))
        (pin (num 35) (name Pin_35) (type passive))
        (pin (num 36) (name Pin_36) (type passive))
        (pin (num 37) (name Pin_37) (type passive))
        (pin (num 38) (name Pin_38) (type passive))
        (pin (num 39) (name Pin_39) (type passive))
        (pin (num 40) (name Pin_40) (type passive))))
    (libpart (lib Device) (part C)
      (description "Unpolarized capacitor")
      (docs ~)
      (footprints
        (fp C_*))
      (fields
        (field (name Reference) C)
        (field (name Value) C))
      (pins
        (pin (num 1) (name ~) (type passive))
        (pin (num 2) (name ~) (type passive))))
    (libpart (lib Device) (part D_Schottky)
      (description "Schottky diode")
      (docs ~)
      (footprints
        (fp TO-???*)
        (fp *_Diode_*)
        (fp *SingleDiode*)
        (fp D_*))
      (fields
        (field (name Reference) D)
        (field (name Value) D_Schottky))
      (pins
        (pin (num 1) (name K) (type passive))
        (pin (num 2) (name A) (type passive))))
    (libpart (lib Device) (part D_Zener)
      (description "Zener diode")
      (docs ~)
      (footprints
        (fp TO-???*)
        (fp *_Diode_*)
        (fp *SingleDiode*)
        (fp D_*))
      (fields
        (field (name Reference) D)
        (field (name Value) D_Zener))
      (pins
        (pin (num 1) (name K) (type passive))
        (pin (num 2) (name A) (type passive))))
    (libpart (lib Device) (part LED)
      (description "Light emitting diode")
      (docs ~)
      (footprints
        (fp LED*)
        (fp LED_SMD:*)
        (fp LED_THT:*))
      (fields
        (field (name Reference) D)
        (field (name Value) LED))
      (pins
        (pin (num 1) (name K) (type passive))
        (pin (num 2) (name A) (type passive))))
    (libpart (lib Device) (part R)
      (description Resistor)
      (docs ~)
      (footprints
        (fp R_*))
      (fields
        (field (name Reference) R)
        (field (name Value) R))
      (pins
        (pin (num 1) (name ~) (type passive))
        (pin (num 2) (name ~) (type passive))))
    (libpart (lib Device) (part R_POT_TRIM)
      (description Trim-potentiometer)
      (docs ~)
      (footprints
        (fp Potentiometer*))
      (fields
        (field (name Reference) RV)
        (field (name Value) R_POT_TRIM))
      (pins
        (pin (num 1) (name 1) (type passive))
        (pin (num 2) (name 2) (type passive))
        (pin (num 3) (name 3) (type passive))))
    (libpart (lib Reference_Voltage) (part TLE2426xD)
      (description "Precision virtual ground, noise reduction pin, 4V to 40V input, SOIC-8")
      (docs http://www.ti.com/lit/ds/symlink/tle2426.pdf)
      (footprints
        (fp SOIC*3.9x4.9mm*P1.27mm*))
      (fields
        (field (name Reference) U)
        (field (name Value) TLE2426xD)
        (field (name Footprint) Package_SO:SOIC-8_3.9x4.9mm_P1.27mm))
      (pins
        (pin (num 1) (name OUT) (type power_out))
        (pin (num 2) (name COMMON) (type power_in))
        (pin (num 3) (name IN) (type power_in))
        (pin (num 4) (name NC) (type NotConnected))
        (pin (num 5) (name NC) (type NotConnected))
        (pin (num 6) (name NC) (type NotConnected))
        (pin (num 7) (name NC) (type NotConnected))
        (pin (num 8) (name NOISE_REDUCTION) (type passive)))))
  (libraries
    (library (logical 2020-10-07_19-26-36)
      (uri /Users/brett/Documents/KiCad/Libraries/Downloads/ul_LM6144AIMNOPB/KiCAD/2020-10-07_19-26-36/2020-10-07_19-26-36.lib))
    (library (logical 2020-11-28_00-11-22)
      (uri /Users/brett/Documents/KiCad/Libraries/Downloads/ul_LMH6619MANOPB/KiCAD/2020-11-28_00-11-22/2020-11-28_00-11-22.lib))
    (library (logical 2020-11-28_01-19-03)
      (uri /Users/brett/Documents/KiCad/Libraries/Downloads/ul_LP2985A10DBVR/KiCAD/2020-11-28_01-19-03/2020-11-28_01-19-03.lib))
    (library (logical 2020-11-28_01-42-31)
      (uri /Users/brett/Documents/KiCad/Libraries/Downloads/ul_MAX903CSA/KiCAD/2020-11-28_01-42-31/2020-11-28_01-42-31.lib))
    (library (logical Connector)
      (uri "/Library/Application Support/kicad/library/Connector.lib"))
    (library (logical Connector_Generic)
      (uri "/Library/Application Support/kicad/library/Connector_Generic.lib"))
    (library (logical Device)
      (uri "/Library/Application Support/kicad/library/Device.lib"))
    (library (logical Reference_Voltage)
      (uri "/Library/Application Support/kicad/library/Reference_Voltage.lib")))
  (nets
    (net (code 1) (name /S_CLK)
      (node (ref J2) (pin 10)))
    (net (code 2) (name "Net-(J2-Pad11)")
      (node (ref J2) (pin 11)))
    (net (code 3) (name "Net-(J2-Pad13)")
      (node (ref J2) (pin 13)))
    (net (code 4) (name "Net-(J2-Pad14)")
      (node (ref J2) (pin 14)))
    (net (code 5) (name "Net-(J2-Pad15)")
      (node (ref J2) (pin 15)))
    (net (code 6) (name "Net-(J2-Pad16)")
      (node (ref J2) (pin 16)))
    (net (code 7) (name "Net-(J2-Pad17)")
      (node (ref J2) (pin 17)))
    (net (code 8) (name "Net-(J2-Pad18)")
      (node (ref J2) (pin 18)))
    (net (code 9) (name "Net-(J2-Pad19)")
      (node (ref J2) (pin 19)))
    (net (code 10) (name "Net-(J2-Pad20)")
      (node (ref J2) (pin 20)))
    (net (code 11) (name "Net-(J2-Pad21)")
      (node (ref J2) (pin 21)))
    (net (code 12) (name "Net-(J2-Pad22)")
      (node (ref J2) (pin 22)))
    (net (code 13) (name "Net-(J2-Pad23)")
      (node (ref J2) (pin 23)))
    (net (code 14) (name "Net-(J2-Pad24)")
      (node (ref J2) (pin 24)))
    (net (code 15) (name "Net-(J2-Pad25)")
      (node (ref J2) (pin 25)))
    (net (code 16) (name "Net-(J2-Pad26)")
      (node (ref J2) (pin 26)))
    (net (code 17) (name "Net-(J2-Pad27)")
      (node (ref J2) (pin 27)))
    (net (code 18) (name "Net-(J2-Pad28)")
      (node (ref J2) (pin 28)))
    (net (code 19) (name "Net-(J2-Pad29)")
      (node (ref J2) (pin 29)))
    (net (code 20) (name "Net-(J2-Pad30)")
      (node (ref J2) (pin 30)))
    (net (code 21) (name "Net-(J2-Pad31)")
      (node (ref J2) (pin 31)))
    (net (code 22) (name "Net-(J2-Pad32)")
      (node (ref J2) (pin 32)))
    (net (code 23) (name "Net-(J2-Pad33)")
      (node (ref J2) (pin 33)))
    (net (code 24) (name "Net-(J2-Pad34)")
      (node (ref J2) (pin 34)))
    (net (code 25) (name "Net-(J2-Pad35)")
      (node (ref J2) (pin 35)))
    (net (code 26) (name "Net-(J2-Pad36)")
      (node (ref J2) (pin 36)))
    (net (code 27) (name "Net-(J2-Pad37)")
      (node (ref J2) (pin 37)))
    (net (code 28) (name "Net-(J2-Pad38)")
      (node (ref J2) (pin 38)))
    (net (code 29) (name "Net-(J2-Pad39)")
      (node (ref J2) (pin 39)))
    (net (code 30) (name /ADC_OUT)
      (node (ref J2) (pin 4))
      (node (ref U2) (pin 7))
      (node (ref TP7) (pin 1))
      (node (ref R18) (pin 2)))
    (net (code 31) (name "Net-(J2-Pad40)")
      (node (ref J2) (pin 40)))
    (net (code 32) (name /ADC_FB_N)
      (node (ref RV2) (pin 2))
      (node (ref J2) (pin 5)))
    (net (code 33) (name /ADC_FB)
      (node (ref RV1) (pin 1))
      (node (ref J2) (pin 6)))
    (net (code 34) (name /CLK)
      (node (ref J2) (pin 9)))
    (net (code 35) (name "Net-(C18-Pad1)")
      (node (ref R1) (pin 2))
      (node (ref C18) (pin 1)))
    (net (code 36) (name "Net-(C1-Pad2)")
      (node (ref U1) (pin 2))
      (node (ref C1) (pin 2))
      (node (ref R3) (pin 2))
      (node (ref R2) (pin 1)))
    (net (code 37) (name "Net-(C2-Pad1)")
      (node (ref R4) (pin 1))
      (node (ref U1) (pin 6))
      (node (ref U1) (pin 7))
      (node (ref C2) (pin 1)))
    (net (code 38) (name "Net-(C2-Pad2)")
      (node (ref R4) (pin 2))
      (node (ref C2) (pin 2))
      (node (ref R1) (pin 1))
      (node (ref U1) (pin 3)))
    (net (code 39) (name "Net-(J3-Pad2)")
      (node (ref J3) (pin 2))
      (node (ref R5) (pin 2)))
    (net (code 40) (name "Net-(J3-Pad4)")
      (node (ref J3) (pin 4))
      (node (ref R6) (pin 2)))
    (net (code 41) (name "Net-(J3-Pad6)")
      (node (ref J3) (pin 6))
      (node (ref R7) (pin 2)))
    (net (code 42) (name "Net-(C1-Pad1)")
      (node (ref C1) (pin 1))
      (node (ref R3) (pin 1))
      (node (ref U1) (pin 1))
      (node (ref J3) (pin 7))
      (node (ref J3) (pin 5))
      (node (ref J3) (pin 3))
      (node (ref J3) (pin 1)))
    (net (code 43) (name "Net-(J3-Pad8)")
      (node (ref R8) (pin 2))
      (node (ref J3) (pin 8)))
    (net (code 44) (name GNDA)
      (node (ref C20) (pin 2))
      (node (ref RV2) (pin 1))
      (node (ref J2) (pin 7))
      (node (ref D6) (pin 2))
      (node (ref U4) (pin 1))
      (node (ref C9) (pin 2))
      (node (ref J2) (pin 8))
      (node (ref D3) (pin 2))
      (node (ref J4) (pin 2))
      (node (ref R2) (pin 2))
      (node (ref U5) (pin 10))
      (node (ref U5) (pin 12))
      (node (ref D5) (pin 1))
      (node (ref R22) (pin 2))
      (node (ref C17) (pin 1))
      (node (ref C19) (pin 2))
      (node (ref U2) (pin 3))
      (node (ref C3) (pin 2))
      (node (ref U2) (pin 6))
      (node (ref C4) (pin 2))
      (node (ref C8) (pin 2))
      (node (ref R23) (pin 1))
      (node (ref C5) (pin 2))
      (node (ref U5) (pin 5)))
    (net (code 45) (name +3V3)
      (node (ref J2) (pin 1))
      (node (ref U2) (pin 8))
      (node (ref C3) (pin 1))
      (node (ref U2) (pin 5))
      (node (ref J2) (pin 3)))
    (net (code 46) (name "Net-(U4-Pad4)")
      (node (ref U4) (pin 4)))
    (net (code 47) (name "Net-(U4-Pad5)")
      (node (ref U4) (pin 5)))
    (net (code 48) (name "Net-(U4-Pad6)")
      (node (ref U4) (pin 6)))
    (net (code 49) (name "Net-(U4-Pad7)")
      (node (ref U4) (pin 7)))
    (net (code 50) (name "Net-(C11-Pad1)")
      (node (ref C11) (pin 1))
      (node (ref U4) (pin 8)))
    (net (code 51) (name /ENABLE)
      (node (ref U3) (pin 3))
      (node (ref J2) (pin 2))
      (node (ref R17) (pin 2)))
    (net (code 52) (name "Net-(C7-Pad1)")
      (node (ref U3) (pin 4))
      (node (ref C7) (pin 1)))
    (net (code 53) (name +5VA)
      (node (ref U3) (pin 5))
      (node (ref U4) (pin 3))
      (node (ref C10) (pin 1))
      (node (ref U5) (pin 4))
      (node (ref C8) (pin 1))
      (node (ref C4) (pin 1))
      (node (ref U1) (pin 8))
      (node (ref U2) (pin 1))
      (node (ref C19) (pin 1)))
    (net (code 54) (name /DAC_IN)
      (node (ref J2) (pin 12))
      (node (ref TP1) (pin 1))
      (node (ref C18) (pin 2)))
    (net (code 55) (name /I_EXC)
      (node (ref R10) (pin 2))
      (node (ref TP2) (pin 1))
      (node (ref U1) (pin 5))
      (node (ref R5) (pin 1))
      (node (ref R6) (pin 1))
      (node (ref R7) (pin 1))
      (node (ref R16) (pin 1))
      (node (ref R9) (pin 1))
      (node (ref J4) (pin 1))
      (node (ref R8) (pin 1)))
    (net (code 56) (name "Net-(C13-Pad1)")
      (node (ref R16) (pin 2))
      (node (ref R15) (pin 1))
      (node (ref U5) (pin 9))
      (node (ref C13) (pin 1)))
    (net (code 57) (name -5V)
      (node (ref D4) (pin 1))
      (node (ref C9) (pin 1))
      (node (ref C11) (pin 2))
      (node (ref U4) (pin 2))
      (node (ref U3) (pin 2))
      (node (ref C6) (pin 2))
      (node (ref C10) (pin 2))
      (node (ref C7) (pin 2))
      (node (ref U2) (pin 4))
      (node (ref J1) (pin 2))
      (node (ref D1) (pin 2))
      (node (ref C5) (pin 1))
      (node (ref U5) (pin 11))
      (node (ref D2) (pin 2))
      (node (ref U1) (pin 4))
      (node (ref C20) (pin 1)))
    (net (code 58) (name "Net-(D4-Pad2)")
      (node (ref R19) (pin 2))
      (node (ref D4) (pin 2)))
    (net (code 59) (name "Net-(D3-Pad1)")
      (node (ref R18) (pin 1))
      (node (ref D6) (pin 1))
      (node (ref D3) (pin 1)))
    (net (code 60) (name +5V)
      (node (ref D1) (pin 1))
      (node (ref R19) (pin 1))
      (node (ref J1) (pin 1))
      (node (ref C6) (pin 1))
      (node (ref D2) (pin 1))
      (node (ref U3) (pin 1)))
    (net (code 61) (name "Net-(D5-Pad2)")
      (node (ref D5) (pin 2))
      (node (ref R17) (pin 1)))
    (net (code 62) (name /ADC_4_Y)
      (node (ref R20) (pin 2))
      (node (ref U5) (pin 14))
      (node (ref TP6) (pin 1))
      (node (ref R25) (pin 2))
      (node (ref C14) (pin 2))
      (node (ref R24) (pin 1)))
    (net (code 63) (name "Net-(C16-Pad1)")
      (node (ref C16) (pin 1))
      (node (ref R27) (pin 2))
      (node (ref R25) (pin 1))
      (node (ref U5) (pin 13))
      (node (ref R22) (pin 1)))
    (net (code 64) (name "Net-(C15-Pad2)")
      (node (ref R28) (pin 1))
      (node (ref R26) (pin 1))
      (node (ref C15) (pin 2))
      (node (ref R29) (pin 1)))
    (net (code 65) (name "Net-(C14-Pad1)")
      (node (ref C16) (pin 2))
      (node (ref R23) (pin 2))
      (node (ref C15) (pin 1))
      (node (ref C14) (pin 1))
      (node (ref R26) (pin 2)))
    (net (code 66) (name "Net-(C17-Pad2)")
      (node (ref C17) (pin 2))
      (node (ref R28) (pin 2))
      (node (ref R24) (pin 2))
      (node (ref R27) (pin 1)))
    (net (code 67) (name "Net-(R20-Pad1)")
      (node (ref R20) (pin 1))
      (node (ref R21) (pin 1))
      (node (ref U2) (pin 2)))
    (net (code 68) (name /ADC_2_Y)
      (node (ref TP5) (pin 1))
      (node (ref R29) (pin 2))
      (node (ref C13) (pin 2))
      (node (ref R21) (pin 2))
      (node (ref R14) (pin 1))
      (node (ref U5) (pin 8)))
    (net (code 69) (name "Net-(RV2-Pad3)")
      (node (ref U5) (pin 3))
      (node (ref RV2) (pin 3)))
    (net (code 70) (name "Net-(R10-Pad1)")
      (node (ref U5) (pin 6))
      (node (ref R10) (pin 1))
      (node (ref R12) (pin 1))
      (node (ref R13) (pin 1)))
    (net (code 71) (name "Net-(R13-Pad2)")
      (node (ref R13) (pin 2))
      (node (ref TP4) (pin 1))
      (node (ref R15) (pin 2))
      (node (ref U5) (pin 7)))
    (net (code 72) (name "Net-(RV1-Pad3)")
      (node (ref RV1) (pin 3)))
    (net (code 73) (name "Net-(C12-Pad1)")
      (node (ref R11) (pin 1))
      (node (ref C12) (pin 1))
      (node (ref R12) (pin 2))
      (node (ref U5) (pin 1))
      (node (ref TP3) (pin 1)))
    (net (code 74) (name "Net-(C12-Pad2)")
      (node (ref R14) (pin 2))
      (node (ref RV1) (pin 2))
      (node (ref U5) (pin 2))
      (node (ref R9) (pin 2))
      (node (ref C12) (pin 2))
      (node (ref R11) (pin 2)))))