@00000000 005b 00b6 0112 016d 01c8 0224 027f 02db 
@00000008 0336 0391 03ed 0448 04a3 04ff 055a 05b5 
@00000010 0610 066c 06c7 0722 077d 07d9 0834 088f 
@00000018 08ea 0945 09a0 09fb 0a56 0ab1 0b0c 0b67 
@00000020 0bc2 0c1d 0c78 0cd3 0d2e 0d88 0de3 0e3e 
@00000028 0e99 0ef3 0f4e 0fa8 1003 105d 10b8 1112 
@00000030 116d 11c7 1221 127c 12d6 1330 138a 13e4 
@00000038 143e 1498 14f2 154c 15a6 1600 1659 16b3 
@00000040 170c 1766 17c0 1819 1872 18cc 1925 197e 
@00000048 19d7 1a30 1a89 1ae2 1b3b 1b94 1bed 1c45 
@00000050 1c9e 1cf7 1d4f 1da7 1e00 1e58 1eb0 1f08 
@00000058 1f60 1fb8 2010 2068 20c0 2117 216f 21c7 
@00000060 221e 2275 22cd 2324 237b 23d2 2429 2480 
@00000068 24d6 252d 2583 25da 2630 2687 26dd 2733 
@00000070 2789 27df 2835 288a 28e0 2935 298b 29e0 
@00000078 2a35 2a8a 2adf 2b34 2b89 2bde 2c32 2c87 
@00000080 2cdb 2d30 2d84 2dd8 2e2c 2e80 2ed3 2f27 
@00000088 2f7a 2fce 3021 3074 30c7 311a 316d 31c0 
@00000090 3212 3265 32b7 3309 335b 33ad 33ff 3451 
@00000098 34a2 34f4 3545 3596 35e7 3638 3689 36da 
@000000a0 372a 377a 37cb 381b 386b 38bb 390a 395a 
@000000a8 39a9 39f9 3a48 3a97 3ae6 3b35 3b83 3bd2 
@000000b0 3c20 3c6e 3cbc 3d0a 3d58 3da5 3df3 3e40 
@000000b8 3e8d 3eda 3f27 3f74 3fc0 400d 4059 40a5 
@000000c0 40f1 413d 4188 41d4 421f 426a 42b5 4300 
@000000c8 434a 4395 43df 4429 4473 44bd 4507 4550 
@000000d0 459a 45e3 462c 4675 46bd 4706 474e 4796 
@000000d8 47de 4826 486d 48b5 48fc 4943 498a 49d1 
@000000e0 4a17 4a5e 4aa4 4aea 4b30 4b76 4bbb 4c00 
@000000e8 4c45 4c8a 4ccf 4d14 4d58 4d9c 4de0 4e24 
@000000f0 4e68 4eab 4eee 4f31 4f74 4fb7 4ff9 503c 
@000000f8 507e 50c0 5101 5143 5184 51c5 5206 5247 
@00000100 5287 52c8 5308 5348 5388 53c7 5406 5446 
@00000108 5484 54c3 5502 5540 557e 55bc 55fa 5637 
@00000110 5674 56b1 56ee 572b 5767 57a4 57e0 581b 
@00000118 5857 5892 58cd 5908 5943 597e 59b8 59f2 
@00000120 5a2c 5a66 5a9f 5ad8 5b11 5b4a 5b83 5bbb 
@00000128 5bf3 5c2b 5c63 5c9a 5cd1 5d08 5d3f 5d76 
@00000130 5dac 5de2 5e18 5e4e 5e83 5eb8 5eed 5f22 
@00000138 5f56 5f8b 5fbf 5ff3 6026 6059 608d 60bf 
@00000140 60f2 6125 6157 6189 61ba 61ec 621d 624e 
@00000148 627f 62af 62e0 6310 6340 636f 639f 63ce 
@00000150 63fd 642b 645a 6488 64b6 64e3 6511 653e 
@00000158 656b 6597 65c4 65f0 661c 6648 6673 669e 
@00000160 66c9 66f4 671e 6749 6773 679c 67c6 67ef 
@00000168 6818 6841 6869 6891 68b9 68e1 6908 6930 
@00000170 6957 697d 69a4 69ca 69f0 6a16 6a3b 6a60 
@00000178 6a85 6aaa 6ace 6af2 6b16 6b3a 6b5d 6b80 
@00000180 6ba3 6bc6 6be8 6c0a 6c2c 6c4d 6c6f 6c90 
@00000188 6cb0 6cd1 6cf1 6d11 6d31 6d50 6d6f 6d8e 
@00000190 6dad 6dcb 6dea 6e07 6e25 6e42 6e5f 6e7c 
@00000198 6e99 6eb5 6ed1 6eed 6f08 6f23 6f3e 6f59 
@000001a0 6f73 6f8e 6fa7 6fc1 6fda 6ff3 700c 7025 
@000001a8 703d 7055 706d 7084 709b 70b2 70c9 70df 
@000001b0 70f5 710b 7120 7136 714b 715f 7174 7188 
@000001b8 719c 71af 71c3 71d6 71e9 71fb 720d 721f 
@000001c0 7231 7242 7254 7264 7275 7285 7295 72a5 
@000001c8 72b5 72c4 72d3 72e1 72f0 72fe 730c 7319 
@000001d0 7327 7334 7340 734d 7359 7365 7370 737c 
@000001d8 7387 7391 739c 73a6 73b0 73ba 73c3 73cc 
@000001e0 73d5 73de 73e6 73ee 73f6 73fd 7404 740b 
@000001e8 7412 7418 741e 7424 7429 742e 7433 7438 
@000001f0 743c 7440 7444 7447 744b 744e 7450 7453 
@000001f8 7455 7457 7458 7459 745a 745b 745c 745c 
