EESchema Schematic File Version 4
EELAYER 30 0
EELAYER END
$Descr A4 11693 8268
encoding utf-8
Sheet 1 1
Title ""
Date ""
Rev ""
Comp ""
Comment1 ""
Comment2 ""
Comment3 ""
Comment4 ""
$EndDescr
Wire Wire Line
	3700 1700 3700 1800
Wire Wire Line
	3700 1200 3700 1400
Wire Wire Line
	3200 1800 3200 1300
Wire Wire Line
	3700 1800 3200 1800
Wire Wire Line
	3700 800  3700 900 
$Comp
L Device:LED D?
U 1 1 611F08A1
P 3700 1550
F 0 "D?" V 3739 1433 50  0000 R CNN
F 1 "PWR_ON" V 3648 1433 50  0000 R CNN
F 2 "" H 3700 1550 50  0001 C CNN
F 3 "~" H 3700 1550 50  0001 C CNN
	1    3700 1550
	0    -1   -1   0   
$EndComp
$Comp
L Device:R R?
U 1 1 611F00E6
P 3700 1050
F 0 "R?" H 3770 1096 50  0000 L CNN
F 1 "300" H 3770 1005 50  0000 L CNN
F 2 "" V 3630 1050 50  0001 C CNN
F 3 "~" H 3700 1050 50  0001 C CNN
	1    3700 1050
	1    0    0    -1  
$EndComp
Connection ~ 3200 1300
Wire Wire Line
	3200 1300 3200 1200
Wire Wire Line
	3200 800  3200 900 
Connection ~ 3200 800 
Wire Wire Line
	2700 800  3200 800 
$Comp
L Device:D_Zener D?
U 1 1 611EF4B0
P 3200 1050
F 0 "D?" V 3154 1129 50  0000 L CNN
F 1 "D_Zener" V 3245 1129 50  0000 L CNN
F 2 "" H 3200 1050 50  0001 C CNN
F 3 "~" H 3200 1050 50  0001 C CNN
	1    3200 1050
	0    1    1    0   
$EndComp
Wire Wire Line
	2200 1300 2200 1000
Wire Wire Line
	2700 1300 3200 1300
Wire Wire Line
	2700 1300 2200 1300
Connection ~ 2700 1300
Wire Wire Line
	2700 1200 2700 1300
Wire Wire Line
	2700 800  2700 900 
Connection ~ 2700 800 
Wire Wire Line
	2200 800  2700 800 
$Comp
L Device:D_Schottky D?
U 1 1 611ED1A5
P 2700 1050
F 0 "D?" V 2654 1129 50  0000 L CNN
F 1 "D_Schottky" V 2745 1129 50  0000 L CNN
F 2 "" H 2700 1050 50  0001 C CNN
F 3 "~" H 2700 1050 50  0001 C CNN
	1    2700 1050
	0    1    1    0   
$EndComp
$Comp
L Connector:Barrel_Jack J?
U 1 1 611EB9C9
P 1900 900
F 0 "J?" H 1957 1225 50  0000 C CNN
F 1 "Barrel_Jack" H 1957 1134 50  0000 C CNN
F 2 "" H 1950 860 50  0001 C CNN
F 3 "~" H 1950 860 50  0001 C CNN
	1    1900 900 
	1    0    0    -1  
$EndComp
Wire Wire Line
	3200 800  3700 800 
Connection ~ 3700 1800
Wire Wire Line
	3700 1800 4200 1800
$Comp
L Device:C C?
U 1 1 611F5CC1
P 4200 1300
F 0 "C?" H 4315 1346 50  0000 L CNN
F 1 "1u" H 4315 1255 50  0000 L CNN
F 2 "" H 4238 1150 50  0001 C CNN
F 3 "~" H 4200 1300 50  0001 C CNN
	1    4200 1300
	1    0    0    -1  
$EndComp
Wire Wire Line
	4200 1150 4200 800 
Wire Wire Line
	4200 800  3700 800 
Connection ~ 4200 800 
Connection ~ 3700 800 
$Comp
L power:+5VA #PWR?
U 1 1 611F6D00
P 5550 700
F 0 "#PWR?" H 5550 550 50  0001 C CNN
F 1 "+5VA" H 5565 873 50  0000 C CNN
F 2 "" H 5550 700 50  0001 C CNN
F 3 "" H 5550 700 50  0001 C CNN
	1    5550 700 
	1    0    0    -1  
$EndComp
$Comp
L Connector_Generic:Conn_02x20_Odd_Even J?
U 1 1 611FA1C9
P 1100 1850
F 0 "J?" H 1150 2967 50  0000 C CNN
F 1 "Conn_02x20_Odd_Even" H 1150 2876 50  0000 C CNN
F 2 "" H 1100 1850 50  0001 C CNN
F 3 "~" H 1100 1850 50  0001 C CNN
	1    1100 1850
	1    0    0    -1  
$EndComp
$Comp
L 2021-08-19_20-12-01:AD7724ASTZ U?
U 2 1 61201F57
P 9800 3000
F 0 "U?" H 10500 3400 60  0000 L CNN
F 1 "AD7724ASTZ" H 10300 3300 60  0000 L CNN
F 2 "ST_48_ADI" H 10900 3340 60  0001 C CNN
F 3 "" H 9800 3000 60  0000 C CNN
	2    9800 3000
	1    0    0    -1  
$EndComp
Wire Wire Line
	900  950  900  1000
$Comp
L power:+3V3 #PWR?
U 1 1 61212DD2
P 600 1000
F 0 "#PWR?" H 600 850 50  0001 C CNN
F 1 "+3V3" H 615 1173 50  0000 C CNN
F 2 "" H 600 1000 50  0001 C CNN
F 3 "" H 600 1000 50  0001 C CNN
	1    600  1000
	1    0    0    -1  
$EndComp
Connection ~ 900  1000
Wire Wire Line
	900  1000 900  1050
$Comp
L power:+3V3 #PWR?
U 1 1 612144D5
P 8950 4950
F 0 "#PWR?" H 8950 4800 50  0001 C CNN
F 1 "+3V3" H 8965 5123 50  0000 C CNN
F 2 "" H 8950 4950 50  0001 C CNN
F 3 "" H 8950 4950 50  0001 C CNN
	1    8950 4950
	1    0    0    -1  
$EndComp
$Comp
L Device:C C?
U 1 1 61215DAD
P 9100 4600
F 0 "C?" H 9215 4646 50  0000 L CNN
F 1 "100n" H 9215 4555 50  0000 L CNN
F 2 "" H 9138 4450 50  0001 C CNN
F 3 "~" H 9100 4600 50  0001 C CNN
	1    9100 4600
	1    0    0    -1  
$EndComp
$Comp
L Device:C C?
U 1 1 61216FA8
P 9500 4600
F 0 "C?" H 9615 4646 50  0000 L CNN
F 1 "10u" H 9615 4555 50  0000 L CNN
F 2 "" H 9538 4450 50  0001 C CNN
F 3 "~" H 9500 4600 50  0001 C CNN
	1    9500 4600
	1    0    0    -1  
$EndComp
Wire Wire Line
	9100 4450 9100 4400
Wire Wire Line
	9500 4450 9500 4400
Connection ~ 9500 4400
Wire Wire Line
	9500 4400 9800 4400
Wire Wire Line
	9100 4750 9100 4800
Wire Wire Line
	9500 4750 9500 4800
Connection ~ 9500 4800
Wire Wire Line
	9500 4800 9100 4800
Wire Wire Line
	9500 4800 9500 5300
Wire Wire Line
	9500 5300 9800 5300
Wire Wire Line
	9800 5100 8950 5100
$Comp
L power:GNDD #PWR?
U 1 1 61220700
P 9350 6100
F 0 "#PWR?" H 9350 5850 50  0001 C CNN
F 1 "GNDD" H 9354 5945 50  0000 C CNN
F 2 "" H 9350 6100 50  0001 C CNN
F 3 "" H 9350 6100 50  0001 C CNN
	1    9350 6100
	1    0    0    -1  
$EndComp
Wire Wire Line
	9800 6100 9800 6200
$Comp
L Device:C C?
U 1 1 61225E5B
P 8950 5750
F 0 "C?" H 9065 5796 50  0000 L CNN
F 1 "100n" H 9065 5705 50  0000 L CNN
F 2 "" H 8988 5600 50  0001 C CNN
F 3 "~" H 8950 5750 50  0001 C CNN
	1    8950 5750
	1    0    0    -1  
$EndComp
$Comp
L Device:C C?
U 1 1 61226991
P 9350 5750
F 0 "C?" H 9465 5796 50  0000 L CNN
F 1 "10u" H 9465 5705 50  0000 L CNN
F 2 "" H 9388 5600 50  0001 C CNN
F 3 "~" H 9350 5750 50  0001 C CNN
	1    9350 5750
	1    0    0    -1  
$EndComp
Wire Wire Line
	9350 5900 9350 6100
Connection ~ 9350 6100
Wire Wire Line
	9350 6100 9800 6100
Connection ~ 8950 5100
Wire Wire Line
	8950 5100 8950 5400
Wire Wire Line
	8950 5900 8950 6100
$Comp
L Device:C C?
U 1 1 6123D0E0
P 8600 5750
F 0 "C?" H 8715 5796 50  0000 L CNN
F 1 "10u" H 8715 5705 50  0000 L CNN
F 2 "" H 8638 5600 50  0001 C CNN
F 3 "~" H 8600 5750 50  0001 C CNN
	1    8600 5750
	1    0    0    -1  
$EndComp
$Comp
L Device:C C?
U 1 1 6123D504
P 8200 5750
F 0 "C?" H 8315 5796 50  0000 L CNN
F 1 "100n" H 8315 5705 50  0000 L CNN
F 2 "" H 8238 5600 50  0001 C CNN
F 3 "~" H 8200 5750 50  0001 C CNN
	1    8200 5750
	1    0    0    -1  
$EndComp
Wire Wire Line
	8200 5900 8200 6100
Wire Wire Line
	8200 6100 8600 6100
Connection ~ 8950 6100
Wire Wire Line
	8950 6100 9350 6100
Wire Wire Line
	8600 5900 8600 6100
Connection ~ 8600 6100
Wire Wire Line
	8600 6100 8950 6100
Wire Wire Line
	8950 5400 9350 5400
Connection ~ 8950 5400
Wire Wire Line
	8950 5400 8950 5600
Wire Wire Line
	9350 5400 9350 5600
Wire Wire Line
	8200 5400 8400 5400
Wire Wire Line
	8200 5400 8200 5600
Wire Wire Line
	8600 5400 8600 5600
Wire Wire Line
	9800 5000 8400 5000
Wire Wire Line
	8400 5000 8400 5400
Connection ~ 8400 5400
Wire Wire Line
	8400 5400 8600 5400
Wire Wire Line
	8950 5100 8950 4950
$Comp
L power:+5VD #PWR?
U 1 1 6124E824
P 8400 4950
F 0 "#PWR?" H 8400 4800 50  0001 C CNN
F 1 "+5VD" H 8415 5123 50  0000 C CNN
F 2 "" H 8400 4950 50  0001 C CNN
F 3 "" H 8400 4950 50  0001 C CNN
	1    8400 4950
	1    0    0    -1  
$EndComp
Wire Wire Line
	8400 4950 8400 5000
Connection ~ 8400 5000
Wire Wire Line
	9100 4400 9500 4400
$Comp
L Device:R R?
U 1 1 61262A78
P 4600 4400
F 0 "R?" V 4393 4400 50  0000 C CNN
F 1 "590" V 4484 4400 50  0000 C CNN
F 2 "" V 4530 4400 50  0001 C CNN
F 3 "~" H 4600 4400 50  0001 C CNN
	1    4600 4400
	0    1    1    0   
$EndComp
$Comp
L Device:C C?
U 1 1 61273A37
P 4850 4150
F 0 "C?" H 4965 4196 50  0000 L CNN
F 1 "2.7n" H 4965 4105 50  0000 L CNN
F 2 "" H 4888 4000 50  0001 C CNN
F 3 "~" H 4850 4150 50  0001 C CNN
	1    4850 4150
	1    0    0    -1  
$EndComp
Wire Wire Line
	4750 4400 4850 4400
Wire Wire Line
	4850 4400 4850 4300
Connection ~ 4850 4400
Wire Wire Line
	5150 4300 5550 4300
Wire Wire Line
	5350 4600 5550 4600
Wire Wire Line
	4850 4400 5550 4400
$Comp
L Device:R R?
U 1 1 612924BC
P 4600 4800
F 0 "R?" V 4393 4800 50  0000 C CNN
F 1 "590" V 4484 4800 50  0000 C CNN
F 2 "" V 4530 4800 50  0001 C CNN
F 3 "~" H 4600 4800 50  0001 C CNN
	1    4600 4800
	0    1    1    0   
$EndComp
Wire Wire Line
	4750 4800 4850 4800
$Comp
L Device:C C?
U 1 1 61294FCD
P 4850 5050
F 0 "C?" H 4965 5096 50  0000 L CNN
F 1 "2.7n" H 4965 5005 50  0000 L CNN
F 2 "" H 4888 4900 50  0001 C CNN
F 3 "~" H 4850 5050 50  0001 C CNN
	1    4850 5050
	1    0    0    -1  
$EndComp
Wire Wire Line
	4850 4900 4850 4800
Connection ~ 4850 4800
Wire Wire Line
	4850 4800 5550 4800
Wire Wire Line
	5550 4900 5150 4900
$Comp
L power:+3V3 #PWR?
U 1 1 612A698F
P 5350 4600
F 0 "#PWR?" H 5350 4450 50  0001 C CNN
F 1 "+3V3" H 5365 4773 50  0000 C CNN
F 2 "" H 5350 4600 50  0001 C CNN
F 3 "" H 5350 4600 50  0001 C CNN
	1    5350 4600
	1    0    0    -1  
$EndComp
Text Label 5550 5200 2    50   ~ 0
I_ZERO
Text Label 5550 5100 2    50   ~ 0
I_CAL
Text Label 5550 5300 2    50   ~ 0
I_RESET
Text Label 5550 5400 2    50   ~ 0
I_ENABLE_N
Text Label 7750 4200 0    50   ~ 0
O_SD_A
Text Label 7750 4300 0    50   ~ 0
O_SD_B
Text Label 7750 4400 0    50   ~ 0
O_DVAL
Text Label 7750 4500 0    50   ~ 0
O_SCLK
$Comp
L 2021-08-19_20-12-01:AD7724ASTZ U?
U 1 1 6120025E
P 5550 4300
F 0 "U?" H 6650 4787 60  0000 C CNN
F 1 "AD7724ASTZ" H 6650 4681 60  0000 C CNN
F 2 "ST_48_ADI" H 6650 4640 60  0001 C CNN
F 3 "" H 5550 4300 60  0000 C CNN
	1    5550 4300
	1    0    0    -1  
$EndComp
$Comp
L power:+3V3 #PWR?
U 1 1 612B8023
P 5250 5750
F 0 "#PWR?" H 5250 5600 50  0001 C CNN
F 1 "+3V3" H 5265 5923 50  0000 C CNN
F 2 "" H 5250 5750 50  0001 C CNN
F 3 "" H 5250 5750 50  0001 C CNN
	1    5250 5750
	1    0    0    -1  
$EndComp
$Comp
L 2021-08-20_21-19-14:SN74LV1T34DBVR U?
U 1 1 612C171F
P 3050 2750
F 0 "U?" H 3100 3536 60  0000 C CNN
F 1 "SN74LV1T34DBVR" H 3100 3430 60  0000 C CNN
F 2 "DBV0005A_N" H 3050 2690 60  0001 C CNN
F 3 "" H 3050 2750 60  0000 C CNN
	1    3050 2750
	1    0    0    -1  
$EndComp
$Comp
L Regulator_Linear:LP2985-5.0 U?
U 1 1 612CA4D1
P 4950 900
F 0 "U?" H 4950 1242 50  0000 C CNN
F 1 "LP2985-5.0" H 4950 1151 50  0000 C CNN
F 2 "Package_TO_SOT_SMD:SOT-23-5" H 4950 1225 50  0001 C CNN
F 3 "http://www.ti.com/lit/ds/symlink/lp2985.pdf" H 4950 900 50  0001 C CNN
	1    4950 900 
	1    0    0    -1  
$EndComp
Wire Wire Line
	4950 1200 4950 1800
$Comp
L Device:C C?
U 1 1 612E55DF
P 5450 1300
F 0 "C?" H 5565 1346 50  0000 L CNN
F 1 "10n" H 5565 1255 50  0000 L CNN
F 2 "" H 5488 1150 50  0001 C CNN
F 3 "~" H 5450 1300 50  0001 C CNN
	1    5450 1300
	1    0    0    -1  
$EndComp
Wire Wire Line
	5350 900  5450 900 
Wire Wire Line
	5450 900  5450 1150
Wire Wire Line
	5450 1450 5450 1800
Wire Wire Line
	5450 1800 4950 1800
Connection ~ 4950 1800
Text Label 4550 900  2    50   ~ 0
ENABLE
Wire Wire Line
	4200 1800 4950 1800
Connection ~ 4200 1800
Wire Wire Line
	4200 800  4550 800 
$Comp
L Reference_Voltage:TLE2426xD U?
U 1 1 612F981E
P 6600 1050
F 0 "U?" H 6600 1517 50  0000 C CNN
F 1 "TLE2426xD" H 6600 1426 50  0000 C CNN
F 2 "Package_SO:SOIC-8_3.9x4.9mm_P1.27mm" H 6600 450 50  0001 C CIN
F 3 "http://www.ti.com/lit/ds/symlink/tle2426.pdf" H 5200 2000 50  0001 C CIN
	1    6600 1050
	1    0    0    -1  
$EndComp
$Comp
L Device:C C?
U 1 1 612FB34F
P 5850 1300
F 0 "C?" H 5965 1346 50  0000 L CNN
F 1 "1u" H 5965 1255 50  0000 L CNN
F 2 "" H 5888 1150 50  0001 C CNN
F 3 "~" H 5850 1300 50  0001 C CNN
	1    5850 1300
	1    0    0    -1  
$EndComp
Wire Wire Line
	5850 1150 5850 950 
Wire Wire Line
	5850 950  6100 950 
Wire Wire Line
	5450 1800 5850 1800
Wire Wire Line
	5850 1800 5850 1450
Connection ~ 5450 1800
Wire Wire Line
	5350 800  5850 800 
Wire Wire Line
	5850 800  5850 850 
Wire Wire Line
	5850 850  6100 850 
$Comp
L power:GNDREF #PWR?
U 1 1 613254C5
P 7200 950
F 0 "#PWR?" H 7200 700 50  0001 C CNN
F 1 "GNDREF" H 7205 777 50  0000 C CNN
F 2 "" H 7200 950 50  0001 C CNN
F 3 "" H 7200 950 50  0001 C CNN
	1    7200 950 
	1    0    0    -1  
$EndComp
Wire Wire Line
	7100 850  7200 850 
Wire Wire Line
	7200 850  7200 950 
Wire Wire Line
	5850 1800 6600 1800
Wire Wire Line
	6600 1800 6600 1550
Connection ~ 5850 1800
Wire Wire Line
	4200 1450 4200 1800
$Comp
L power:GNDA #PWR?
U 1 1 6133157F
P 4200 1800
F 0 "#PWR?" H 4200 1550 50  0001 C CNN
F 1 "GNDA" H 4205 1627 50  0000 C CNN
F 2 "" H 4200 1800 50  0001 C CNN
F 3 "" H 4200 1800 50  0001 C CNN
	1    4200 1800
	1    0    0    -1  
$EndComp
$Comp
L power:+5VA #PWR?
U 1 1 61332717
P 4200 800
F 0 "#PWR?" H 4200 650 50  0001 C CNN
F 1 "+5VA" H 4215 973 50  0000 C CNN
F 2 "" H 4200 800 50  0001 C CNN
F 3 "" H 4200 800 50  0001 C CNN
	1    4200 800 
	1    0    0    -1  
$EndComp
$Comp
L power:+5VA #PWR?
U 1 1 613332DF
P 9500 4400
F 0 "#PWR?" H 9500 4250 50  0001 C CNN
F 1 "+5VA" H 9515 4573 50  0000 C CNN
F 2 "" H 9500 4400 50  0001 C CNN
F 3 "" H 9500 4400 50  0001 C CNN
	1    9500 4400
	1    0    0    -1  
$EndComp
$Comp
L power:GNDREF #PWR?
U 1 1 6133DDB0
P 4600 3900
F 0 "#PWR?" H 4600 3650 50  0001 C CNN
F 1 "GNDREF" H 4605 3727 50  0000 C CNN
F 2 "" H 4600 3900 50  0001 C CNN
F 3 "" H 4600 3900 50  0001 C CNN
	1    4600 3900
	1    0    0    -1  
$EndComp
$Comp
L power:GNDREF #PWR?
U 1 1 6133EB86
P 4600 5300
F 0 "#PWR?" H 4600 5050 50  0001 C CNN
F 1 "GNDREF" H 4605 5127 50  0000 C CNN
F 2 "" H 4600 5300 50  0001 C CNN
F 3 "" H 4600 5300 50  0001 C CNN
	1    4600 5300
	1    0    0    -1  
$EndComp
$Comp
L power:GNDA #PWR?
U 1 1 6134280F
P 9500 5300
F 0 "#PWR?" H 9500 5050 50  0001 C CNN
F 1 "GNDA" H 9505 5127 50  0000 C CNN
F 2 "" H 9500 5300 50  0001 C CNN
F 3 "" H 9500 5300 50  0001 C CNN
	1    9500 5300
	1    0    0    -1  
$EndComp
Connection ~ 9500 5300
$Comp
L power:GNDD #PWR?
U 1 1 61343A58
P 3850 3150
F 0 "#PWR?" H 3850 2900 50  0001 C CNN
F 1 "GNDD" H 3854 2995 50  0000 C CNN
F 2 "" H 3850 3150 50  0001 C CNN
F 3 "" H 3850 3150 50  0001 C CNN
	1    3850 3150
	1    0    0    -1  
$EndComp
$Comp
L power:+5VD #PWR?
U 1 1 6134E4AF
P 2000 2250
F 0 "#PWR?" H 2000 2100 50  0001 C CNN
F 1 "+5VD" H 2015 2423 50  0000 C CNN
F 2 "" H 2000 2250 50  0001 C CNN
F 3 "" H 2000 2250 50  0001 C CNN
	1    2000 2250
	1    0    0    -1  
$EndComp
NoConn ~ 2350 3150
Text Label 4250 2750 0    50   ~ 0
SCLK5
Text Label 5550 5700 2    50   ~ 0
SCLK5
Wire Wire Line
	5250 5800 5550 5800
Wire Wire Line
	5250 5800 5250 5750
Text Label 2350 2750 2    50   ~ 0
SCLK
Wire Wire Line
	600  1000 900  1000
$Comp
L Device:C C?
U 1 1 61404119
P 8000 1400
F 0 "C?" V 7748 1400 50  0000 C CNN
F 1 "20p" V 7839 1400 50  0000 C CNN
F 2 "" H 8038 1250 50  0001 C CNN
F 3 "~" H 8000 1400 50  0001 C CNN
	1    8000 1400
	0    1    1    0   
$EndComp
$Comp
L Device:R R?
U 1 1 61404DF4
P 8000 1600
F 0 "R?" V 8100 1600 50  0000 C CNN
F 1 "10k" V 8200 1600 50  0000 C CNN
F 2 "" V 7930 1600 50  0001 C CNN
F 3 "~" H 8000 1600 50  0001 C CNN
	1    8000 1600
	0    1    1    0   
$EndComp
Wire Wire Line
	8150 1400 8250 1400
Wire Wire Line
	8250 1400 8250 1500
Wire Wire Line
	8250 1600 8150 1600
Wire Wire Line
	8250 1500 9350 1500
Connection ~ 8250 1500
Wire Wire Line
	8250 1500 8250 1600
$Comp
L Device:C C?
U 1 1 61473278
P 9000 1000
F 0 "C?" V 8748 1000 50  0000 C CNN
F 1 "20p" V 8839 1000 50  0000 C CNN
F 2 "" H 9038 850 50  0001 C CNN
F 3 "~" H 9000 1000 50  0001 C CNN
	1    9000 1000
	0    1    1    0   
$EndComp
$Comp
L Device:R R?
U 1 1 61473A5B
P 9000 1200
F 0 "R?" V 9100 1200 50  0000 C CNN
F 1 "10k" V 9200 1200 50  0000 C CNN
F 2 "" V 8930 1200 50  0001 C CNN
F 3 "~" H 9000 1200 50  0001 C CNN
	1    9000 1200
	0    1    1    0   
$EndComp
Wire Wire Line
	8850 1000 8750 1000
Wire Wire Line
	8750 1000 8750 1100
Wire Wire Line
	8750 1200 8850 1200
Wire Wire Line
	9150 1000 9250 1000
Wire Wire Line
	9250 1000 9250 1100
Wire Wire Line
	9250 1200 9150 1200
Wire Wire Line
	8750 1100 7450 1100
Connection ~ 8750 1100
Wire Wire Line
	8750 1100 8750 1200
Wire Wire Line
	9250 1100 9450 1100
Connection ~ 9250 1100
Wire Wire Line
	9250 1100 9250 1200
Wire Wire Line
	9350 1500 9350 2200
Wire Wire Line
	9450 1100 9450 2300
$Comp
L Connector_Generic:Conn_02x04_Odd_Even J?
U 1 1 6153F949
P 9950 1200
F 0 "J?" H 10000 1517 50  0000 C CNN
F 1 "Conn_02x04_Odd_Even" H 10000 1426 50  0000 C CNN
F 2 "" H 9950 1200 50  0001 C CNN
F 3 "~" H 9950 1200 50  0001 C CNN
	1    9950 1200
	1    0    0    -1  
$EndComp
Wire Wire Line
	9750 1100 9750 1200
Connection ~ 9750 1200
Wire Wire Line
	9750 1200 9750 1300
Connection ~ 9750 1300
Wire Wire Line
	9750 1300 9750 1400
Connection ~ 9750 1400
$Comp
L Device:R R?
U 1 1 615875E3
P 10500 1100
F 0 "R?" V 10293 1100 50  0000 C CNN
F 1 "1k" V 10384 1100 50  0000 C CNN
F 2 "" V 10430 1100 50  0001 C CNN
F 3 "~" H 10500 1100 50  0001 C CNN
	1    10500 1100
	0    1    1    0   
$EndComp
$Comp
L Device:R R?
U 1 1 615888B2
P 10500 1400
F 0 "R?" V 10293 1400 50  0000 C CNN
F 1 "100" V 10384 1400 50  0000 C CNN
F 2 "" V 10430 1400 50  0001 C CNN
F 3 "~" H 10500 1400 50  0001 C CNN
	1    10500 1400
	0    1    1    0   
$EndComp
$Comp
L Device:R R?
U 1 1 61588CC3
P 10500 800
F 0 "R?" V 10293 800 50  0000 C CNN
F 1 "10k" V 10384 800 50  0000 C CNN
F 2 "" V 10430 800 50  0001 C CNN
F 3 "~" H 10500 800 50  0001 C CNN
	1    10500 800 
	0    1    1    0   
$EndComp
$Comp
L Device:R R?
U 1 1 6158909B
P 10500 1700
F 0 "R?" V 10293 1700 50  0000 C CNN
F 1 "10" V 10384 1700 50  0000 C CNN
F 2 "" V 10430 1700 50  0001 C CNN
F 3 "~" H 10500 1700 50  0001 C CNN
	1    10500 1700
	0    1    1    0   
$EndComp
Wire Wire Line
	10250 1200 10350 1200
Wire Wire Line
	10350 1200 10350 1100
Wire Wire Line
	10250 1300 10350 1300
Wire Wire Line
	10350 1300 10350 1400
Wire Wire Line
	10250 1100 10250 800 
Wire Wire Line
	10250 800  10350 800 
Wire Wire Line
	10250 1400 10250 1700
Wire Wire Line
	10250 1700 10350 1700
Wire Wire Line
	10650 1100 10850 1100
Connection ~ 10650 1100
Wire Wire Line
	10650 1100 10650 800 
Connection ~ 10650 1400
Wire Wire Line
	10650 1400 10650 1100
Wire Wire Line
	10650 1400 10650 1700
Text Label 10850 1100 0    50   ~ 0
I_EXC
Wire Wire Line
	10650 1850 10650 1700
Connection ~ 10650 1700
Wire Wire Line
	9750 1400 9750 2200
Wire Wire Line
	9250 2200 9350 2200
Wire Wire Line
	9850 1850 10650 1850
Wire Wire Line
	9850 2300 9850 1850
Wire Wire Line
	9550 2300 9850 2300
Wire Wire Line
	9550 3700 9550 2300
Wire Wire Line
	7450 3700 9550 3700
Wire Wire Line
	7450 2600 7450 3700
Wire Wire Line
	7650 2600 7450 2600
Wire Wire Line
	7550 2700 7550 3600
Wire Wire Line
	9450 3600 9450 2300
Wire Wire Line
	7550 3600 9450 3600
Wire Wire Line
	7650 2700 7550 2700
Wire Wire Line
	7450 1100 7450 2300
Wire Wire Line
	7550 1500 7550 2400
Wire Wire Line
	9450 2300 9250 2300
Wire Wire Line
	7450 2300 7650 2300
Connection ~ 7450 2300
Wire Wire Line
	7750 1600 7750 1500
Wire Wire Line
	7850 1600 7750 1600
Wire Wire Line
	7550 2400 7650 2400
Connection ~ 7550 2400
Text Label 6350 2150 2    50   ~ 0
DAC_IN
Wire Wire Line
	6250 3450 6750 3450
Wire Wire Line
	6250 2550 6250 3450
Wire Wire Line
	6350 2550 6250 2550
Wire Wire Line
	6750 2300 6850 2300
Wire Wire Line
	6750 2150 6750 2300
Wire Wire Line
	6650 2150 6750 2150
Wire Wire Line
	6750 2550 6750 2400
Wire Wire Line
	6650 2550 6750 2550
$Comp
L Device:C C?
U 1 1 613F29EF
P 6500 2550
F 0 "C?" V 6248 2550 50  0000 C CNN
F 1 "C" V 6339 2550 50  0000 C CNN
F 2 "" H 6538 2400 50  0001 C CNN
F 3 "~" H 6500 2550 50  0001 C CNN
	1    6500 2550
	0    1    1    0   
$EndComp
Wire Wire Line
	7250 2850 7250 3050
Connection ~ 7250 3050
$Comp
L power:+5VA #PWR?
U 1 1 613D5659
P 7250 2850
F 0 "#PWR?" H 7250 2700 50  0001 C CNN
F 1 "+5VA" H 7265 3023 50  0000 C CNN
F 2 "" H 7250 2850 50  0001 C CNN
F 3 "" H 7250 2850 50  0001 C CNN
	1    7250 2850
	1    0    0    -1  
$EndComp
Connection ~ 7250 3450
Wire Wire Line
	7250 3700 7250 3450
$Comp
L power:GNDA #PWR?
U 1 1 613C69AF
P 7250 3700
F 0 "#PWR?" H 7250 3450 50  0001 C CNN
F 1 "GNDA" H 7255 3527 50  0000 C CNN
F 2 "" H 7250 3700 50  0001 C CNN
F 3 "" H 7250 3700 50  0001 C CNN
	1    7250 3700
	1    0    0    -1  
$EndComp
Wire Wire Line
	6750 3450 6750 3050
Connection ~ 6750 3450
Wire Wire Line
	6850 3450 6750 3450
Wire Wire Line
	6850 3050 6750 3050
Wire Wire Line
	6750 2400 6850 2400
$Comp
L power:GNDREF #PWR?
U 1 1 613B784D
P 6750 3450
F 0 "#PWR?" H 6750 3200 50  0001 C CNN
F 1 "GNDREF" H 6755 3277 50  0000 C CNN
F 2 "" H 6750 3450 50  0001 C CNN
F 3 "" H 6750 3450 50  0001 C CNN
	1    6750 3450
	1    0    0    -1  
$EndComp
Wire Wire Line
	7250 3300 7650 3300
Wire Wire Line
	7250 3450 7250 3300
Wire Wire Line
	7150 3450 7250 3450
Wire Wire Line
	7250 3200 7650 3200
Wire Wire Line
	7250 3050 7250 3200
Wire Wire Line
	7150 3050 7250 3050
$Comp
L Device:C C?
U 1 1 613AE171
P 7000 3450
F 0 "C?" V 6748 3450 50  0000 C CNN
F 1 "100n" V 6839 3450 50  0000 C CNN
F 2 "" H 7038 3300 50  0001 C CNN
F 3 "~" H 7000 3450 50  0001 C CNN
	1    7000 3450
	0    1    1    0   
$EndComp
$Comp
L Device:C C?
U 1 1 613AC98A
P 7000 3050
F 0 "C?" V 6748 3050 50  0000 C CNN
F 1 "100n" V 6839 3050 50  0000 C CNN
F 2 "" H 7038 2900 50  0001 C CNN
F 3 "~" H 7000 3050 50  0001 C CNN
	1    7000 3050
	0    1    1    0   
$EndComp
$Comp
L Device:C C?
U 1 1 613AB4A1
P 6500 2150
F 0 "C?" V 6248 2150 50  0000 C CNN
F 1 "C" V 6339 2150 50  0000 C CNN
F 2 "" H 6538 2000 50  0001 C CNN
F 3 "~" H 6500 2150 50  0001 C CNN
	1    6500 2150
	0    1    1    0   
$EndComp
Wire Wire Line
	7150 2400 7550 2400
Wire Wire Line
	7150 2300 7450 2300
$Comp
L Device:R R?
U 1 1 613A2F61
P 7000 2400
F 0 "R?" V 7100 2400 50  0000 C CNN
F 1 "100k" V 7200 2400 50  0000 C CNN
F 2 "" V 6930 2400 50  0001 C CNN
F 3 "~" H 7000 2400 50  0001 C CNN
	1    7000 2400
	0    1    1    0   
$EndComp
$Comp
L Device:R R?
U 1 1 6139D100
P 7000 2300
F 0 "R?" V 6793 2300 50  0000 C CNN
F 1 "100k" V 6884 2300 50  0000 C CNN
F 2 "" V 6930 2300 50  0001 C CNN
F 3 "~" H 7000 2300 50  0001 C CNN
	1    7000 2300
	0    1    1    0   
$EndComp
$Comp
L 2021-08-27_19-45-09:LMH6619MA_NOPB U?
U 1 1 61378695
P 7650 2300
F 0 "U?" H 8450 2787 60  0000 C CNN
F 1 "LMH6619MA_NOPB" H 8450 2681 60  0000 C CNN
F 2 "M08A" H 8450 2640 60  0001 C CNN
F 3 "" H 7650 2300 60  0000 C CNN
	1    7650 2300
	1    0    0    -1  
$EndComp
Connection ~ 9350 2200
Wire Wire Line
	9350 2200 9750 2200
Connection ~ 9450 2300
Wire Wire Line
	7550 1500 7750 1500
Wire Wire Line
	7750 1500 7750 1400
Wire Wire Line
	7750 1400 7850 1400
Connection ~ 7750 1500
$Comp
L Device:R R?
U 1 1 617004E3
P 4100 2750
F 0 "R?" V 3893 2750 50  0000 C CNN
F 1 "25" V 3984 2750 50  0000 C CNN
F 2 "" V 4030 2750 50  0001 C CNN
F 3 "~" H 4100 2750 50  0001 C CNN
	1    4100 2750
	0    1    1    0   
$EndComp
Wire Wire Line
	3850 2750 3950 2750
$Comp
L power:GNDA #PWR?
U 1 1 6173B71F
P 5450 5900
F 0 "#PWR?" H 5450 5650 50  0001 C CNN
F 1 "GNDA" H 5455 5727 50  0000 C CNN
F 2 "" H 5450 5900 50  0001 C CNN
F 3 "" H 5450 5900 50  0001 C CNN
	1    5450 5900
	1    0    0    -1  
$EndComp
Wire Wire Line
	5450 5900 5450 5600
Wire Wire Line
	5450 5600 5550 5600
$Comp
L Device:C C?
U 1 1 6176054C
P 8000 5000
F 0 "C?" V 7748 5000 50  0000 C CNN
F 1 "110n" V 7839 5000 50  0000 C CNN
F 2 "" H 8038 4850 50  0001 C CNN
F 3 "~" H 8000 5000 50  0001 C CNN
	1    8000 5000
	0    1    1    0   
$EndComp
$Comp
L power:GNDA #PWR?
U 1 1 617B7926
P 7800 5150
F 0 "#PWR?" H 7800 4900 50  0001 C CNN
F 1 "GNDA" H 7805 4977 50  0000 C CNN
F 2 "" H 7800 5150 50  0001 C CNN
F 3 "" H 7800 5150 50  0001 C CNN
	1    7800 5150
	1    0    0    -1  
$EndComp
Wire Wire Line
	7750 4900 7750 4650
Wire Wire Line
	7750 4650 8150 4650
Wire Wire Line
	8150 4650 8150 5000
Wire Wire Line
	7750 5000 7800 5000
Wire Wire Line
	7800 5000 7800 5150
Connection ~ 7800 5000
Wire Wire Line
	7800 5000 7850 5000
Connection ~ 8150 5000
Wire Wire Line
	7750 5100 8150 5100
Wire Wire Line
	8150 5100 8150 5000
$Comp
L power:GNDREF #PWR?
U 1 1 6194A382
P 8150 5150
F 0 "#PWR?" H 8150 4900 50  0001 C CNN
F 1 "GNDREF" H 8155 4977 50  0000 C CNN
F 2 "" H 8150 5150 50  0001 C CNN
F 3 "" H 8150 5150 50  0001 C CNN
	1    8150 5150
	1    0    0    -1  
$EndComp
Wire Wire Line
	8150 5150 8150 5100
Connection ~ 8150 5100
$Comp
L Connector:Screw_Terminal_01x05 J?
U 1 1 6196398A
P 5350 2400
F 0 "J?" H 5430 2442 50  0000 L CNN
F 1 "Screw_Terminal_01x05" H 5430 2351 50  0000 L CNN
F 2 "" H 5350 2400 50  0001 C CNN
F 3 "~" H 5350 2400 50  0001 C CNN
	1    5350 2400
	1    0    0    -1  
$EndComp
$Comp
L power:GNDREF #PWR?
U 1 1 61968207
P 5150 2700
F 0 "#PWR?" H 5150 2450 50  0001 C CNN
F 1 "GNDREF" H 5155 2527 50  0000 C CNN
F 2 "" H 5150 2700 50  0001 C CNN
F 3 "" H 5150 2700 50  0001 C CNN
	1    5150 2700
	1    0    0    -1  
$EndComp
Text Label 5150 2400 2    50   ~ 0
V_EXC_B
Text Label 5150 2300 2    50   ~ 0
V_EXC_A
Text Label 5150 2200 2    50   ~ 0
I_EXC
Wire Wire Line
	5150 2700 5150 2600
Connection ~ 5150 2600
Wire Wire Line
	5150 2600 5150 2500
Wire Wire Line
	9800 4400 9800 4500
Wire Wire Line
	9800 5300 9800 5400
Connection ~ 9800 4400
Connection ~ 9800 4500
Wire Wire Line
	9800 4500 9800 4600
Connection ~ 9800 4600
Wire Wire Line
	9800 4600 9800 4700
Connection ~ 9800 4700
Wire Wire Line
	9800 4700 9800 4800
Connection ~ 9800 5300
Connection ~ 9800 5400
Wire Wire Line
	9800 5400 9800 5500
Connection ~ 9800 5500
Wire Wire Line
	9800 5500 9800 5600
Connection ~ 9800 5600
Wire Wire Line
	9800 5600 9800 5700
Connection ~ 9800 5700
Wire Wire Line
	9800 5700 9800 5800
Connection ~ 9800 5800
Wire Wire Line
	9800 5800 9800 5900
Connection ~ 9800 6100
Wire Wire Line
	5150 4900 5150 5300
Wire Wire Line
	4600 5300 4850 5300
Wire Wire Line
	4850 5200 4850 5300
Connection ~ 4850 5300
Wire Wire Line
	4850 5300 5150 5300
Wire Wire Line
	4850 4000 4850 3900
Wire Wire Line
	4600 3900 4850 3900
Connection ~ 4850 3900
Wire Wire Line
	5150 3900 4850 3900
Wire Wire Line
	5150 3900 5150 4300
Text Notes 5850 3750 0    50   ~ 0
Sigma Delta ADC
Wire Wire Line
	2350 2350 2000 2350
Wire Wire Line
	2000 2350 2000 2250
$Comp
L Device:C C?
U 1 1 616D67DC
P 2000 2600
F 0 "C?" H 2115 2646 50  0000 L CNN
F 1 "C" H 2115 2555 50  0000 L CNN
F 2 "" H 2038 2450 50  0001 C CNN
F 3 "~" H 2000 2600 50  0001 C CNN
	1    2000 2600
	1    0    0    -1  
$EndComp
$Comp
L power:GNDD #PWR?
U 1 1 616D7A1C
P 2000 3150
F 0 "#PWR?" H 2000 2900 50  0001 C CNN
F 1 "GNDD" H 2004 2995 50  0000 C CNN
F 2 "" H 2000 3150 50  0001 C CNN
F 3 "" H 2000 3150 50  0001 C CNN
	1    2000 3150
	1    0    0    -1  
$EndComp
Wire Wire Line
	2000 3150 2000 2750
Wire Wire Line
	2000 2450 2000 2350
Connection ~ 2000 2350
Text Notes 4600 3850 0    50   ~ 0
Antialiasing Filter
Text Notes 10100 2500 0    50   ~ 0
ADC Power and Grounding
Text Notes 7450 1050 0    50   ~ 0
Howland Current Pump
Text Notes 2250 750  0    50   ~ 0
Power
Text Notes 1950 2000 0    50   ~ 0
Clock Interfacing
Text Notes 600  650  0    50   ~ 0
I/O Interfacing
Text Notes 1050 4000 0    50   ~ 0
Input Buffer
Text Label 850  4650 2    50   ~ 0
V_EXC_B
Text Label 850  4550 2    50   ~ 0
V_EXC_A
Connection ~ 2250 3600
$Comp
L power:+5VA #PWR?
U 1 1 616B9D12
P 2250 3600
F 0 "#PWR?" H 2250 3450 50  0001 C CNN
F 1 "+5VA" H 2265 3773 50  0000 C CNN
F 2 "" H 2250 3600 50  0001 C CNN
F 3 "" H 2250 3600 50  0001 C CNN
	1    2250 3600
	1    0    0    -1  
$EndComp
Wire Wire Line
	2550 4100 2550 4000
Wire Wire Line
	2250 3600 2250 4350
Wire Wire Line
	2550 3600 2250 3600
Wire Wire Line
	2550 3700 2550 3600
$Comp
L Device:C C?
U 1 1 6169E4D8
P 2550 3850
F 0 "C?" H 2665 3896 50  0000 L CNN
F 1 "100n" H 2665 3805 50  0000 L CNN
F 2 "" H 2588 3700 50  0001 C CNN
F 3 "~" H 2550 3850 50  0001 C CNN
	1    2550 3850
	1    0    0    -1  
$EndComp
Connection ~ 2250 5150
Wire Wire Line
	2600 5150 2250 5150
Wire Wire Line
	2600 5250 2600 5150
Wire Wire Line
	2600 5650 2600 5550
$Comp
L power:GNDA #PWR?
U 1 1 6164ED89
P 2250 7100
F 0 "#PWR?" H 2250 6850 50  0001 C CNN
F 1 "GNDA" H 2255 6927 50  0000 C CNN
F 2 "" H 2250 7100 50  0001 C CNN
F 3 "" H 2250 7100 50  0001 C CNN
	1    2250 7100
	1    0    0    -1  
$EndComp
Wire Wire Line
	2350 4800 2350 5350
Connection ~ 2350 4800
Connection ~ 2450 4550
Wire Wire Line
	2450 4550 2450 4400
Wire Wire Line
	650  4750 850  4750
Wire Wire Line
	650  5450 650  4750
Wire Wire Line
	2450 5450 650  5450
Wire Wire Line
	2450 4550 2450 5450
Wire Wire Line
	2250 4550 2450 4550
Wire Wire Line
	750  4850 850  4850
Wire Wire Line
	750  5350 750  4850
Wire Wire Line
	2350 5350 750  5350
Wire Wire Line
	2350 4650 2350 4800
Wire Wire Line
	2250 4650 2350 4650
$Comp
L LM6142AIM:LM6142AIM U?
U 1 1 61434DFC
P 1550 4750
F 0 "U?" H 1550 5420 50  0000 C CNN
F 1 "LM6142AIM" H 1550 5329 50  0000 C CNN
F 2 "SOIC127P599X175-8N" H 1550 4750 50  0001 L BNN
F 3 "" H 1550 4750 50  0001 L BNN
	1    1550 4750
	1    0    0    -1  
$EndComp
$Comp
L power:GNDREF #PWR?
U 1 1 619FFF86
P 2550 4100
F 0 "#PWR?" H 2550 3850 50  0001 C CNN
F 1 "GNDREF" H 2555 3927 50  0000 C CNN
F 2 "" H 2550 4100 50  0001 C CNN
F 3 "" H 2550 4100 50  0001 C CNN
	1    2550 4100
	1    0    0    -1  
$EndComp
$Comp
L Device:C C?
U 1 1 61A0CD04
P 2600 5400
F 0 "C?" H 2715 5446 50  0000 L CNN
F 1 "100n" H 2715 5355 50  0000 L CNN
F 2 "" H 2638 5250 50  0001 C CNN
F 3 "~" H 2600 5400 50  0001 C CNN
	1    2600 5400
	1    0    0    -1  
$EndComp
$Comp
L power:GNDREF #PWR?
U 1 1 61A19AD2
P 2600 5650
F 0 "#PWR?" H 2600 5400 50  0001 C CNN
F 1 "GNDREF" H 2605 5477 50  0000 C CNN
F 2 "" H 2600 5650 50  0001 C CNN
F 3 "" H 2600 5650 50  0001 C CNN
	1    2600 5650
	1    0    0    -1  
$EndComp
Wire Wire Line
	2450 4400 4450 4400
Wire Wire Line
	2350 4800 4450 4800
$Comp
L 2021-09-15_12-09-10:LM339D U?
U 1 1 6178CDF9
P 3200 5900
F 0 "U?" H 4000 6387 60  0000 C CNN
F 1 "LM339D" H 4000 6281 60  0000 C CNN
F 2 "D14" H 4000 6240 60  0001 C CNN
F 3 "" H 3200 5900 60  0000 C CNN
	1    3200 5900
	1    0    0    -1  
$EndComp
Wire Wire Line
	3200 5900 3000 5900
Wire Wire Line
	3000 5900 3000 6050
Wire Wire Line
	3000 6200 3200 6200
Wire Wire Line
	3200 6900 3000 6900
Wire Wire Line
	3000 6900 3000 6750
Wire Wire Line
	3000 6600 3200 6600
Wire Wire Line
	2450 6000 3200 6000
Connection ~ 2450 5450
Wire Wire Line
	3200 6500 2450 6500
Wire Wire Line
	2450 5450 2450 6000
Connection ~ 2450 6000
Wire Wire Line
	2450 6000 2450 6500
Wire Wire Line
	2350 5350 2350 6300
Wire Wire Line
	2350 6300 3200 6300
Connection ~ 2350 5350
Wire Wire Line
	3200 6800 2350 6800
Wire Wire Line
	2350 6800 2350 6300
Connection ~ 2350 6300
$Comp
L Device:R R?
U 1 1 617FC8B8
P 1950 5850
F 0 "R?" H 2020 5896 50  0000 L CNN
F 1 "10k" H 2020 5805 50  0000 L CNN
F 2 "" V 1880 5850 50  0001 C CNN
F 3 "~" H 1950 5850 50  0001 C CNN
	1    1950 5850
	1    0    0    -1  
$EndComp
$Comp
L Device:R R?
U 1 1 617FD774
P 1950 6250
F 0 "R?" H 2020 6296 50  0000 L CNN
F 1 "10k" H 2020 6205 50  0000 L CNN
F 2 "" V 1880 6250 50  0001 C CNN
F 3 "~" H 1950 6250 50  0001 C CNN
	1    1950 6250
	1    0    0    -1  
$EndComp
$Comp
L Device:R R?
U 1 1 617FDD24
P 1950 6550
F 0 "R?" H 2020 6596 50  0000 L CNN
F 1 "10k" H 2020 6505 50  0000 L CNN
F 2 "" V 1880 6550 50  0001 C CNN
F 3 "~" H 1950 6550 50  0001 C CNN
	1    1950 6550
	1    0    0    -1  
$EndComp
$Comp
L Device:R R?
U 1 1 617FE218
P 1950 6950
F 0 "R?" H 2020 6996 50  0000 L CNN
F 1 "10k" H 2020 6905 50  0000 L CNN
F 2 "" V 1880 6950 50  0001 C CNN
F 3 "~" H 1950 6950 50  0001 C CNN
	1    1950 6950
	1    0    0    -1  
$EndComp
Wire Wire Line
	1950 6000 1950 6050
Wire Wire Line
	1950 6700 1950 6750
Connection ~ 3000 6050
Wire Wire Line
	3000 6050 3000 6200
Connection ~ 1950 6050
Wire Wire Line
	1950 6050 1950 6100
Connection ~ 3000 6750
Wire Wire Line
	3000 6750 3000 6600
Connection ~ 1950 6750
Wire Wire Line
	1950 6750 1950 6800
$Comp
L power:GNDA #PWR?
U 1 1 61864CB6
P 1950 7100
F 0 "#PWR?" H 1950 6850 50  0001 C CNN
F 1 "GNDA" H 1955 6927 50  0000 C CNN
F 2 "" H 1950 7100 50  0001 C CNN
F 3 "" H 1950 7100 50  0001 C CNN
	1    1950 7100
	1    0    0    -1  
$EndComp
$Comp
L power:GNDREF #PWR?
U 1 1 61877509
P 1450 6500
F 0 "#PWR?" H 1450 6250 50  0001 C CNN
F 1 "GNDREF" H 1455 6327 50  0000 C CNN
F 2 "" H 1450 6500 50  0001 C CNN
F 3 "" H 1450 6500 50  0001 C CNN
	1    1450 6500
	1    0    0    -1  
$EndComp
Wire Wire Line
	1450 6400 1950 6400
Wire Wire Line
	1450 6400 1450 6500
Connection ~ 1950 6400
$Comp
L power:+5VA #PWR?
U 1 1 6188B00A
P 1950 5700
F 0 "#PWR?" H 1950 5550 50  0001 C CNN
F 1 "+5VA" H 1965 5873 50  0000 C CNN
F 2 "" H 1950 5700 50  0001 C CNN
F 3 "" H 1950 5700 50  0001 C CNN
	1    1950 5700
	1    0    0    -1  
$EndComp
Wire Wire Line
	2250 5150 2250 7100
$Comp
L power:+5VA #PWR?
U 1 1 618C0EA1
P 3000 7250
F 0 "#PWR?" H 3000 7100 50  0001 C CNN
F 1 "+5VA" H 3015 7423 50  0000 C CNN
F 2 "" H 3000 7250 50  0001 C CNN
F 3 "" H 3000 7250 50  0001 C CNN
	1    3000 7250
	1    0    0    -1  
$EndComp
$Comp
L power:GNDA #PWR?
U 1 1 618C166B
P 3000 7550
F 0 "#PWR?" H 3000 7300 50  0001 C CNN
F 1 "GNDA" H 3005 7377 50  0000 C CNN
F 2 "" H 3000 7550 50  0001 C CNN
F 3 "" H 3000 7550 50  0001 C CNN
	1    3000 7550
	1    0    0    -1  
$EndComp
Wire Wire Line
	3000 7550 3000 7500
Wire Wire Line
	3000 7250 3000 7300
Wire Wire Line
	3000 7300 3200 7300
$Comp
L power:GNDREF #PWR?
U 1 1 618E6A7C
P 2500 7550
F 0 "#PWR?" H 2500 7300 50  0001 C CNN
F 1 "GNDREF" H 2505 7377 50  0000 C CNN
F 2 "" H 2500 7550 50  0001 C CNN
F 3 "" H 2500 7550 50  0001 C CNN
	1    2500 7550
	1    0    0    -1  
$EndComp
$Comp
L Device:C C?
U 1 1 618E7CE3
P 2750 7500
F 0 "C?" V 2900 7500 50  0000 C CNN
F 1 "100n" V 3000 7500 50  0000 C CNN
F 2 "" H 2788 7350 50  0001 C CNN
F 3 "~" H 2750 7500 50  0001 C CNN
	1    2750 7500
	0    1    1    0   
$EndComp
Wire Wire Line
	2500 7550 2500 7500
Wire Wire Line
	2500 7500 2600 7500
Wire Wire Line
	2900 7500 3000 7500
Connection ~ 3000 7500
Wire Wire Line
	3000 7500 3200 7500
$Comp
L Device:C C?
U 1 1 6190EFE3
P 2750 7300
F 0 "C?" V 2500 7300 50  0000 C CNN
F 1 "100n" V 2600 7300 50  0000 C CNN
F 2 "" H 2788 7150 50  0001 C CNN
F 3 "~" H 2750 7300 50  0001 C CNN
	1    2750 7300
	0    1    1    0   
$EndComp
Wire Wire Line
	2900 7300 3000 7300
Connection ~ 3000 7300
Wire Wire Line
	2600 7300 2500 7300
Wire Wire Line
	2500 7300 2500 7500
Connection ~ 2500 7500
Wire Wire Line
	3000 6050 1950 6050
Wire Wire Line
	3000 6750 1950 6750
Text Notes 9900 2050 0    50   ~ 0
Precision resistors required \nfor R?-R?
$Comp
L Device:R R?
U 1 1 61997AB5
P 4800 6750
F 0 "R?" H 4730 6704 50  0000 R CNN
F 1 "R" H 4730 6795 50  0000 R CNN
F 2 "" V 4730 6750 50  0001 C CNN
F 3 "~" H 4800 6750 50  0001 C CNN
	1    4800 6750
	-1   0    0    1   
$EndComp
$Comp
L Device:R R?
U 1 1 6199A17C
P 5050 6750
F 0 "R?" H 5120 6796 50  0000 L CNN
F 1 "R" H 5120 6705 50  0000 L CNN
F 2 "" V 4980 6750 50  0001 C CNN
F 3 "~" H 5050 6750 50  0001 C CNN
	1    5050 6750
	1    0    0    -1  
$EndComp
$Comp
L Device:R R?
U 1 1 6199AECF
P 5300 6750
F 0 "R?" H 5370 6796 50  0000 L CNN
F 1 "R" H 5370 6705 50  0000 L CNN
F 2 "" V 5230 6750 50  0001 C CNN
F 3 "~" H 5300 6750 50  0001 C CNN
	1    5300 6750
	1    0    0    -1  
$EndComp
$Comp
L Device:R R?
U 1 1 6199B116
P 5550 6750
F 0 "R?" H 5620 6796 50  0000 L CNN
F 1 "R" H 5620 6705 50  0000 L CNN
F 2 "" V 5480 6750 50  0001 C CNN
F 3 "~" H 5550 6750 50  0001 C CNN
	1    5550 6750
	1    0    0    -1  
$EndComp
Wire Wire Line
	4800 6100 4800 6600
Wire Wire Line
	4800 6000 4900 6000
Wire Wire Line
	4900 6000 4900 6500
Wire Wire Line
	4900 6500 5050 6500
Wire Wire Line
	5050 6500 5050 6600
Wire Wire Line
	4800 5900 5000 5900
Wire Wire Line
	5000 5900 5000 6400
Wire Wire Line
	5000 6400 5300 6400
Wire Wire Line
	5300 6400 5300 6600
Wire Wire Line
	4800 5800 5100 5800
Wire Wire Line
	5100 5800 5100 6300
Wire Wire Line
	5100 6300 5550 6300
Wire Wire Line
	5550 6300 5550 6600
$Comp
L Device:R R?
U 1 1 61A5451B
P 4800 7250
F 0 "R?" H 4870 7296 50  0000 L CNN
F 1 "R" H 4870 7205 50  0000 L CNN
F 2 "" V 4730 7250 50  0001 C CNN
F 3 "~" H 4800 7250 50  0001 C CNN
	1    4800 7250
	1    0    0    -1  
$EndComp
$Comp
L Device:R R?
U 1 1 61A569B7
P 5050 7250
F 0 "R?" H 5120 7296 50  0000 L CNN
F 1 "R" H 5120 7205 50  0000 L CNN
F 2 "" V 4980 7250 50  0001 C CNN
F 3 "~" H 5050 7250 50  0001 C CNN
	1    5050 7250
	1    0    0    -1  
$EndComp
$Comp
L Device:R R?
U 1 1 61A5764F
P 5300 7250
F 0 "R?" H 5370 7296 50  0000 L CNN
F 1 "R" H 5370 7205 50  0000 L CNN
F 2 "" V 5230 7250 50  0001 C CNN
F 3 "~" H 5300 7250 50  0001 C CNN
	1    5300 7250
	1    0    0    -1  
$EndComp
$Comp
L Device:R R?
U 1 1 61A582BA
P 5550 7250
F 0 "R?" H 5620 7296 50  0000 L CNN
F 1 "R" H 5620 7205 50  0000 L CNN
F 2 "" V 5480 7250 50  0001 C CNN
F 3 "~" H 5550 7250 50  0001 C CNN
	1    5550 7250
	1    0    0    -1  
$EndComp
Wire Wire Line
	4800 6900 4800 7100
Wire Wire Line
	5050 6900 5050 7100
Wire Wire Line
	5300 6900 5300 7100
Wire Wire Line
	5550 6900 5550 7100
$EndSCHEMATC
