@00000000 005a 00b4 010f 0169 01c4 021e 0279 02d3 
@00000008 032e 0388 03e3 043d 0497 04f2 054c 05a7 
@00000010 0601 065b 06b6 0710 076a 07c4 081f 0879 
@00000018 08d3 092d 0988 09e2 0a3c 0a96 0af0 0b4a 
@00000020 0ba4 0bfe 0c58 0cb2 0d0c 0d66 0dc0 0e19 
@00000028 0e73 0ecd 0f27 0f80 0fda 1034 108d 10e7 
@00000030 1140 119a 11f3 124c 12a6 12ff 1358 13b1 
@00000038 140a 1463 14bc 1515 156e 15c7 1620 1679 
@00000040 16d1 172a 1783 17db 1834 188c 18e5 193d 
@00000048 1995 19ed 1a45 1a9d 1af5 1b4d 1ba5 1bfd 
@00000050 1c55 1cac 1d04 1d5c 1db3 1e0a 1e62 1eb9 
@00000058 1f10 1f67 1fbe 2015 206c 20c3 2119 2170 
@00000060 21c7 221d 2273 22ca 2320 2376 23cc 2422 
@00000068 2478 24ce 2523 2579 25cf 2624 2679 26ce 
@00000070 2724 2779 27ce 2822 2877 28cc 2920 2975 
@00000078 29c9 2a1e 2a72 2ac6 2b1a 2b6e 2bc1 2c15 
@00000080 2c68 2cbc 2d0f 2d62 2db6 2e09 2e5b 2eae 
@00000088 2f01 2f53 2fa6 2ff8 304a 309c 30ee 3140 
@00000090 3192 31e4 3235 3286 32d8 3329 337a 33cb 
@00000098 341b 346c 34bd 350d 355d 35ad 35fd 364d 
@000000a0 369d 36ec 373c 378b 37da 382a 3878 38c7 
@000000a8 3916 3964 39b3 3a01 3a4f 3a9d 3aeb 3b39 
@000000b0 3b86 3bd3 3c21 3c6e 3cbb 3d08 3d54 3da1 
@000000b8 3ded 3e39 3e85 3ed1 3f1d 3f69 3fb4 3fff 
@000000c0 404b 4096 40e0 412b 4176 41c0 420a 4254 
@000000c8 429e 42e8 4331 437b 43c4 440d 4456 449f 
@000000d0 44e7 4530 4578 45c0 4608 4650 4697 46df 
@000000d8 4726 476d 47b4 47fb 4841 4888 48ce 4914 
@000000e0 495a 499f 49e5 4a2a 4a6f 4ab4 4af9 4b3e 
@000000e8 4b82 4bc6 4c0a 4c4e 4c92 4cd6 4d19 4d5c 
@000000f0 4d9f 4de2 4e24 4e67 4ea9 4eeb 4f2d 4f6e 
@000000f8 4fb0 4ff1 5032 5073 50b3 50f4 5134 5174 
@00000100 51b4 51f4 5233 5273 52b2 52f1 532f 536e 
@00000108 53ac 53ea 5428 5466 54a3 54e0 551e 555a 
@00000110 5597 55d3 5610 564c 5688 56c3 56ff 573a 
@00000118 5775 57b0 57ea 5825 585f 5899 58d2 590c 
@00000120 5945 597e 59b7 59f0 5a28 5a60 5a98 5ad0 
@00000128 5b08 5b3f 5b76 5bad 5be4 5c1a 5c50 5c86 
@00000130 5cbc 5cf2 5d27 5d5c 5d91 5dc6 5dfa 5e2e 
@00000138 5e62 5e96 5eca 5efd 5f30 5f63 5f95 5fc8 
@00000140 5ffa 602c 605e 608f 60c0 60f1 6122 6152 
@00000148 6183 61b3 61e3 6212 6242 6271 62a0 62ce 
@00000150 62fd 632b 6359 6386 63b4 63e1 640e 643b 
@00000158 6467 6493 64bf 64eb 6517 6542 656d 6598 
@00000160 65c2 65ec 6616 6640 666a 6693 66bc 66e5 
@00000168 670e 6736 675e 6786 67ad 67d5 67fc 6822 
@00000170 6849 686f 6895 68bb 68e1 6906 692b 6950 
@00000178 6974 6999 69bd 69e0 6a04 6a27 6a4a 6a6d 
@00000180 6a8f 6ab2 6ad4 6af5 6b17 6b38 6b59 6b7a 
@00000188 6b9a 6bba 6bda 6bfa 6c19 6c38 6c57 6c76 
@00000190 6c94 6cb2 6cd0 6cee 6d0b 6d28 6d45 6d61 
@00000198 6d7e 6d9a 6db5 6dd1 6dec 6e07 6e22 6e3c 
@000001a0 6e56 6e70 6e8a 6ea3 6ebc 6ed5 6eed 6f06 
@000001a8 6f1e 6f35 6f4d 6f64 6f7b 6f92 6fa8 6fbe 
@000001b0 6fd4 6fe9 6fff 7014 7029 703d 7051 7065 
@000001b8 7079 708c 709f 70b2 70c5 70d7 70e9 70fb 
@000001c0 710d 711e 712f 7140 7150 7160 7170 7180 
@000001c8 718f 719e 71ad 71bb 71ca 71d8 71e5 71f3 
@000001d0 7200 720d 7219 7226 7232 723d 7249 7254 
@000001d8 725f 726a 7274 727e 7288 7292 729b 72a4 
@000001e0 72ad 72b5 72bd 72c5 72cd 72d4 72db 72e2 
@000001e8 72e8 72ef 72f5 72fa 7300 7305 730a 730e 
@000001f0 7313 7317 731a 731e 7321 7324 7327 7329 
@000001f8 732b 732d 732e 7330 7331 7331 7332 7332 
