EESchema Schematic File Version 4
EELAYER 30 0
EELAYER END
$Descr A4 11693 8268
encoding utf-8
Sheet 1 1
Title ""
Date ""
Rev ""
Comp ""
Comment1 ""
Comment2 ""
Comment3 ""
Comment4 ""
$EndDescr
$Comp
L pspice:OPAMP U1
U 1 1 60399878
P 5750 3750
F 0 "U1" H 6094 3796 50  0000 L CNN
F 1 "OPAMP" H 6094 3705 50  0000 L CNN
F 2 "" H 5750 3750 50  0001 C CNN
F 3 "~" H 5750 3750 50  0001 C CNN
F 4 "X" H 5750 3750 50  0001 C CNN "Spice_Primitive"
F 5 "LM741/NS" H 5750 3750 50  0001 C CNN "Spice_Model"
F 6 "Y" H 5750 3750 50  0001 C CNN "Spice_Netlist_Enabled"
F 7 "1 2 4 5 3" H 5750 3750 50  0001 C CNN "Spice_Node_Sequence"
F 8 "/Users/brett/Documents/KiCad/Libraries/Spice Models/LM741_PSPICE/LM741.MOD" H 5750 3750 50  0001 C CNN "Spice_Lib_File"
	1    5750 3750
	1    0    0    -1  
$EndComp
$Comp
L pspice:VSOURCE V1
U 1 1 6039B199
P 2000 3250
F 0 "V1" H 2228 3296 50  0000 L CNN
F 1 "5" H 2228 3205 50  0000 L CNN
F 2 "" H 2000 3250 50  0001 C CNN
F 3 "~" H 2000 3250 50  0001 C CNN
	1    2000 3250
	1    0    0    -1  
$EndComp
$Comp
L pspice:VSOURCE V2
U 1 1 6039C484
P 2000 4250
F 0 "V2" H 2228 4296 50  0000 L CNN
F 1 "5" H 2228 4205 50  0000 L CNN
F 2 "" H 2000 4250 50  0001 C CNN
F 3 "~" H 2000 4250 50  0001 C CNN
	1    2000 4250
	1    0    0    -1  
$EndComp
Wire Wire Line
	2000 3950 2000 3750
$Comp
L power:GND #PWR01
U 1 1 6039CF4F
P 1750 3750
F 0 "#PWR01" H 1750 3500 50  0001 C CNN
F 1 "GND" H 1755 3577 50  0000 C CNN
F 2 "" H 1750 3750 50  0001 C CNN
F 3 "" H 1750 3750 50  0001 C CNN
	1    1750 3750
	1    0    0    -1  
$EndComp
Wire Wire Line
	1750 3750 2000 3750
Connection ~ 2000 3750
Wire Wire Line
	2000 3750 2000 3550
$Comp
L power:+5V #PWR02
U 1 1 6039DEF2
P 2000 2500
F 0 "#PWR02" H 2000 2350 50  0001 C CNN
F 1 "+5V" H 2015 2673 50  0000 C CNN
F 2 "" H 2000 2500 50  0001 C CNN
F 3 "" H 2000 2500 50  0001 C CNN
	1    2000 2500
	1    0    0    -1  
$EndComp
$Comp
L power:-5V #PWR03
U 1 1 6039E388
P 2000 5000
F 0 "#PWR03" H 2000 5100 50  0001 C CNN
F 1 "-5V" H 2015 5173 50  0000 C CNN
F 2 "" H 2000 5000 50  0001 C CNN
F 3 "" H 2000 5000 50  0001 C CNN
	1    2000 5000
	-1   0    0    1   
$EndComp
$Comp
L power:-5V #PWR06
U 1 1 6039E783
P 5650 5000
F 0 "#PWR06" H 5650 5100 50  0001 C CNN
F 1 "-5V" H 5665 5173 50  0000 C CNN
F 2 "" H 5650 5000 50  0001 C CNN
F 3 "" H 5650 5000 50  0001 C CNN
	1    5650 5000
	-1   0    0    1   
$EndComp
$Comp
L power:+5V #PWR05
U 1 1 6039EBDA
P 5650 2500
F 0 "#PWR05" H 5650 2350 50  0001 C CNN
F 1 "+5V" H 5665 2673 50  0000 C CNN
F 2 "" H 5650 2500 50  0001 C CNN
F 3 "" H 5650 2500 50  0001 C CNN
	1    5650 2500
	1    0    0    -1  
$EndComp
Wire Wire Line
	5650 3450 5650 2500
Wire Wire Line
	5650 4050 5650 5000
Wire Wire Line
	2000 5000 2000 4550
Wire Wire Line
	2000 2950 2000 2500
$Comp
L pspice:VSOURCE V3
U 1 1 603A0069
P 3000 4250
F 0 "V3" H 3228 4296 50  0000 L CNN
F 1 "dc 0 ac 1" H 3228 4205 50  0000 L CNN
F 2 "" H 3000 4250 50  0001 C CNN
F 3 "~" H 3000 4250 50  0001 C CNN
	1    3000 4250
	1    0    0    -1  
$EndComp
Wire Wire Line
	3000 3650 5450 3650
Wire Wire Line
	3000 3650 3000 3950
$Comp
L power:GND #PWR04
U 1 1 603A246E
P 3000 4650
F 0 "#PWR04" H 3000 4400 50  0001 C CNN
F 1 "GND" H 3005 4477 50  0000 C CNN
F 2 "" H 3000 4650 50  0001 C CNN
F 3 "" H 3000 4650 50  0001 C CNN
	1    3000 4650
	1    0    0    -1  
$EndComp
Wire Wire Line
	3000 4550 3000 4650
Wire Wire Line
	6050 3750 6500 3750
Wire Wire Line
	6500 3750 6500 4500
Wire Wire Line
	6500 4500 6300 4500
Wire Wire Line
	5000 4500 5000 3850
Wire Wire Line
	5000 3850 5450 3850
Text Label 6500 3750 0    50   ~ 0
VEXC
Text Label 3000 3650 2    50   ~ 0
VIN
$Comp
L Device:R R?
U 1 1 603A40A4
P 6150 4500
F 0 "R?" V 5943 4500 50  0000 C CNN
F 1 "250k" V 6034 4500 50  0000 C CNN
F 2 "" V 6080 4500 50  0001 C CNN
F 3 "~" H 6150 4500 50  0001 C CNN
	1    6150 4500
	0    1    1    0   
$EndComp
Wire Wire Line
	6000 4500 5000 4500
$EndSCHEMATC
