EESchema Schematic File Version 4
EELAYER 30 0
EELAYER END
$Descr A4 11693 8268
encoding utf-8
Sheet 1 1
Title "Sensor impedance analyzer board"
Date "2021-09-16"
Rev "B"
Comp "ETH Zurich - BMHT"
Comment1 "Brett Hannigan"
Comment2 ""
Comment3 ""
Comment4 ""
$EndDescr
Wire Wire Line
	2350 1900 2350 2000
Wire Wire Line
	2350 1400 2350 1600
Wire Wire Line
	1850 2000 1850 1500
Wire Wire Line
	2350 2000 1850 2000
Wire Wire Line
	2350 1000 2350 1100
$Comp
L Device:LED D3
U 1 1 611F08A1
P 2350 1750
F 0 "D3" V 2389 1633 50  0000 R CNN
F 1 "PWR_ON" V 2298 1633 50  0000 R CNN
F 2 "Diode_SMD:D_0603_1608Metric_Pad1.05x0.95mm_HandSolder" H 2350 1750 50  0001 C CNN
F 3 "~" H 2350 1750 50  0001 C CNN
	1    2350 1750
	0    -1   -1   0   
$EndComp
$Comp
L Device:R R1
U 1 1 611F00E6
P 2350 1250
F 0 "R1" H 2420 1296 50  0000 L CNN
F 1 "330" H 2420 1205 50  0000 L CNN
F 2 "Resistor_SMD:R_0603_1608Metric_Pad0.98x0.95mm_HandSolder" V 2280 1250 50  0001 C CNN
F 3 "~" H 2350 1250 50  0001 C CNN
	1    2350 1250
	1    0    0    -1  
$EndComp
Connection ~ 1850 1500
Wire Wire Line
	1850 1500 1850 1400
Wire Wire Line
	1850 1000 1850 1100
Connection ~ 1850 1000
$Comp
L Device:D_Zener D2
U 1 1 611EF4B0
P 1850 1250
F 0 "D2" V 1804 1329 50  0000 L CNN
F 1 "D_Zener" V 1895 1329 50  0000 L CNN
F 2 "Diode_SMD:D_SOD-323_HandSoldering" H 1850 1250 50  0001 C CNN
F 3 "~" H 1850 1250 50  0001 C CNN
	1    1850 1250
	0    1    1    0   
$EndComp
Wire Wire Line
	1100 1500 1100 1200
Wire Wire Line
	1600 1400 1600 1500
Wire Wire Line
	1600 1000 1600 1100
$Comp
L Device:D_Schottky D1
U 1 1 611ED1A5
P 1600 1250
F 0 "D1" V 1550 1050 50  0000 L CNN
F 1 "D_Schottky" V 1650 750 50  0000 L CNN
F 2 "Diode_SMD:D_SOD-323_HandSoldering" H 1600 1250 50  0001 C CNN
F 3 "~" H 1600 1250 50  0001 C CNN
	1    1600 1250
	0    1    1    0   
$EndComp
$Comp
L Connector:Barrel_Jack J2
U 1 1 611EB9C9
P 800 1100
F 0 "J2" H 857 1425 50  0000 C CNN
F 1 "Barrel_Jack" H 857 1334 50  0000 C CNN
F 2 "KLDX-0202-A:KLDX-0202-A" H 850 1060 50  0001 C CNN
F 3 "~" H 850 1060 50  0001 C CNN
	1    800  1100
	1    0    0    -1  
$EndComp
Wire Wire Line
	1850 1000 2350 1000
Connection ~ 2350 2000
Wire Wire Line
	2350 2000 2850 2000
$Comp
L Device:C C4
U 1 1 611F5CC1
P 2850 1650
F 0 "C4" H 2965 1696 50  0000 L CNN
F 1 "2.2u" H 2965 1605 50  0000 L CNN
F 2 "Capacitor_SMD:C_0603_1608Metric_Pad1.08x0.95mm_HandSolder" H 2888 1500 50  0001 C CNN
F 3 "~" H 2850 1650 50  0001 C CNN
	1    2850 1650
	1    0    0    -1  
$EndComp
Wire Wire Line
	2850 1000 2350 1000
Connection ~ 2350 1000
$Comp
L 2021-08-19_20-12-01:AD7724ASTZ U4
U 2 1 61201F57
P 9800 3000
F 0 "U4" H 10500 3400 60  0000 L CNN
F 1 "AD7724ASTZ" H 10300 3300 60  0000 L CNN
F 2 "AD7724ASTZ:AD7724ASTZ" H 10900 3340 60  0001 C CNN
F 3 "" H 9800 3000 60  0000 C CNN
	2    9800 3000
	1    0    0    -1  
$EndComp
$Comp
L Device:C C19
U 1 1 61215DAD
P 9100 4600
F 0 "C19" H 9215 4646 50  0000 L CNN
F 1 "100n" H 9215 4555 50  0000 L CNN
F 2 "Capacitor_SMD:C_0603_1608Metric_Pad1.08x0.95mm_HandSolder" H 9138 4450 50  0001 C CNN
F 3 "~" H 9100 4600 50  0001 C CNN
	1    9100 4600
	1    0    0    -1  
$EndComp
$Comp
L Device:C C21
U 1 1 61216FA8
P 9500 4600
F 0 "C21" H 9615 4646 50  0000 L CNN
F 1 "10u" H 9615 4555 50  0000 L CNN
F 2 "Capacitor_SMD:C_0603_1608Metric_Pad1.08x0.95mm_HandSolder" H 9538 4450 50  0001 C CNN
F 3 "~" H 9500 4600 50  0001 C CNN
	1    9500 4600
	1    0    0    -1  
$EndComp
Wire Wire Line
	9100 4450 9100 4400
Wire Wire Line
	9500 4450 9500 4400
Connection ~ 9500 4400
Wire Wire Line
	9500 4400 9800 4400
Wire Wire Line
	9100 4750 9100 4800
Wire Wire Line
	9500 4750 9500 4800
Connection ~ 9500 4800
Wire Wire Line
	9500 4800 9500 5300
Wire Wire Line
	9500 5300 9800 5300
$Comp
L power:GNDD #PWR0103
U 1 1 61220700
P 9350 6100
F 0 "#PWR0103" H 9350 5850 50  0001 C CNN
F 1 "GNDD" H 9354 5945 50  0000 C CNN
F 2 "" H 9350 6100 50  0001 C CNN
F 3 "" H 9350 6100 50  0001 C CNN
	1    9350 6100
	1    0    0    -1  
$EndComp
Wire Wire Line
	9800 6100 9800 6200
$Comp
L Device:C C17
U 1 1 61225E5B
P 8950 5750
F 0 "C17" H 9065 5796 50  0000 L CNN
F 1 "100n" H 9065 5705 50  0000 L CNN
F 2 "Capacitor_SMD:C_0603_1608Metric_Pad1.08x0.95mm_HandSolder" H 8988 5600 50  0001 C CNN
F 3 "~" H 8950 5750 50  0001 C CNN
	1    8950 5750
	1    0    0    -1  
$EndComp
$Comp
L Device:C C20
U 1 1 61226991
P 9350 5750
F 0 "C20" H 9465 5796 50  0000 L CNN
F 1 "10u" H 9465 5705 50  0000 L CNN
F 2 "Capacitor_SMD:C_0603_1608Metric_Pad1.08x0.95mm_HandSolder" H 9388 5600 50  0001 C CNN
F 3 "~" H 9350 5750 50  0001 C CNN
	1    9350 5750
	1    0    0    -1  
$EndComp
Wire Wire Line
	9350 5900 9350 6100
Connection ~ 9350 6100
Wire Wire Line
	9350 6100 9800 6100
Wire Wire Line
	8950 5900 8950 6100
$Comp
L Device:C C16
U 1 1 6123D0E0
P 8600 5750
F 0 "C16" H 8715 5796 50  0000 L CNN
F 1 "10u" H 8715 5705 50  0000 L CNN
F 2 "Capacitor_SMD:C_0603_1608Metric_Pad1.08x0.95mm_HandSolder" H 8638 5600 50  0001 C CNN
F 3 "~" H 8600 5750 50  0001 C CNN
	1    8600 5750
	1    0    0    -1  
$EndComp
$Comp
L Device:C C15
U 1 1 6123D504
P 8200 5750
F 0 "C15" H 8315 5796 50  0000 L CNN
F 1 "100n" H 8315 5705 50  0000 L CNN
F 2 "Capacitor_SMD:C_0603_1608Metric_Pad1.08x0.95mm_HandSolder" H 8238 5600 50  0001 C CNN
F 3 "~" H 8200 5750 50  0001 C CNN
	1    8200 5750
	1    0    0    -1  
$EndComp
Wire Wire Line
	8200 5900 8200 6100
Wire Wire Line
	8200 6100 8600 6100
Connection ~ 8950 6100
Wire Wire Line
	8950 6100 9350 6100
Wire Wire Line
	8600 5900 8600 6100
Connection ~ 8600 6100
Wire Wire Line
	8600 6100 8950 6100
Wire Wire Line
	8950 5400 9350 5400
Connection ~ 8950 5400
Wire Wire Line
	8950 5400 8950 5600
Wire Wire Line
	9350 5400 9350 5600
Wire Wire Line
	8200 5400 8400 5400
Wire Wire Line
	8200 5400 8200 5600
Wire Wire Line
	8600 5400 8600 5600
Connection ~ 8400 5400
Wire Wire Line
	8400 5400 8600 5400
$Comp
L Device:R R3
U 1 1 61262A78
P 4600 4400
F 0 "R3" V 4393 4400 50  0000 C CNN
F 1 "560" V 4484 4400 50  0000 C CNN
F 2 "Resistor_SMD:R_0603_1608Metric_Pad0.98x0.95mm_HandSolder" V 4530 4400 50  0001 C CNN
F 3 "~" H 4600 4400 50  0001 C CNN
	1    4600 4400
	0    1    1    0   
$EndComp
$Comp
L Device:C C5
U 1 1 61273A37
P 4850 4150
F 0 "C5" H 4965 4196 50  0000 L CNN
F 1 "2.7n" H 4965 4105 50  0000 L CNN
F 2 "Capacitor_SMD:C_0603_1608Metric_Pad1.08x0.95mm_HandSolder" H 4888 4000 50  0001 C CNN
F 3 "~" H 4850 4150 50  0001 C CNN
	1    4850 4150
	1    0    0    -1  
$EndComp
Wire Wire Line
	4750 4400 4850 4400
Wire Wire Line
	4850 4400 4850 4300
Connection ~ 4850 4400
Wire Wire Line
	5150 4300 5550 4300
$Comp
L Device:R R4
U 1 1 612924BC
P 4600 4800
F 0 "R4" V 4393 4800 50  0000 C CNN
F 1 "560" V 4484 4800 50  0000 C CNN
F 2 "Resistor_SMD:R_0603_1608Metric_Pad0.98x0.95mm_HandSolder" V 4530 4800 50  0001 C CNN
F 3 "~" H 4600 4800 50  0001 C CNN
	1    4600 4800
	0    1    1    0   
$EndComp
Wire Wire Line
	4750 4800 4850 4800
$Comp
L Device:C C6
U 1 1 61294FCD
P 4850 5050
F 0 "C6" H 4600 5100 50  0000 L CNN
F 1 "2.7n" H 4550 5000 50  0000 L CNN
F 2 "Capacitor_SMD:C_0603_1608Metric_Pad1.08x0.95mm_HandSolder" H 4888 4900 50  0001 C CNN
F 3 "~" H 4850 5050 50  0001 C CNN
	1    4850 5050
	1    0    0    -1  
$EndComp
Wire Wire Line
	4850 4900 4850 4800
Connection ~ 4850 4800
$Comp
L power:+3V3 #PWR0105
U 1 1 612A698F
P 4950 4600
F 0 "#PWR0105" H 4950 4450 50  0001 C CNN
F 1 "+3V3" H 4965 4773 50  0000 C CNN
F 2 "" H 4950 4600 50  0001 C CNN
F 3 "" H 4950 4600 50  0001 C CNN
	1    4950 4600
	1    0    0    -1  
$EndComp
Text Label 5550 5200 2    50   ~ 0
I_ADC_ZERO
Text Label 5550 5100 2    50   ~ 0
I_ADC_CAL
Text Label 5550 5300 2    50   ~ 0
I_ADC_RESET
Text Label 5550 5400 2    50   ~ 0
I_ADC_ENABLEN
Text Label 8050 4200 0    50   ~ 0
O_SD_A
Text Label 8050 4300 0    50   ~ 0
O_SD_B
Text Label 7750 4400 0    50   ~ 0
O_DVAL
Text Label 7750 4500 0    50   ~ 0
O_SCLK
$Comp
L power:+3V3 #PWR0106
U 1 1 612B8023
P 5050 5750
F 0 "#PWR0106" H 5050 5600 50  0001 C CNN
F 1 "+3V3" H 5065 5923 50  0000 C CNN
F 2 "" H 5050 5750 50  0001 C CNN
F 3 "" H 5050 5750 50  0001 C CNN
	1    5050 5750
	1    0    0    -1  
$EndComp
$Comp
L 2021-08-20_21-19-14:SN74LV1T34DBVR U1
U 1 1 612C171F
P 2900 3250
F 0 "U1" H 2950 4036 60  0000 C CNN
F 1 "SN74LV1T34DBVR" H 2950 3930 60  0000 C CNN
F 2 "SN74LV1T34DBVR:SN74LV1T34DBVR" H 2900 3190 60  0001 C CNN
F 3 "" H 2900 3250 60  0000 C CNN
	1    2900 3250
	1    0    0    -1  
$EndComp
Text Label 3200 1100 2    50   ~ 0
ENABLE
Connection ~ 2850 2000
$Comp
L power:GNDA #PWR0108
U 1 1 6133157F
P 2850 2000
F 0 "#PWR0108" H 2850 1750 50  0001 C CNN
F 1 "GNDA" H 2855 1827 50  0000 C CNN
F 2 "" H 2850 2000 50  0001 C CNN
F 3 "" H 2850 2000 50  0001 C CNN
	1    2850 2000
	1    0    0    -1  
$EndComp
$Comp
L power:GNDREF #PWR0110
U 1 1 6133DDB0
P 4600 3900
F 0 "#PWR0110" H 4600 3650 50  0001 C CNN
F 1 "GNDREF" H 4605 3727 50  0000 C CNN
F 2 "" H 4600 3900 50  0001 C CNN
F 3 "" H 4600 3900 50  0001 C CNN
	1    4600 3900
	1    0    0    -1  
$EndComp
$Comp
L power:GNDREF #PWR0111
U 1 1 6133EB86
P 4600 5300
F 0 "#PWR0111" H 4600 5050 50  0001 C CNN
F 1 "GNDREF" H 4605 5127 50  0000 C CNN
F 2 "" H 4600 5300 50  0001 C CNN
F 3 "" H 4600 5300 50  0001 C CNN
	1    4600 5300
	1    0    0    -1  
$EndComp
$Comp
L power:GNDA #PWR0112
U 1 1 6134280F
P 9500 5300
F 0 "#PWR0112" H 9500 5050 50  0001 C CNN
F 1 "GNDA" H 9505 5127 50  0000 C CNN
F 2 "" H 9500 5300 50  0001 C CNN
F 3 "" H 9500 5300 50  0001 C CNN
	1    9500 5300
	1    0    0    -1  
$EndComp
Connection ~ 9500 5300
$Comp
L power:GNDD #PWR0113
U 1 1 61343A58
P 3700 3650
F 0 "#PWR0113" H 3700 3400 50  0001 C CNN
F 1 "GNDD" H 3704 3495 50  0000 C CNN
F 2 "" H 3700 3650 50  0001 C CNN
F 3 "" H 3700 3650 50  0001 C CNN
	1    3700 3650
	1    0    0    -1  
$EndComp
$Comp
L power:+5VD #PWR0114
U 1 1 6134E4AF
P 1850 2500
F 0 "#PWR0114" H 1850 2350 50  0001 C CNN
F 1 "+5VD" H 1865 2673 50  0000 C CNN
F 2 "" H 1850 2500 50  0001 C CNN
F 3 "" H 1850 2500 50  0001 C CNN
	1    1850 2500
	1    0    0    -1  
$EndComp
NoConn ~ 2200 3650
Text Label 4300 3250 0    50   ~ 0
SCLK5
Text Label 5550 5700 2    50   ~ 0
SCLK5
Wire Wire Line
	5050 5800 5050 5750
$Comp
L Device:C C13
U 1 1 61404119
P 8000 1400
F 0 "C13" V 7748 1400 50  0000 C CNN
F 1 "20p" V 7839 1400 50  0000 C CNN
F 2 "Capacitor_SMD:C_0603_1608Metric_Pad1.08x0.95mm_HandSolder" H 8038 1250 50  0001 C CNN
F 3 "~" H 8000 1400 50  0001 C CNN
	1    8000 1400
	0    1    1    0   
$EndComp
$Comp
L Device:R R7
U 1 1 61404DF4
P 8000 1600
F 0 "R7" V 8100 1600 50  0000 C CNN
F 1 "10k" V 8200 1600 50  0000 C CNN
F 2 "Resistor_SMD:R_0603_1608Metric_Pad0.98x0.95mm_HandSolder" V 7930 1600 50  0001 C CNN
F 3 "~" H 8000 1600 50  0001 C CNN
	1    8000 1600
	0    1    1    0   
$EndComp
Wire Wire Line
	8150 1400 8250 1400
Wire Wire Line
	8250 1400 8250 1500
Wire Wire Line
	8250 1600 8150 1600
Connection ~ 8250 1500
Wire Wire Line
	8250 1500 8250 1600
$Comp
L Device:C C18
U 1 1 61473278
P 8900 1000
F 0 "C18" V 8648 1000 50  0000 C CNN
F 1 "20p" V 8739 1000 50  0000 C CNN
F 2 "Capacitor_SMD:C_0603_1608Metric_Pad1.08x0.95mm_HandSolder" H 8938 850 50  0001 C CNN
F 3 "~" H 8900 1000 50  0001 C CNN
	1    8900 1000
	0    1    1    0   
$EndComp
$Comp
L Device:R R8
U 1 1 61473A5B
P 8900 1200
F 0 "R8" V 9000 1200 50  0000 C CNN
F 1 "10k" V 9100 1200 50  0000 C CNN
F 2 "Resistor_SMD:R_0603_1608Metric_Pad0.98x0.95mm_HandSolder" V 8830 1200 50  0001 C CNN
F 3 "~" H 8900 1200 50  0001 C CNN
	1    8900 1200
	0    1    1    0   
$EndComp
Wire Wire Line
	8750 1000 8650 1000
Wire Wire Line
	8650 1000 8650 1100
Wire Wire Line
	8650 1200 8750 1200
Wire Wire Line
	9050 1000 9150 1000
Wire Wire Line
	9150 1000 9150 1100
Wire Wire Line
	9150 1200 9050 1200
Wire Wire Line
	8650 1100 7450 1100
Connection ~ 8650 1100
Wire Wire Line
	8650 1100 8650 1200
Wire Wire Line
	9150 1100 9350 1100
Connection ~ 9150 1100
Wire Wire Line
	9150 1100 9150 1200
Wire Wire Line
	9350 1100 9350 2300
Wire Wire Line
	7450 3700 9550 3700
Wire Wire Line
	7450 2600 7450 3700
Wire Wire Line
	7650 2600 7450 2600
Wire Wire Line
	7550 2700 7550 3600
Wire Wire Line
	7650 2700 7550 2700
Wire Wire Line
	7450 1100 7450 2300
Wire Wire Line
	7550 1500 7550 2400
Wire Wire Line
	7450 2300 7650 2300
Connection ~ 7450 2300
Wire Wire Line
	7750 1600 7750 1500
Wire Wire Line
	7850 1600 7750 1600
Wire Wire Line
	7550 2400 7650 2400
Connection ~ 7550 2400
Wire Wire Line
	6250 3450 6750 3450
Wire Wire Line
	6250 2550 6250 3450
Wire Wire Line
	6350 2550 6250 2550
Wire Wire Line
	6750 2300 6850 2300
Wire Wire Line
	6750 2150 6750 2300
Wire Wire Line
	6650 2150 6750 2150
Wire Wire Line
	6750 2550 6750 2400
Wire Wire Line
	6650 2550 6750 2550
$Comp
L Device:C C10
U 1 1 613F29EF
P 6500 2550
F 0 "C10" V 6248 2550 50  0000 C CNN
F 1 "1u" V 6339 2550 50  0000 C CNN
F 2 "Capacitor_SMD:C_0603_1608Metric_Pad1.08x0.95mm_HandSolder" H 6538 2400 50  0001 C CNN
F 3 "~" H 6500 2550 50  0001 C CNN
	1    6500 2550
	0    1    1    0   
$EndComp
Wire Wire Line
	7250 2850 7250 3050
Connection ~ 7250 3050
$Comp
L power:+5VA #PWR0115
U 1 1 613D5659
P 7250 2850
F 0 "#PWR0115" H 7250 2700 50  0001 C CNN
F 1 "+5VA" H 7265 3023 50  0000 C CNN
F 2 "" H 7250 2850 50  0001 C CNN
F 3 "" H 7250 2850 50  0001 C CNN
	1    7250 2850
	1    0    0    -1  
$EndComp
Connection ~ 7250 3450
Wire Wire Line
	7250 3700 7250 3450
$Comp
L power:GNDA #PWR0116
U 1 1 613C69AF
P 7250 3700
F 0 "#PWR0116" H 7250 3450 50  0001 C CNN
F 1 "GNDA" H 7255 3527 50  0000 C CNN
F 2 "" H 7250 3700 50  0001 C CNN
F 3 "" H 7250 3700 50  0001 C CNN
	1    7250 3700
	1    0    0    -1  
$EndComp
Wire Wire Line
	6750 3450 6750 3050
Connection ~ 6750 3450
Wire Wire Line
	6850 3450 6750 3450
Wire Wire Line
	6850 3050 6750 3050
Wire Wire Line
	6750 2400 6850 2400
$Comp
L power:GNDREF #PWR0117
U 1 1 613B784D
P 6750 3450
F 0 "#PWR0117" H 6750 3200 50  0001 C CNN
F 1 "GNDREF" H 6755 3277 50  0000 C CNN
F 2 "" H 6750 3450 50  0001 C CNN
F 3 "" H 6750 3450 50  0001 C CNN
	1    6750 3450
	1    0    0    -1  
$EndComp
Wire Wire Line
	7250 3300 7650 3300
Wire Wire Line
	7250 3450 7250 3300
Wire Wire Line
	7150 3450 7250 3450
Wire Wire Line
	7250 3200 7650 3200
Wire Wire Line
	7250 3050 7250 3200
Wire Wire Line
	7150 3050 7250 3050
$Comp
L Device:C C12
U 1 1 613AE171
P 7000 3450
F 0 "C12" V 6748 3450 50  0000 C CNN
F 1 "100n" V 6839 3450 50  0000 C CNN
F 2 "Capacitor_SMD:C_0603_1608Metric_Pad1.08x0.95mm_HandSolder" H 7038 3300 50  0001 C CNN
F 3 "~" H 7000 3450 50  0001 C CNN
	1    7000 3450
	0    1    1    0   
$EndComp
$Comp
L Device:C C11
U 1 1 613AC98A
P 7000 3050
F 0 "C11" V 6748 3050 50  0000 C CNN
F 1 "100n" V 6839 3050 50  0000 C CNN
F 2 "Capacitor_SMD:C_0603_1608Metric_Pad1.08x0.95mm_HandSolder" H 7038 2900 50  0001 C CNN
F 3 "~" H 7000 3050 50  0001 C CNN
	1    7000 3050
	0    1    1    0   
$EndComp
Wire Wire Line
	7150 2400 7550 2400
Wire Wire Line
	7150 2300 7450 2300
$Comp
L Device:R R6
U 1 1 613A2F61
P 7000 2400
F 0 "R6" V 7100 2400 50  0000 C CNN
F 1 "100k" V 7200 2400 50  0000 C CNN
F 2 "Resistor_SMD:R_0603_1608Metric_Pad0.98x0.95mm_HandSolder" V 6930 2400 50  0001 C CNN
F 3 "~" H 7000 2400 50  0001 C CNN
	1    7000 2400
	0    1    1    0   
$EndComp
$Comp
L Device:R R5
U 1 1 6139D100
P 7000 2300
F 0 "R5" V 6793 2300 50  0000 C CNN
F 1 "100k" V 6884 2300 50  0000 C CNN
F 2 "Resistor_SMD:R_0603_1608Metric_Pad0.98x0.95mm_HandSolder" V 6930 2300 50  0001 C CNN
F 3 "~" H 7000 2300 50  0001 C CNN
	1    7000 2300
	0    1    1    0   
$EndComp
$Comp
L 2021-09-17_11-40-57:LMH6619MA_NOPB U6
U 1 1 61378695
P 7650 2300
F 0 "U6" H 8450 2787 60  0000 C CNN
F 1 "LMH6619MA_NOPB" H 8450 2681 60  0000 C CNN
F 2 "LMH6619MA:LMH6619MA" H 8450 2640 60  0001 C CNN
F 3 "" H 7650 2300 60  0000 C CNN
	1    7650 2300
	1    0    0    -1  
$EndComp
Wire Wire Line
	7550 1500 7750 1500
Wire Wire Line
	7750 1500 7750 1400
Wire Wire Line
	7750 1400 7850 1400
Connection ~ 7750 1500
$Comp
L Device:R R2
U 1 1 617004E3
P 3950 3250
F 0 "R2" V 3743 3250 50  0000 C CNN
F 1 "22" V 3834 3250 50  0000 C CNN
F 2 "Resistor_SMD:R_0603_1608Metric_Pad0.98x0.95mm_HandSolder" V 3880 3250 50  0001 C CNN
F 3 "~" H 3950 3250 50  0001 C CNN
	1    3950 3250
	0    1    1    0   
$EndComp
Wire Wire Line
	3700 3250 3800 3250
$Comp
L power:GNDA #PWR0118
U 1 1 6173B71F
P 5250 5900
F 0 "#PWR0118" H 5250 5650 50  0001 C CNN
F 1 "GNDA" H 5255 5727 50  0000 C CNN
F 2 "" H 5250 5900 50  0001 C CNN
F 3 "" H 5250 5900 50  0001 C CNN
	1    5250 5900
	1    0    0    -1  
$EndComp
$Comp
L Device:C C14
U 1 1 6176054C
P 7750 4750
F 0 "C14" V 7498 4750 50  0000 C CNN
F 1 "110n" V 7589 4750 50  0000 C CNN
F 2 "Capacitor_SMD:C_0603_1608Metric_Pad1.08x0.95mm_HandSolder" H 7788 4600 50  0001 C CNN
F 3 "~" H 7750 4750 50  0001 C CNN
	1    7750 4750
	-1   0    0    1   
$EndComp
$Comp
L power:GNDA #PWR0119
U 1 1 617B7926
P 8000 4900
F 0 "#PWR0119" H 8000 4650 50  0001 C CNN
F 1 "GNDA" H 8005 4727 50  0000 C CNN
F 2 "" H 8000 4900 50  0001 C CNN
F 3 "" H 8000 4900 50  0001 C CNN
	1    8000 4900
	1    0    0    -1  
$EndComp
$Comp
L power:GNDREF #PWR0121
U 1 1 61968207
P 4650 3300
F 0 "#PWR0121" H 4650 3050 50  0001 C CNN
F 1 "GNDREF" H 4655 3127 50  0000 C CNN
F 2 "" H 4650 3300 50  0001 C CNN
F 3 "" H 4650 3300 50  0001 C CNN
	1    4650 3300
	1    0    0    -1  
$EndComp
Text Label 5050 2800 2    50   ~ 0
V_EXC_B
Text Label 5050 2350 2    50   ~ 0
V_EXC_A
Text Label 5050 2250 2    50   ~ 0
I_EXC
Wire Wire Line
	4600 5300 4850 5300
Wire Wire Line
	4850 5200 4850 5300
Connection ~ 4850 5300
Wire Wire Line
	4850 5300 5000 5300
Wire Wire Line
	4850 4000 4850 3900
Wire Wire Line
	4600 3900 4850 3900
Connection ~ 4850 3900
Wire Wire Line
	5150 3900 4850 3900
Wire Wire Line
	5150 3900 5150 4300
Text Notes 5850 3750 0    50   ~ 10
Sigma Delta ADC
Wire Wire Line
	2200 2600 1850 2600
Wire Wire Line
	1850 2600 1850 2500
$Comp
L Device:C C1
U 1 1 616D67DC
P 1850 2850
F 0 "C1" H 1965 2896 50  0000 L CNN
F 1 "100n" H 1965 2805 50  0000 L CNN
F 2 "Capacitor_SMD:C_0603_1608Metric_Pad1.08x0.95mm_HandSolder" H 1888 2700 50  0001 C CNN
F 3 "~" H 1850 2850 50  0001 C CNN
	1    1850 2850
	1    0    0    -1  
$EndComp
$Comp
L power:GNDD #PWR0122
U 1 1 616D7A1C
P 1850 3100
F 0 "#PWR0122" H 1850 2850 50  0001 C CNN
F 1 "GNDD" H 1854 2945 50  0000 C CNN
F 2 "" H 1850 3100 50  0001 C CNN
F 3 "" H 1850 3100 50  0001 C CNN
	1    1850 3100
	1    0    0    -1  
$EndComp
Wire Wire Line
	1850 2700 1850 2600
Connection ~ 1850 2600
Text Notes 4600 3850 0    50   ~ 10
Antialiasing Filter
Text Notes 10100 2500 0    50   ~ 10
ADC Power and Grounding
Text Notes 7450 1050 0    50   ~ 10
Howland Current Pump
Text Notes 600  700  0    50   ~ 10
Power
Text Notes 2400 2400 0    50   ~ 0
Clock Interfacing
$Comp
L power:GNDREF #PWR0123
U 1 1 61A19AD2
P 4100 5650
F 0 "#PWR0123" H 4100 5400 50  0001 C CNN
F 1 "GNDREF" H 4105 5477 50  0000 C CNN
F 2 "" H 4100 5650 50  0001 C CNN
F 3 "" H 4100 5650 50  0001 C CNN
	1    4100 5650
	1    0    0    -1  
$EndComp
$Comp
L Device:C C3
U 1 1 61A0CD04
P 4100 5400
F 0 "C3" H 4215 5446 50  0000 L CNN
F 1 "100n" H 4215 5355 50  0000 L CNN
F 2 "Capacitor_SMD:C_0603_1608Metric_Pad1.08x0.95mm_HandSolder" H 4138 5250 50  0001 C CNN
F 3 "~" H 4100 5400 50  0001 C CNN
	1    4100 5400
	1    0    0    -1  
$EndComp
$Comp
L power:GNDREF #PWR0124
U 1 1 619FFF86
P 4250 4100
F 0 "#PWR0124" H 4250 3850 50  0001 C CNN
F 1 "GNDREF" H 4255 3927 50  0000 C CNN
F 2 "" H 4250 4100 50  0001 C CNN
F 3 "" H 4250 4100 50  0001 C CNN
	1    4250 4100
	1    0    0    -1  
$EndComp
$Comp
L LM6142AIM:LM6142AIM U2
U 1 1 61434DFC
P 3050 4750
F 0 "U2" H 3050 5420 50  0000 C CNN
F 1 "LM6142AIM" H 3050 5329 50  0000 C CNN
F 2 "LM6142AIM:LM6142AIM" H 3050 4750 50  0001 L BNN
F 3 "" H 3050 4750 50  0001 L BNN
	1    3050 4750
	1    0    0    -1  
$EndComp
Wire Wire Line
	3750 4650 3850 4650
Wire Wire Line
	3850 4650 3850 4800
Wire Wire Line
	3750 4550 3950 4550
Wire Wire Line
	3950 4550 3950 5450
Wire Wire Line
	3950 4550 3950 4400
Wire Wire Line
	3950 4400 4400 4400
Connection ~ 3950 4550
Wire Wire Line
	4450 4800 4400 4800
Connection ~ 3850 4800
$Comp
L power:GNDA #PWR0125
U 1 1 6164ED89
P 3750 5650
F 0 "#PWR0125" H 3750 5400 50  0001 C CNN
F 1 "GNDA" H 3755 5477 50  0000 C CNN
F 2 "" H 3750 5650 50  0001 C CNN
F 3 "" H 3750 5650 50  0001 C CNN
	1    3750 5650
	1    0    0    -1  
$EndComp
Wire Wire Line
	4100 5650 4100 5550
Wire Wire Line
	4100 5250 4100 5150
$Comp
L Device:C C2
U 1 1 6169E4D8
P 4250 3850
F 0 "C2" H 4365 3896 50  0000 L CNN
F 1 "100n" H 4365 3805 50  0000 L CNN
F 2 "Capacitor_SMD:C_0603_1608Metric_Pad1.08x0.95mm_HandSolder" H 4288 3700 50  0001 C CNN
F 3 "~" H 4250 3850 50  0001 C CNN
	1    4250 3850
	1    0    0    -1  
$EndComp
Wire Wire Line
	4250 3700 4250 3600
Wire Wire Line
	4250 4100 4250 4000
$Comp
L power:+5VA #PWR0126
U 1 1 616B9D12
P 4100 3600
F 0 "#PWR0126" H 4100 3450 50  0001 C CNN
F 1 "+5VA" H 4115 3773 50  0000 C CNN
F 2 "" H 4100 3600 50  0001 C CNN
F 3 "" H 4100 3600 50  0001 C CNN
	1    4100 3600
	1    0    0    -1  
$EndComp
Text Label 2350 4200 1    50   ~ 0
V_EXC_A
Text Label 2250 4200 1    50   ~ 0
V_EXC_B
Text Notes 2550 4000 0    50   ~ 0
Input Buffer
Text Notes 950  3250 0    50   ~ 10
I/O Interfacing
Wire Wire Line
	850  3600 1150 3600
Wire Wire Line
	1150 3600 1150 3650
Connection ~ 1150 3600
$Comp
L power:+3V3 #PWR0127
U 1 1 61212DD2
P 850 3600
F 0 "#PWR0127" H 850 3450 50  0001 C CNN
F 1 "+3V3" H 865 3773 50  0000 C CNN
F 2 "" H 850 3600 50  0001 C CNN
F 3 "" H 850 3600 50  0001 C CNN
	1    850  3600
	1    0    0    -1  
$EndComp
Wire Wire Line
	1150 3550 1150 3600
Wire Wire Line
	9350 2300 9250 2300
Wire Wire Line
	9350 2300 9350 3600
Wire Wire Line
	7550 3600 9350 3600
Connection ~ 9350 2300
Wire Wire Line
	9450 1400 9450 1500
Text Label 10550 1100 0    50   ~ 0
I_EXC
Wire Wire Line
	10350 1100 10450 1100
Wire Wire Line
	9950 1700 10050 1700
Wire Wire Line
	9950 1400 9950 1700
Wire Wire Line
	9950 800  10050 800 
Wire Wire Line
	9950 1100 9950 800 
Wire Wire Line
	10050 1300 10050 1400
Wire Wire Line
	9950 1300 10050 1300
Wire Wire Line
	10050 1200 10050 1100
Wire Wire Line
	9950 1200 10050 1200
$Comp
L Device:R R12
U 1 1 6158909B
P 10200 1700
F 0 "R12" V 9993 1700 50  0000 C CNN
F 1 "10" V 10084 1700 50  0000 C CNN
F 2 "Resistor_SMD:R_0603_1608Metric_Pad0.98x0.95mm_HandSolder" V 10130 1700 50  0001 C CNN
F 3 "~" H 10200 1700 50  0001 C CNN
	1    10200 1700
	0    1    1    0   
$EndComp
$Comp
L Device:R R9
U 1 1 61588CC3
P 10200 800
F 0 "R9" V 9993 800 50  0000 C CNN
F 1 "10k" V 10084 800 50  0000 C CNN
F 2 "Resistor_SMD:R_0603_1608Metric_Pad0.98x0.95mm_HandSolder" V 10130 800 50  0001 C CNN
F 3 "~" H 10200 800 50  0001 C CNN
	1    10200 800 
	0    1    1    0   
$EndComp
$Comp
L Device:R R11
U 1 1 615888B2
P 10200 1400
F 0 "R11" V 9993 1400 50  0000 C CNN
F 1 "100" V 10084 1400 50  0000 C CNN
F 2 "Resistor_SMD:R_0603_1608Metric_Pad0.98x0.95mm_HandSolder" V 10130 1400 50  0001 C CNN
F 3 "~" H 10200 1400 50  0001 C CNN
	1    10200 1400
	0    1    1    0   
$EndComp
$Comp
L Device:R R10
U 1 1 615875E3
P 10200 1100
F 0 "R10" V 9993 1100 50  0000 C CNN
F 1 "1k" V 10084 1100 50  0000 C CNN
F 2 "Resistor_SMD:R_0603_1608Metric_Pad0.98x0.95mm_HandSolder" V 10130 1100 50  0001 C CNN
F 3 "~" H 10200 1100 50  0001 C CNN
	1    10200 1100
	0    1    1    0   
$EndComp
Connection ~ 9450 1400
Wire Wire Line
	9450 1300 9450 1400
Connection ~ 9450 1300
Wire Wire Line
	9450 1200 9450 1300
Connection ~ 9450 1200
Wire Wire Line
	9450 1100 9450 1200
$Comp
L Connector_Generic:Conn_02x04_Odd_Even J6
U 1 1 6153F949
P 9650 1200
F 0 "J6" H 9700 1517 50  0000 C CNN
F 1 "Conn_02x04_Odd_Even" H 9700 1426 50  0000 C CNN
F 2 "Connector_PinHeader_2.54mm:PinHeader_2x04_P2.54mm_Vertical" H 9650 1200 50  0001 C CNN
F 3 "~" H 9650 1200 50  0001 C CNN
	1    9650 1200
	1    0    0    -1  
$EndComp
Connection ~ 9450 1500
Wire Wire Line
	9450 1500 9450 2200
Wire Wire Line
	9250 2200 9450 2200
Wire Wire Line
	8250 1500 9450 1500
Wire Wire Line
	9550 1850 9550 3700
NoConn ~ 1650 3550
$Comp
L Device:R R13
U 1 1 61D07EA0
P 4050 6650
F 0 "R13" H 3980 6604 50  0000 R CNN
F 1 "180" H 3980 6695 50  0000 R CNN
F 2 "Resistor_SMD:R_0603_1608Metric_Pad0.98x0.95mm_HandSolder" V 3980 6650 50  0001 C CNN
F 3 "~" H 4050 6650 50  0001 C CNN
	1    4050 6650
	-1   0    0    1   
$EndComp
$Comp
L Device:LED D4
U 1 1 61D08E89
P 4050 7150
F 0 "D4" V 4089 7033 50  0000 R CNN
F 1 "ENABLE" V 3998 7033 50  0000 R CNN
F 2 "Diode_SMD:D_0603_1608Metric_Pad1.05x0.95mm_HandSolder" H 4050 7150 50  0001 C CNN
F 3 "~" H 4050 7150 50  0001 C CNN
	1    4050 7150
	0    -1   -1   0   
$EndComp
Text Label 1150 4350 2    50   ~ 0
I_ADC_ZERO
$Comp
L power:GNDD #PWR0129
U 1 1 61EE260E
P 5800 7300
F 0 "#PWR0129" H 5800 7050 50  0001 C CNN
F 1 "GNDD" H 5804 7145 50  0000 C CNN
F 2 "" H 5800 7300 50  0001 C CNN
F 3 "" H 5800 7300 50  0001 C CNN
	1    5800 7300
	1    0    0    -1  
$EndComp
$Comp
L power:GNDA #PWR0130
U 1 1 61EE392C
P 6300 7300
F 0 "#PWR0130" H 6300 7050 50  0001 C CNN
F 1 "GNDA" H 6305 7127 50  0000 C CNN
F 2 "" H 6300 7300 50  0001 C CNN
F 3 "" H 6300 7300 50  0001 C CNN
	1    6300 7300
	1    0    0    -1  
$EndComp
Wire Wire Line
	5800 7300 5800 7200
Wire Wire Line
	6300 7200 6300 7300
Wire Wire Line
	1850 3100 1850 3000
Wire Wire Line
	4100 3600 4250 3600
Wire Wire Line
	3900 4350 3900 3600
Wire Wire Line
	3900 3600 4100 3600
Connection ~ 4100 3600
Wire Wire Line
	3750 4350 3900 4350
Wire Wire Line
	2200 2600 2200 2850
NoConn ~ 1150 4950
NoConn ~ 1650 4950
NoConn ~ 1150 5250
NoConn ~ 1150 5150
$Comp
L power:PWR_FLAG #FLG0102
U 1 1 62521E6F
P 5850 6850
F 0 "#FLG0102" H 5850 6925 50  0001 C CNN
F 1 "PWR_FLAG" H 5850 7023 50  0000 C CNN
F 2 "" H 5850 6850 50  0001 C CNN
F 3 "~" H 5850 6850 50  0001 C CNN
	1    5850 6850
	-1   0    0    1   
$EndComp
$Comp
L power:PWR_FLAG #FLG0103
U 1 1 625223F9
P 6250 6850
F 0 "#FLG0103" H 6250 6925 50  0001 C CNN
F 1 "PWR_FLAG" H 6250 7023 50  0000 C CNN
F 2 "" H 6250 6850 50  0001 C CNN
F 3 "~" H 6250 6850 50  0001 C CNN
	1    6250 6850
	-1   0    0    1   
$EndComp
$Comp
L power:+3V3 #PWR0131
U 1 1 625231E9
P 6250 6750
F 0 "#PWR0131" H 6250 6600 50  0001 C CNN
F 1 "+3V3" H 6265 6923 50  0000 C CNN
F 2 "" H 6250 6750 50  0001 C CNN
F 3 "" H 6250 6750 50  0001 C CNN
	1    6250 6750
	1    0    0    -1  
$EndComp
$Comp
L power:+5VA #PWR0132
U 1 1 62523892
P 5450 6750
F 0 "#PWR0132" H 5450 6600 50  0001 C CNN
F 1 "+5VA" H 5465 6923 50  0000 C CNN
F 2 "" H 5450 6750 50  0001 C CNN
F 3 "" H 5450 6750 50  0001 C CNN
	1    5450 6750
	1    0    0    -1  
$EndComp
$Comp
L power:+5VD #PWR0133
U 1 1 6252478C
P 5850 6750
F 0 "#PWR0133" H 5850 6600 50  0001 C CNN
F 1 "+5VD" H 5865 6923 50  0000 C CNN
F 2 "" H 5850 6750 50  0001 C CNN
F 3 "" H 5850 6750 50  0001 C CNN
	1    5850 6750
	1    0    0    -1  
$EndComp
Wire Wire Line
	5850 6850 5850 6750
Wire Wire Line
	6250 6850 6250 6750
$Comp
L BLM03AX102SN1J:BLM03AX102SN1J FL1
U 1 1 6261B598
P 8000 800
F 0 "FL1" H 8000 550 50  0000 C CNN
F 1 "BLM03AX102SN1J" H 8000 650 50  0000 C CNN
F 2 "BLM03AX102SN1J:BEADC0603X33N" H 8000 800 50  0001 L BNN
F 3 "" H 8000 800 50  0001 L BNN
	1    8000 800 
	-1   0    0    1   
$EndComp
$Comp
L power:+5VD #PWR0134
U 1 1 6270153B
P 8600 700
F 0 "#PWR0134" H 8600 550 50  0001 C CNN
F 1 "+5VD" H 8615 873 50  0000 C CNN
F 2 "" H 8600 700 50  0001 C CNN
F 3 "" H 8600 700 50  0001 C CNN
	1    8600 700 
	1    0    0    -1  
$EndComp
Wire Wire Line
	8600 800  8600 700 
$Comp
L power:+6V #PWR0135
U 1 1 6272AD02
P 1850 1000
F 0 "#PWR0135" H 1850 850 50  0001 C CNN
F 1 "+6V" H 1865 1173 50  0000 C CNN
F 2 "" H 1850 1000 50  0001 C CNN
F 3 "" H 1850 1000 50  0001 C CNN
	1    1850 1000
	1    0    0    -1  
$EndComp
$Comp
L power:PWR_FLAG #FLG0104
U 1 1 62763175
P 6650 6850
F 0 "#FLG0104" H 6650 6925 50  0001 C CNN
F 1 "PWR_FLAG" H 6650 7023 50  0000 C CNN
F 2 "" H 6650 6850 50  0001 C CNN
F 3 "~" H 6650 6850 50  0001 C CNN
	1    6650 6850
	-1   0    0    1   
$EndComp
$Comp
L power:+6V #PWR0136
U 1 1 62763BD5
P 6650 6750
F 0 "#PWR0136" H 6650 6600 50  0001 C CNN
F 1 "+6V" H 6665 6923 50  0000 C CNN
F 2 "" H 6650 6750 50  0001 C CNN
F 3 "" H 6650 6750 50  0001 C CNN
	1    6650 6750
	1    0    0    -1  
$EndComp
Wire Wire Line
	6650 6750 6650 6850
Text Label 1650 4750 0    50   ~ 0
O_DVAL
Text Notes 9600 1950 0    50   ~ 0
Note: R9-R12 are precision resistors
$Comp
L Device:R R14
U 1 1 6305C464
P 3600 6650
F 0 "R14" H 3530 6604 50  0000 R CNN
F 1 "180" H 3530 6695 50  0000 R CNN
F 2 "Resistor_SMD:R_0603_1608Metric_Pad0.98x0.95mm_HandSolder" V 3530 6650 50  0001 C CNN
F 3 "~" H 3600 6650 50  0001 C CNN
	1    3600 6650
	-1   0    0    1   
$EndComp
Wire Wire Line
	4050 6800 4050 7000
Wire Wire Line
	4050 7300 4050 7500
$Comp
L Device:LED D5
U 1 1 63353E69
P 3600 7150
F 0 "D5" V 3639 7033 50  0000 R CNN
F 1 "BUSY" V 3548 7033 50  0000 R CNN
F 2 "Diode_SMD:D_0603_1608Metric_Pad1.05x0.95mm_HandSolder" H 3600 7150 50  0001 C CNN
F 3 "~" H 3600 7150 50  0001 C CNN
	1    3600 7150
	0    -1   -1   0   
$EndComp
Wire Wire Line
	3600 7000 3600 6800
Wire Wire Line
	3600 7300 3600 7500
Text Notes 4000 7250 1    50   ~ 0
ENABLE
Text Notes 3550 7250 1    50   ~ 0
BUSY
NoConn ~ 1650 5150
NoConn ~ 1650 5250
NoConn ~ 1650 5350
$Comp
L Device:R R15
U 1 1 634A2911
P 3200 6650
F 0 "R15" H 3130 6604 50  0000 R CNN
F 1 "180" H 3130 6695 50  0000 R CNN
F 2 "Resistor_SMD:R_0603_1608Metric_Pad0.98x0.95mm_HandSolder" V 3130 6650 50  0001 C CNN
F 3 "~" H 3200 6650 50  0001 C CNN
	1    3200 6650
	-1   0    0    1   
$EndComp
$Comp
L Device:LED D6
U 1 1 634A2BCB
P 3200 7150
F 0 "D6" V 3239 7033 50  0000 R CNN
F 1 "TX" V 3148 7033 50  0000 R CNN
F 2 "Diode_SMD:D_0603_1608Metric_Pad1.05x0.95mm_HandSolder" H 3200 7150 50  0001 C CNN
F 3 "~" H 3200 7150 50  0001 C CNN
	1    3200 7150
	0    -1   -1   0   
$EndComp
Wire Wire Line
	3200 7300 3200 7500
Wire Wire Line
	3200 7000 3200 6800
Text Notes 3150 7200 1    50   ~ 0
TX
Wire Wire Line
	750  7500 1250 7500
Connection ~ 750  7500
Text Notes 1700 7300 1    50   ~ 0
TRIG
Wire Wire Line
	1750 6500 1750 6400
$Comp
L power:+3V3 #PWR04
U 1 1 62ED812C
P 1750 6400
F 0 "#PWR04" H 1750 6250 50  0001 C CNN
F 1 "+3V3" H 1765 6573 50  0000 C CNN
F 2 "" H 1750 6400 50  0001 C CNN
F 3 "" H 1750 6400 50  0001 C CNN
	1    1750 6400
	1    0    0    -1  
$EndComp
$Comp
L Device:R R19
U 1 1 62E65EA7
P 1750 6650
F 0 "R19" H 1820 6696 50  0000 L CNN
F 1 "4.7k" H 1820 6605 50  0000 L CNN
F 2 "Resistor_SMD:R_0603_1608Metric_Pad0.98x0.95mm_HandSolder" V 1680 6650 50  0001 C CNN
F 3 "~" H 1750 6650 50  0001 C CNN
	1    1750 6650
	1    0    0    -1  
$EndComp
Wire Wire Line
	1750 7400 1750 7500
$Comp
L Switch:SW_Push SW3
U 1 1 62E36AC2
P 1750 7200
F 0 "SW3" H 1750 7485 50  0000 C CNN
F 1 "SW_TRIG" H 1750 7394 50  0000 C CNN
F 2 "Custom:PTS636_SMTR" H 1750 7400 50  0001 C CNN
F 3 "~" H 1750 7400 50  0001 C CNN
	1    1750 7200
	0    1    1    0   
$EndComp
Wire Wire Line
	1250 6400 1250 6500
Wire Wire Line
	750  6400 750  6500
$Comp
L power:+3V3 #PWR01
U 1 1 62D88DAA
P 750 6400
F 0 "#PWR01" H 750 6250 50  0001 C CNN
F 1 "+3V3" H 765 6573 50  0000 C CNN
F 2 "" H 750 6400 50  0001 C CNN
F 3 "" H 750 6400 50  0001 C CNN
	1    750  6400
	1    0    0    -1  
$EndComp
$Comp
L power:+3V3 #PWR03
U 1 1 62D8882A
P 1250 6400
F 0 "#PWR03" H 1250 6250 50  0001 C CNN
F 1 "+3V3" H 1265 6573 50  0000 C CNN
F 2 "" H 1250 6400 50  0001 C CNN
F 3 "" H 1250 6400 50  0001 C CNN
	1    1250 6400
	1    0    0    -1  
$EndComp
$Comp
L Device:R R18
U 1 1 62BB8DF6
P 1250 6650
F 0 "R18" H 1320 6696 50  0000 L CNN
F 1 "4.7k" H 1320 6605 50  0000 L CNN
F 2 "Resistor_SMD:R_0603_1608Metric_Pad0.98x0.95mm_HandSolder" V 1180 6650 50  0001 C CNN
F 3 "~" H 1250 6650 50  0001 C CNN
	1    1250 6650
	1    0    0    -1  
$EndComp
Text Notes 1200 7300 1    50   ~ 0
CAL
Wire Wire Line
	1250 7500 1250 7400
$Comp
L Switch:SW_Push SW2
U 1 1 62AC9503
P 1250 7200
F 0 "SW2" H 1250 7485 50  0000 C CNN
F 1 "SW_CAL" H 1250 7394 50  0000 C CNN
F 2 "Custom:PTS636_SMTR" H 1250 7400 50  0001 C CNN
F 3 "~" H 1250 7400 50  0001 C CNN
	1    1250 7200
	0    1    1    0   
$EndComp
$Comp
L Switch:SW_Push SW1
U 1 1 62A9EC00
P 750 7200
F 0 "SW1" H 750 7485 50  0000 C CNN
F 1 "SW_RESET" H 750 7394 50  0000 C CNN
F 2 "Custom:PTS636_SMTR" H 750 7400 50  0001 C CNN
F 3 "~" H 750 7400 50  0001 C CNN
	1    750  7200
	0    1    1    0   
$EndComp
$Comp
L power:GNDD #PWR02
U 1 1 62B528EB
P 750 7500
F 0 "#PWR02" H 750 7250 50  0001 C CNN
F 1 "GNDD" H 754 7345 50  0000 C CNN
F 2 "" H 750 7500 50  0001 C CNN
F 3 "" H 750 7500 50  0001 C CNN
	1    750  7500
	1    0    0    -1  
$EndComp
Wire Wire Line
	750  7400 750  7500
Text Notes 700  7100 3    50   ~ 0
RESET
Wire Wire Line
	1250 6800 1250 6900
Wire Wire Line
	750  6800 750  6900
Connection ~ 1250 7500
Connection ~ 750  6900
Wire Wire Line
	750  6900 750  7000
Connection ~ 1250 6900
Wire Wire Line
	1250 6900 1250 7000
Wire Wire Line
	1750 6800 1750 6900
Wire Wire Line
	1250 7500 1750 7500
Connection ~ 1750 6900
Wire Wire Line
	1750 6900 1750 7000
$Comp
L Device:R R20
U 1 1 63B04E1D
P 2250 6650
F 0 "R20" H 2320 6696 50  0000 L CNN
F 1 "4.7k" H 2320 6605 50  0000 L CNN
F 2 "Resistor_SMD:R_0603_1608Metric_Pad0.98x0.95mm_HandSolder" V 2180 6650 50  0001 C CNN
F 3 "~" H 2250 6650 50  0001 C CNN
	1    2250 6650
	1    0    0    -1  
$EndComp
$Comp
L Switch:SW_Push SW4
U 1 1 63B050F5
P 2250 7200
F 0 "SW4" H 2250 7485 50  0000 C CNN
F 1 "SW_AUX" H 2250 7394 50  0000 C CNN
F 2 "Custom:PTS636_SMTR" H 2250 7400 50  0001 C CNN
F 3 "~" H 2250 7400 50  0001 C CNN
	1    2250 7200
	0    1    1    0   
$EndComp
Text Notes 2200 7300 1    50   ~ 0
AUX
Wire Wire Line
	1750 7500 2250 7500
Wire Wire Line
	2250 7500 2250 7400
Connection ~ 1750 7500
$Comp
L power:+3V3 #PWR05
U 1 1 63B5B82C
P 2250 6400
F 0 "#PWR05" H 2250 6250 50  0001 C CNN
F 1 "+3V3" H 2265 6573 50  0000 C CNN
F 2 "" H 2250 6400 50  0001 C CNN
F 3 "" H 2250 6400 50  0001 C CNN
	1    2250 6400
	1    0    0    -1  
$EndComp
Wire Wire Line
	2250 6500 2250 6400
Wire Wire Line
	2350 4850 2350 5350
Wire Wire Line
	2350 5350 3850 5350
Wire Wire Line
	2250 4750 2250 5450
Wire Wire Line
	2250 4750 2350 4750
Wire Wire Line
	2250 5450 3950 5450
Wire Wire Line
	2350 4550 2350 4200
Wire Wire Line
	2350 4650 2250 4650
Wire Wire Line
	2250 4650 2250 4200
$Comp
L Device:R R17
U 1 1 62BD04AD
P 750 6650
F 0 "R17" H 820 6696 50  0000 L CNN
F 1 "4.7k" H 820 6605 50  0000 L CNN
F 2 "Resistor_SMD:R_0603_1608Metric_Pad0.98x0.95mm_HandSolder" V 680 6650 50  0001 C CNN
F 3 "~" H 750 6650 50  0001 C CNN
	1    750  6650
	1    0    0    -1  
$EndComp
Wire Wire Line
	750  6900 600  6900
Wire Wire Line
	1250 6900 1100 6900
Wire Wire Line
	1600 6900 1750 6900
Wire Wire Line
	2250 6800 2250 6900
Wire Wire Line
	2100 6150 2100 6900
Wire Wire Line
	2100 6900 2250 6900
Wire Wire Line
	1750 6150 2100 6150
Connection ~ 2250 6900
Wire Wire Line
	2250 6900 2250 7000
$Comp
L Connector:Screw_Terminal_01x03 J5
U 1 1 643D97E7
P 4650 6900
F 0 "J5" H 4568 6575 50  0000 C CNN
F 1 "Screw_Terminal_01x03" H 4568 6666 50  0000 C CNN
F 2 "Connector_PinSocket_2.54mm:PinSocket_1x03_P2.54mm_Vertical" H 4650 6900 50  0001 C CNN
F 3 "~" H 4650 6900 50  0001 C CNN
	1    4650 6900
	-1   0    0    1   
$EndComp
Wire Wire Line
	5450 6750 5450 6800
Wire Wire Line
	4850 6800 5450 6800
$Comp
L power:GNDREF #PWR0137
U 1 1 644B9864
P 5100 7200
F 0 "#PWR0137" H 5100 6950 50  0001 C CNN
F 1 "GNDREF" H 5105 7027 50  0000 C CNN
F 2 "" H 5100 7200 50  0001 C CNN
F 3 "" H 5100 7200 50  0001 C CNN
	1    5100 7200
	1    0    0    -1  
$EndComp
Wire Wire Line
	4850 6900 5100 6900
Wire Wire Line
	5100 6900 5100 7200
$Comp
L power:GNDA #PWR0138
U 1 1 644DAB2A
P 4850 7200
F 0 "#PWR0138" H 4850 6950 50  0001 C CNN
F 1 "GNDA" H 4855 7027 50  0000 C CNN
F 2 "" H 4850 7200 50  0001 C CNN
F 3 "" H 4850 7200 50  0001 C CNN
	1    4850 7200
	1    0    0    -1  
$EndComp
Wire Wire Line
	4850 7000 4850 7200
Wire Wire Line
	7400 800  7500 800 
Connection ~ 1600 1000
Wire Wire Line
	1600 1000 1850 1000
Connection ~ 1600 1500
Wire Wire Line
	1600 1500 1850 1500
Wire Wire Line
	1100 1000 1200 1000
$Comp
L Device:R R21
U 1 1 64813956
P 1350 1000
F 0 "R21" V 1143 1000 50  0000 C CNN
F 1 "0" V 1234 1000 50  0000 C CNN
F 2 "Resistor_SMD:R_0603_1608Metric_Pad0.98x0.95mm_HandSolder" V 1280 1000 50  0001 C CNN
F 3 "~" H 1350 1000 50  0001 C CNN
	1    1350 1000
	0    1    1    0   
$EndComp
$Comp
L Connector:TestPoint TP3
U 1 1 6485721A
P 4400 4500
F 0 "TP3" H 4458 4618 50  0000 L CNN
F 1 "TestPoint" H 4458 4527 50  0000 L CNN
F 2 "TestPoint:TestPoint_THTPad_2.5x2.5mm_Drill1.2mm" H 4600 4500 50  0001 C CNN
F 3 "~" H 4600 4500 50  0001 C CNN
	1    4400 4500
	-1   0    0    1   
$EndComp
Connection ~ 4400 4400
Wire Wire Line
	4400 4400 4450 4400
$Comp
L Connector:TestPoint TP4
U 1 1 64859BF9
P 4400 4900
F 0 "TP4" H 4458 5018 50  0000 L CNN
F 1 "TestPoint" H 4458 4927 50  0000 L CNN
F 2 "TestPoint:TestPoint_THTPad_2.5x2.5mm_Drill1.2mm" H 4600 4900 50  0001 C CNN
F 3 "~" H 4600 4900 50  0001 C CNN
	1    4400 4900
	-1   0    0    1   
$EndComp
Wire Wire Line
	4400 4500 4400 4400
Wire Wire Line
	4400 4900 4400 4800
Connection ~ 4400 4800
Wire Wire Line
	4400 4800 3850 4800
$Comp
L Connector:TestPoint TP2
U 1 1 6489F11D
P 4200 3050
F 0 "TP2" H 4258 3168 50  0000 L CNN
F 1 "TestPoint" H 4258 3077 50  0000 L CNN
F 2 "TestPoint:TestPoint_THTPad_2.5x2.5mm_Drill1.2mm" H 4400 3050 50  0001 C CNN
F 3 "~" H 4400 3050 50  0001 C CNN
	1    4200 3050
	1    0    0    -1  
$EndComp
Wire Wire Line
	4100 3250 4200 3250
Wire Wire Line
	4200 3050 4200 3250
Connection ~ 4200 3250
Wire Wire Line
	4200 3250 4300 3250
Wire Wire Line
	4100 5150 3750 5150
Wire Wire Line
	3850 4800 3850 5350
$Comp
L Connector:TestPoint TP6
U 1 1 648E936B
P 5350 3700
F 0 "TP6" H 5408 3818 50  0000 L CNN
F 1 "TestPoint" H 5408 3727 50  0000 L CNN
F 2 "TestPoint:TestPoint_THTPad_2.5x2.5mm_Drill1.2mm" H 5550 3700 50  0001 C CNN
F 3 "~" H 5550 3700 50  0001 C CNN
	1    5350 3700
	1    0    0    -1  
$EndComp
$Comp
L Connector:TestPoint TP5
U 1 1 648EB1A8
P 5450 3900
F 0 "TP5" H 5508 4018 50  0000 L CNN
F 1 "TestPoint" H 5508 3927 50  0000 L CNN
F 2 "TestPoint:TestPoint_THTPad_2.5x2.5mm_Drill1.2mm" H 5650 3900 50  0001 C CNN
F 3 "~" H 5650 3900 50  0001 C CNN
	1    5450 3900
	1    0    0    -1  
$EndComp
Wire Wire Line
	4950 4600 5550 4600
Wire Wire Line
	5450 3900 5450 4400
Wire Wire Line
	4850 4400 5450 4400
Connection ~ 5450 4400
Wire Wire Line
	5450 4400 5550 4400
Wire Wire Line
	5350 3700 5350 4800
Wire Wire Line
	4850 4800 5350 4800
Connection ~ 5350 4800
Wire Wire Line
	5350 4800 5550 4800
Wire Wire Line
	10350 800  10450 800 
Wire Wire Line
	10450 800  10450 1100
Wire Wire Line
	10450 1700 10350 1700
Wire Wire Line
	10350 1400 10450 1400
Connection ~ 10450 1400
Connection ~ 10450 1100
Wire Wire Line
	10450 1100 10550 1100
Wire Wire Line
	10450 1100 10450 1400
Wire Wire Line
	9550 1850 10450 1850
Connection ~ 10450 1700
Wire Wire Line
	10450 1700 10450 1850
Wire Wire Line
	10450 1400 10450 1700
Text Notes 9450 850  0    50   ~ 0
Gain Select
$Comp
L Connector:Screw_Terminal_01x04 J3
U 1 1 64CA7E9F
P 5250 2350
F 0 "J3" H 5330 2342 50  0000 L CNN
F 1 "Screw_Terminal_01x04" H 5330 2251 50  0000 L CNN
F 2 "TerminalBlock_Phoenix:TerminalBlock_Phoenix_MPT-0,5-4-2.54_1x04_P2.54mm_Horizontal" H 5250 2350 50  0001 C CNN
F 3 "~" H 5250 2350 50  0001 C CNN
	1    5250 2350
	1    0    0    -1  
$EndComp
Text Label 5050 2700 2    50   ~ 0
I_EXC
Wire Wire Line
	4650 3300 4650 2950
Wire Wire Line
	5050 2550 5050 2500
Wire Wire Line
	5050 3000 5050 2950
Wire Wire Line
	4650 2950 5050 2950
Connection ~ 5050 2950
Wire Wire Line
	5050 2950 5050 2900
Wire Wire Line
	5050 2500 4650 2500
Wire Wire Line
	4650 2500 4650 2950
Connection ~ 5050 2500
Wire Wire Line
	5050 2500 5050 2450
Connection ~ 4650 2950
$Comp
L Device:C C22
U 1 1 64F714CD
P 7750 5250
F 0 "C22" V 7498 5250 50  0000 C CNN
F 1 "110n" V 7589 5250 50  0000 C CNN
F 2 "Capacitor_SMD:C_0603_1608Metric_Pad1.08x0.95mm_HandSolder" H 7788 5100 50  0001 C CNN
F 3 "~" H 7750 5250 50  0001 C CNN
	1    7750 5250
	-1   0    0    1   
$EndComp
Wire Wire Line
	7750 5400 8150 5400
Wire Wire Line
	7750 4600 8150 4600
Wire Wire Line
	8150 4600 8150 4900
Wire Wire Line
	8000 4900 7850 4900
Wire Wire Line
	7850 4900 7850 5000
Wire Wire Line
	7850 5000 7750 5000
Wire Wire Line
	8000 4900 8150 4900
Connection ~ 8000 4900
Connection ~ 8150 4900
Wire Wire Line
	8150 4900 8150 5400
Wire Wire Line
	5000 4900 5000 5300
Wire Wire Line
	5000 4900 5550 4900
Wire Wire Line
	5050 5800 5550 5800
Wire Wire Line
	5250 5900 5250 5600
Wire Wire Line
	5250 5600 5550 5600
Text Notes 8150 6400 0    50   ~ 0
C16, C20, C21, C24 10u capacitors are tantalum
$Comp
L Device:R R16
U 1 1 61662C1D
P 2750 6650
F 0 "R16" H 2680 6604 50  0000 R CNN
F 1 "180" H 2680 6695 50  0000 R CNN
F 2 "Resistor_SMD:R_0603_1608Metric_Pad0.98x0.95mm_HandSolder" V 2680 6650 50  0001 C CNN
F 3 "~" H 2750 6650 50  0001 C CNN
	1    2750 6650
	-1   0    0    1   
$EndComp
Wire Wire Line
	2750 6800 2750 7000
Wire Wire Line
	2750 7300 2750 7500
Text Notes 2700 7200 1    50   ~ 0
AUX
$Comp
L Device:LED D7
U 1 1 6166169C
P 2750 7150
F 0 "D7" V 2789 7033 50  0000 R CNN
F 1 "AUX" V 2698 7033 50  0000 R CNN
F 2 "Diode_SMD:D_0603_1608Metric_Pad1.05x0.95mm_HandSolder" H 2750 7150 50  0001 C CNN
F 3 "~" H 2750 7150 50  0001 C CNN
	1    2750 7150
	0    -1   -1   0   
$EndComp
Wire Wire Line
	9800 5100 9350 5100
Wire Wire Line
	9350 5100 9350 5400
Connection ~ 9350 5400
Wire Wire Line
	9800 5000 9250 5000
Wire Wire Line
	9250 5000 9250 5300
Wire Wire Line
	9250 5300 8600 5300
Wire Wire Line
	8600 5300 8600 5400
Connection ~ 8600 5400
$Comp
L power:+3V3 #PWR0102
U 1 1 612144D5
P 8950 5200
F 0 "#PWR0102" H 8950 5050 50  0001 C CNN
F 1 "+3V3" H 8965 5373 50  0000 C CNN
F 2 "" H 8950 5200 50  0001 C CNN
F 3 "" H 8950 5200 50  0001 C CNN
	1    8950 5200
	1    0    0    -1  
$EndComp
Wire Wire Line
	8950 5200 8950 5400
$Comp
L power:+5VD #PWR0104
U 1 1 6124E824
P 8400 5100
F 0 "#PWR0104" H 8400 4950 50  0001 C CNN
F 1 "+5VD" H 8415 5273 50  0000 C CNN
F 2 "" H 8400 5100 50  0001 C CNN
F 3 "" H 8400 5100 50  0001 C CNN
	1    8400 5100
	1    0    0    -1  
$EndComp
Wire Wire Line
	8400 5100 8400 5400
$Comp
L Device:C C24
U 1 1 6182C71E
P 8700 4600
F 0 "C24" H 8815 4646 50  0000 L CNN
F 1 "10u" H 8815 4555 50  0000 L CNN
F 2 "Capacitor_SMD:C_0603_1608Metric_Pad1.08x0.95mm_HandSolder" H 8738 4450 50  0001 C CNN
F 3 "~" H 8700 4600 50  0001 C CNN
	1    8700 4600
	1    0    0    -1  
$EndComp
$Comp
L Device:C C23
U 1 1 6182BAC2
P 8300 4600
F 0 "C23" H 8415 4646 50  0000 L CNN
F 1 "100n" H 8415 4555 50  0000 L CNN
F 2 "Capacitor_SMD:C_0603_1608Metric_Pad1.08x0.95mm_HandSolder" H 8338 4450 50  0001 C CNN
F 3 "~" H 8300 4600 50  0001 C CNN
	1    8300 4600
	1    0    0    -1  
$EndComp
Wire Wire Line
	8300 4750 8300 4800
Wire Wire Line
	9100 4800 9500 4800
Connection ~ 9100 4800
Wire Wire Line
	8700 4750 8700 4800
Wire Wire Line
	8300 4800 8700 4800
Wire Wire Line
	8700 4800 9100 4800
Connection ~ 8700 4800
Wire Wire Line
	8300 4450 8300 4400
Wire Wire Line
	9100 4400 9500 4400
Connection ~ 9100 4400
Wire Wire Line
	8700 4450 8700 4400
Wire Wire Line
	8700 4400 9100 4400
Connection ~ 8700 4400
$Comp
L power:+5VA #PWR0109
U 1 1 613332DF
P 9100 4400
F 0 "#PWR0109" H 9100 4250 50  0001 C CNN
F 1 "+5VA" H 9115 4573 50  0000 C CNN
F 2 "" H 9100 4400 50  0001 C CNN
F 3 "" H 9100 4400 50  0001 C CNN
	1    9100 4400
	1    0    0    -1  
$EndComp
Text Label 1650 4850 0    50   ~ 0
ENABLE
Text Label 1150 4850 2    50   ~ 0
I_DAC
Text Label 1650 4150 0    50   ~ 0
I_ADC_ENABLEN
Text Label 1650 4350 0    50   ~ 0
I_ADC_RESET
Wire Wire Line
	600  3750 600  6900
Wire Wire Line
	1100 6900 1100 6100
Wire Wire Line
	1100 6100 700  6100
Wire Wire Line
	1600 6900 1600 6000
Wire Wire Line
	1600 6000 800  6000
Wire Wire Line
	1750 6150 1750 5900
Wire Wire Line
	1750 5900 900  5900
Wire Wire Line
	700  3950 700  6100
Wire Wire Line
	900  5900 900  4150
Connection ~ 2250 7500
Wire Wire Line
	2250 7500 2750 7500
Connection ~ 2750 7500
Wire Wire Line
	2750 7500 3200 7500
Connection ~ 3200 7500
Wire Wire Line
	3200 7500 3600 7500
Connection ~ 3600 7500
Wire Wire Line
	3600 7500 4050 7500
Wire Wire Line
	2150 5550 3600 5550
Wire Wire Line
	3600 5550 3600 6000
Wire Wire Line
	2050 5650 3500 5650
Wire Wire Line
	3500 5650 3500 6150
Wire Wire Line
	3500 6150 3600 6150
Wire Wire Line
	3600 6150 3600 6500
Wire Wire Line
	1950 5750 3200 5750
Wire Wire Line
	3200 5750 3200 6500
Wire Wire Line
	1850 5850 2750 5850
Wire Wire Line
	2750 5850 2750 6500
Wire Wire Line
	3600 6000 4050 6000
Wire Wire Line
	4050 6000 4050 6500
Wire Wire Line
	1400 5600 1400 5450
$Comp
L Connector_Generic:Conn_02x20_Odd_Even J1
U 1 1 611FA1C9
P 1450 4450
F 0 "J1" H 1500 5567 50  0000 C CNN
F 1 "Conn_02x20_Odd_Even" H 1500 5476 50  0000 C CNN
F 2 "Connector_PinHeader_2.54mm:PinHeader_2x20_P2.54mm_Vertical" H 1450 4450 50  0001 C CNN
F 3 "~" H 1450 4450 50  0001 C CNN
	1    1450 4450
	-1   0    0    -1  
$EndComp
Wire Wire Line
	1400 4250 1650 4250
Wire Wire Line
	1650 4650 1400 4650
Wire Wire Line
	1650 5050 1400 5050
Wire Wire Line
	1650 5450 1400 5450
Wire Wire Line
	1400 3850 1650 3850
Wire Wire Line
	1150 4650 1400 4650
Wire Wire Line
	1150 5450 1400 5450
Connection ~ 1400 5450
Wire Wire Line
	1400 5050 1400 5450
Wire Wire Line
	1400 5050 1150 5050
Connection ~ 1400 5050
Wire Wire Line
	1400 4650 1400 5050
Connection ~ 1400 4650
Wire Wire Line
	1400 4250 1400 4650
Connection ~ 1400 4250
Connection ~ 1400 3850
Wire Wire Line
	1400 3850 1400 4250
Wire Wire Line
	1150 4250 1400 4250
Wire Wire Line
	1150 3850 1400 3850
$Comp
L power:GNDD #PWR0128
U 1 1 61CF9592
P 1400 5600
F 0 "#PWR0128" H 1400 5350 50  0001 C CNN
F 1 "GNDD" H 1404 5445 50  0000 C CNN
F 2 "" H 1400 5600 50  0001 C CNN
F 3 "" H 1400 5600 50  0001 C CNN
	1    1400 5600
	1    0    0    -1  
$EndComp
Wire Wire Line
	600  3750 1150 3750
Wire Wire Line
	800  6000 800  4050
Wire Wire Line
	700  3950 1150 3950
Wire Wire Line
	800  4050 1150 4050
Wire Wire Line
	900  4150 1150 4150
Wire Wire Line
	2150 5550 2150 3650
Wire Wire Line
	2150 3650 1650 3650
Wire Wire Line
	2050 5650 2050 3750
Wire Wire Line
	2050 3750 1650 3750
Wire Wire Line
	1950 5750 1950 3950
Wire Wire Line
	1950 3950 1650 3950
Wire Wire Line
	1850 5850 1850 4050
Wire Wire Line
	1850 4050 1650 4050
Text Label 2200 3250 2    50   ~ 0
I_SCLK
Text Label 1150 4450 2    50   ~ 0
I_SCLK
Text Label 1650 4550 0    50   ~ 0
O_SD_B
Text Label 1650 4450 0    50   ~ 0
O_SD_A
Wire Wire Line
	8300 4400 8700 4400
$Comp
L 2021-08-19_20-12-01:AD7724ASTZ U4
U 1 1 6120025E
P 5550 4300
F 0 "U4" H 6650 4787 60  0000 C CNN
F 1 "AD7724ASTZ" H 6650 4681 60  0000 C CNN
F 2 "AD7724ASTZ:AD7724ASTZ" H 6650 4640 60  0001 C CNN
F 3 "" H 5550 4300 60  0000 C CNN
	1    5550 4300
	1    0    0    -1  
$EndComp
Text Label 1150 4550 2    50   ~ 0
O_SCLK
Text Label 1150 4750 2    50   ~ 0
I_ADC_CAL
$Comp
L Connector:TestPoint TP1
U 1 1 645E4080
P 6750 1800
F 0 "TP1" H 6808 1918 50  0000 L CNN
F 1 "TestPoint" H 6808 1827 50  0000 L CNN
F 2 "TestPoint:TestPoint_THTPad_2.5x2.5mm_Drill1.2mm" H 6950 1800 50  0001 C CNN
F 3 "~" H 6950 1800 50  0001 C CNN
	1    6750 1800
	1    0    0    -1  
$EndComp
Wire Wire Line
	6750 1800 6750 2150
Connection ~ 6750 2150
Wire Wire Line
	7750 4300 8050 4300
Wire Wire Line
	7750 4200 8050 4200
NoConn ~ 1150 5350
Wire Wire Line
	5800 7200 6300 7200
$Comp
L Connector:Screw_Terminal_01x04 J4
U 1 1 64CF3B40
P 5250 2900
F 0 "J4" H 5330 2892 50  0000 L CNN
F 1 "Screw_Terminal_01x04" H 5330 2801 50  0000 L CNN
F 2 "TerminalBlock_Phoenix:TerminalBlock_Phoenix_MPT-0,5-4-2.54_1x04_P2.54mm_Horizontal" H 5250 2900 50  0001 C CNN
F 3 "~" H 5250 2900 50  0001 C CNN
	1    5250 2900
	1    0    0    1   
$EndComp
$Comp
L Connector:Conn_01x02_Male J7
U 1 1 614DCF6C
P 5900 2350
F 0 "J7" V 6050 2700 50  0000 R CNN
F 1 "Conn_01x02_Male" V 5950 2900 50  0000 R CNN
F 2 "Connector_PinHeader_2.54mm:PinHeader_1x02_P2.54mm_Vertical" H 5900 2350 50  0001 C CNN
F 3 "~" H 5900 2350 50  0001 C CNN
	1    5900 2350
	0    -1   -1   0   
$EndComp
Wire Wire Line
	5900 2150 5800 2150
Wire Wire Line
	6000 2150 6350 2150
$Comp
L 2021-09-23_12-28-05:ADP7142AUJZ-R7 U3
U 1 1 615176B5
P 3200 1100
F 0 "U3" H 4200 1587 60  0000 C CNN
F 1 "ADP7142AUJZ-R7" H 4200 1481 60  0000 C CNN
F 2 "ADP7142AUJZ-R7:ADP7142AUJZ-R7" H 4200 1440 60  0001 C CNN
F 3 "" H 3200 1100 60  0000 C CNN
	1    3200 1100
	1    0    0    -1  
$EndComp
$Comp
L Reference_Voltage:TLE2426xD U5
U 1 1 612F981E
P 6400 1200
F 0 "U5" H 6400 1667 50  0000 C CNN
F 1 "TLE2426xD" H 6400 1576 50  0000 C CNN
F 2 "Package_SO:SOIC-8_3.9x4.9mm_P1.27mm" H 6400 600 50  0001 C CIN
F 3 "http://www.ti.com/lit/ds/symlink/tle2426.pdf" H 5000 2150 50  0001 C CIN
	1    6400 1200
	1    0    0    -1  
$EndComp
Wire Wire Line
	7000 1000 7000 1350
Wire Wire Line
	6650 600  6150 600 
Wire Wire Line
	6650 800  7100 800 
Wire Wire Line
	6650 800  6650 600 
Wire Wire Line
	5700 800  5700 1000
Wire Wire Line
	6150 800  5700 800 
Wire Wire Line
	6150 600  6150 800 
Wire Wire Line
	7000 1000 6900 1000
$Comp
L Device:R R22
U 1 1 6468981C
P 7250 800
F 0 "R22" V 7043 800 50  0000 C CNN
F 1 "0" V 7134 800 50  0000 C CNN
F 2 "Resistor_SMD:R_0603_1608Metric_Pad0.98x0.95mm_HandSolder" V 7180 800 50  0001 C CNN
F 3 "~" H 7250 800 50  0001 C CNN
	1    7250 800 
	0    1    1    0   
$EndComp
Wire Wire Line
	5700 1000 5900 1000
Connection ~ 5700 1000
Wire Wire Line
	5650 2000 6400 2000
Connection ~ 5650 2000
Wire Wire Line
	5200 1000 5300 1000
Wire Wire Line
	5300 2000 5650 2000
Wire Wire Line
	5450 1000 5700 1000
Connection ~ 5450 1000
Wire Wire Line
	6400 1700 6400 2000
Wire Wire Line
	5650 1100 5650 1350
Wire Wire Line
	5900 1100 5650 1100
$Comp
L Device:C C9
U 1 1 613AB4A1
P 6500 2150
F 0 "C9" V 6248 2150 50  0000 C CNN
F 1 "1u" V 6339 2150 50  0000 C CNN
F 2 "Capacitor_SMD:C_0603_1608Metric_Pad1.08x0.95mm_HandSolder" H 6538 2000 50  0001 C CNN
F 3 "~" H 6500 2150 50  0001 C CNN
	1    6500 2150
	0    1    1    0   
$EndComp
Text Label 5800 2150 2    50   ~ 0
I_DAC
$Comp
L power:GNDREF #PWR0107
U 1 1 613254C5
P 7000 1350
F 0 "#PWR0107" H 7000 1100 50  0001 C CNN
F 1 "GNDREF" H 7005 1177 50  0000 C CNN
F 2 "" H 7000 1350 50  0001 C CNN
F 3 "" H 7000 1350 50  0001 C CNN
	1    7000 1350
	1    0    0    -1  
$EndComp
Wire Wire Line
	5650 2000 5650 1650
$Comp
L Device:C C8
U 1 1 612FB34F
P 5650 1500
F 0 "C8" H 5765 1546 50  0000 L CNN
F 1 "1u" H 5765 1455 50  0000 L CNN
F 2 "Capacitor_SMD:C_0603_1608Metric_Pad1.08x0.95mm_HandSolder" H 5688 1350 50  0001 C CNN
F 3 "~" H 5650 1500 50  0001 C CNN
	1    5650 1500
	1    0    0    -1  
$EndComp
Wire Wire Line
	5300 1650 5300 2000
$Comp
L Device:C C7
U 1 1 612E55DF
P 5300 1500
F 0 "C7" H 5415 1546 50  0000 L CNN
F 1 "2.2u" H 5415 1455 50  0000 L CNN
F 2 "Capacitor_SMD:C_0603_1608Metric_Pad1.08x0.95mm_HandSolder" H 5338 1350 50  0001 C CNN
F 3 "~" H 5300 1500 50  0001 C CNN
	1    5300 1500
	1    0    0    -1  
$EndComp
$Comp
L power:+5VA #PWR0101
U 1 1 611F6D00
P 5450 1000
F 0 "#PWR0101" H 5450 850 50  0001 C CNN
F 1 "+5VA" H 5465 1173 50  0000 C CNN
F 2 "" H 5450 1000 50  0001 C CNN
F 3 "" H 5450 1000 50  0001 C CNN
	1    5450 1000
	1    0    0    -1  
$EndComp
Wire Wire Line
	1100 1500 1600 1500
Wire Wire Line
	1500 1000 1600 1000
Wire Wire Line
	2850 2000 3200 2000
Wire Wire Line
	3200 1700 3200 2000
Wire Wire Line
	3200 1300 2850 1300
Connection ~ 2850 1300
Wire Wire Line
	2850 1300 2850 1000
Wire Wire Line
	2850 1300 2850 1500
Wire Wire Line
	2850 1800 2850 2000
Wire Wire Line
	5300 1000 5300 1350
Connection ~ 5300 1000
Wire Wire Line
	5300 1000 5450 1000
Wire Wire Line
	3200 2000 5300 2000
Connection ~ 3200 2000
Connection ~ 5300 2000
Wire Wire Line
	3200 1200 3100 1200
Wire Wire Line
	3100 1200 3100 550 
Wire Wire Line
	3100 550  5300 550 
Wire Wire Line
	5300 550  5300 1000
Wire Wire Line
	9800 4400 9800 4800
Wire Wire Line
	9800 5300 9800 5900
Wire Wire Line
	3750 5650 3750 5150
Connection ~ 3750 5150
$EndSCHEMATC
