EESchema Schematic File Version 4
EELAYER 30 0
EELAYER END
$Descr USLetter 11000 8500
encoding utf-8
Sheet 1 1
Title ""
Date ""
Rev ""
Comp ""
Comment1 ""
Comment2 ""
Comment3 ""
Comment4 ""
$EndDescr
$Comp
L pspice:VSOURCE V2
U 1 1 5F18B7B2
P 3500 3250
F 0 "V2" H 3728 3296 50  0000 L CNN
F 1 "5" H 3728 3205 50  0000 L CNN
F 2 "" H 3500 3250 50  0001 C CNN
F 3 "~" H 3500 3250 50  0001 C CNN
	1    3500 3250
	1    0    0    -1  
$EndComp
$Comp
L power:GND #PWR07
U 1 1 5F18C588
P 3500 5000
F 0 "#PWR07" H 3500 4750 50  0001 C CNN
F 1 "GND" H 3505 4827 50  0000 C CNN
F 2 "" H 3500 5000 50  0001 C CNN
F 3 "" H 3500 5000 50  0001 C CNN
	1    3500 5000
	1    0    0    -1  
$EndComp
$Comp
L power:VCC #PWR06
U 1 1 5F18D164
P 3500 1000
F 0 "#PWR06" H 3500 850 50  0001 C CNN
F 1 "VCC" H 3515 1173 50  0000 C CNN
F 2 "" H 3500 1000 50  0001 C CNN
F 3 "" H 3500 1000 50  0001 C CNN
	1    3500 1000
	1    0    0    -1  
$EndComp
$Comp
L 2020-07-23_20-33-32:LMC6492AEM_NOPB U2
U 1 1 5F1BA875
P 5300 2600
F 0 "U2" H 6500 2987 60  0000 C CNN
F 1 "LMC6492AEM_NOPB" H 6500 2881 60  0000 C CNN
F 2 "M08A_TEX" H 6500 2840 60  0001 C CNN
F 3 "" H 5300 2600 60  0000 C CNN
F 4 "X" H 5300 2600 50  0001 C CNN "Spice_Primitive"
F 5 "LMC6492" H 5300 2600 50  0001 C CNN "Spice_Model"
F 6 "Y" H 5300 2600 50  0001 C CNN "Spice_Netlist_Enabled"
F 7 "/Users/brett/Documents/KiCad/Libraries/Spice Models/LMC6492_PSPICE/LMC6492.LIB" H 5300 2600 50  0001 C CNN "Spice_Lib_File"
	1    5300 2600
	1    0    0    -1  
$EndComp
Wire Wire Line
	4900 3000 5000 3000
Wire Wire Line
	5000 3000 5000 2800
Wire Wire Line
	5000 2800 5300 2800
$Comp
L power:GND #PWR01
U 1 1 5F1CA6DA
P 4000 5000
F 0 "#PWR01" H 4000 4750 50  0001 C CNN
F 1 "GND" H 4005 4827 50  0000 C CNN
F 2 "" H 4000 5000 50  0001 C CNN
F 3 "" H 4000 5000 50  0001 C CNN
	1    4000 5000
	1    0    0    -1  
$EndComp
NoConn ~ 7700 2800
NoConn ~ 7700 2900
NoConn ~ 7700 2700
$Comp
L power:GND #PWR02
U 1 1 5F1D39E1
P 4500 5000
F 0 "#PWR02" H 4500 4750 50  0001 C CNN
F 1 "GND" H 4505 4827 50  0000 C CNN
F 2 "" H 4500 5000 50  0001 C CNN
F 3 "" H 4500 5000 50  0001 C CNN
	1    4500 5000
	1    0    0    -1  
$EndComp
Wire Wire Line
	4500 3000 4600 3000
Wire Wire Line
	5300 2600 5300 2000
Wire Wire Line
	5300 1600 5300 1500
Wire Wire Line
	5300 1500 5000 1500
Connection ~ 5000 2700
Wire Wire Line
	5000 2700 5300 2700
$Comp
L Device:C C1
U 1 1 5F1DDDA7
P 5750 1750
F 0 "C1" H 5865 1796 50  0000 L CNN
F 1 "10p" H 5865 1705 50  0000 L CNN
F 2 "" H 5788 1600 50  0001 C CNN
F 3 "~" H 5750 1750 50  0001 C CNN
	1    5750 1750
	1    0    0    -1  
$EndComp
Connection ~ 5300 2000
Wire Wire Line
	5300 2000 5300 1900
Wire Wire Line
	5750 1600 5750 1500
Wire Wire Line
	4350 2700 4000 2700
Wire Wire Line
	4650 2700 5000 2700
$Comp
L power:VCC #PWR04
U 1 1 5F227886
P 7700 1000
F 0 "#PWR04" H 7700 850 50  0001 C CNN
F 1 "VCC" H 7715 1173 50  0000 C CNN
F 2 "" H 7700 1000 50  0001 C CNN
F 3 "" H 7700 1000 50  0001 C CNN
	1    7700 1000
	1    0    0    -1  
$EndComp
$Comp
L Device:R R4
U 1 1 5F22D5BE
P 6750 2000
F 0 "R4" V 6543 2000 50  0000 C CNN
F 1 "100k" V 6634 2000 50  0000 C CNN
F 2 "" V 6680 2000 50  0001 C CNN
F 3 "~" H 6750 2000 50  0001 C CNN
	1    6750 2000
	0    1    1    0   
$EndComp
Wire Wire Line
	3500 1000 3500 2950
Connection ~ 5000 3000
Wire Wire Line
	6900 2000 8000 2000
Text Label 4500 3000 0    50   ~ 0
VIn
Wire Wire Line
	5000 1500 5000 2700
$Comp
L 2020-07-23_20-33-32:LMC6492AEM_NOPB U1
U 1 1 5F1A998E
P 6300 3700
F 0 "U1" H 7500 4087 60  0000 C CNN
F 1 "LMC6492AEM_NOPB" H 7500 3981 60  0000 C CNN
F 2 "M08A_TEX" H 7500 3940 60  0001 C CNN
F 3 "" H 6300 3700 60  0000 C CNN
F 4 "X" H 6300 3700 50  0001 C CNN "Spice_Primitive"
F 5 "LMC6492" H 6300 3700 50  0001 C CNN "Spice_Model"
F 6 "Y" H 6300 3700 50  0001 C CNN "Spice_Netlist_Enabled"
F 7 "/Users/brett/Documents/KiCad/Libraries/Spice Models/LMC6492_PSPICE/LMC6492.LIB" H 6300 3700 50  0001 C CNN "Spice_Lib_File"
	1    6300 3700
	1    0    0    -1  
$EndComp
Wire Wire Line
	7700 1000 7700 2600
Wire Wire Line
	5000 3000 5000 3400
Wire Wire Line
	6300 3700 6300 3400
Wire Wire Line
	6300 3400 5900 3400
Wire Wire Line
	6300 3800 6300 3700
Connection ~ 6300 3700
Wire Wire Line
	6300 3900 6200 3900
Wire Wire Line
	6200 3900 6200 3200
Wire Wire Line
	6200 3200 8000 3200
Wire Wire Line
	8000 3200 8000 2000
$Comp
L power:VCC #PWR08
U 1 1 5F1B779D
P 8700 1000
F 0 "#PWR08" H 8700 850 50  0001 C CNN
F 1 "VCC" H 8715 1173 50  0000 C CNN
F 2 "" H 8700 1000 50  0001 C CNN
F 3 "" H 8700 1000 50  0001 C CNN
	1    8700 1000
	1    0    0    -1  
$EndComp
Wire Wire Line
	8700 3700 8700 1000
NoConn ~ 8700 3800
NoConn ~ 8700 3900
NoConn ~ 8700 4000
$Comp
L power:GND #PWR05
U 1 1 5F1C030A
P 5750 5000
F 0 "#PWR05" H 5750 4750 50  0001 C CNN
F 1 "GND" H 5755 4827 50  0000 C CNN
F 2 "" H 5750 5000 50  0001 C CNN
F 3 "" H 5750 5000 50  0001 C CNN
	1    5750 5000
	1    0    0    -1  
$EndComp
Wire Wire Line
	5750 4100 5750 3900
Wire Wire Line
	3500 3550 3500 5000
Wire Wire Line
	6300 4000 6300 5000
Wire Wire Line
	5000 3400 5600 3400
Wire Wire Line
	5300 2900 5300 5000
$Comp
L Device:C C2
U 1 1 5F1C9B1B
P 5750 4750
F 0 "C2" H 5865 4796 50  0000 L CNN
F 1 "12n" H 5865 4705 50  0000 L CNN
F 2 "" H 5788 4600 50  0001 C CNN
F 3 "~" H 5750 4750 50  0001 C CNN
	1    5750 4750
	1    0    0    -1  
$EndComp
$Comp
L power:VEE #PWR011
U 1 1 5F1CB4DC
P 6300 5000
F 0 "#PWR011" H 6300 4850 50  0001 C CNN
F 1 "VEE" H 6315 5173 50  0000 C CNN
F 2 "" H 6300 5000 50  0001 C CNN
F 3 "" H 6300 5000 50  0001 C CNN
	1    6300 5000
	-1   0    0    1   
$EndComp
$Comp
L power:VEE #PWR010
U 1 1 5F1CC95D
P 5300 5000
F 0 "#PWR010" H 5300 4850 50  0001 C CNN
F 1 "VEE" H 5315 5173 50  0000 C CNN
F 2 "" H 5300 5000 50  0001 C CNN
F 3 "" H 5300 5000 50  0001 C CNN
	1    5300 5000
	-1   0    0    1   
$EndComp
$Comp
L power:VEE #PWR09
U 1 1 5F1CD0B8
P 2500 5000
F 0 "#PWR09" H 2500 4850 50  0001 C CNN
F 1 "VEE" H 2515 5173 50  0000 C CNN
F 2 "" H 2500 5000 50  0001 C CNN
F 3 "" H 2500 5000 50  0001 C CNN
	1    2500 5000
	-1   0    0    1   
$EndComp
$Comp
L pspice:VSOURCE V3
U 1 1 5F1CDF89
P 2500 4450
F 0 "V3" H 2728 4496 50  0000 L CNN
F 1 "5" H 2728 4405 50  0000 L CNN
F 2 "" H 2500 4450 50  0001 C CNN
F 3 "~" H 2500 4450 50  0001 C CNN
	1    2500 4450
	1    0    0    -1  
$EndComp
Wire Wire Line
	2500 4750 2500 5000
$Comp
L power:GND #PWR03
U 1 1 5F1CFD7C
P 2000 5000
F 0 "#PWR03" H 2000 4750 50  0001 C CNN
F 1 "GND" H 2005 4827 50  0000 C CNN
F 2 "" H 2000 5000 50  0001 C CNN
F 3 "" H 2000 5000 50  0001 C CNN
	1    2000 5000
	1    0    0    -1  
$EndComp
Wire Wire Line
	2000 5000 2000 4000
Wire Wire Line
	2000 4000 2500 4000
Wire Wire Line
	2500 4000 2500 4150
Wire Wire Line
	4500 4550 4500 5000
Wire Wire Line
	5750 3900 6200 3900
Connection ~ 6200 3900
Wire Wire Line
	5750 4900 5750 4950
Wire Wire Line
	4000 2700 4000 5000
$Comp
L Device:R R5
U 1 1 5F244C4D
P 5750 4250
F 0 "R5" H 5820 4296 50  0000 L CNN
F 1 "3k" H 5820 4205 50  0000 L CNN
F 2 "" V 5680 4250 50  0001 C CNN
F 3 "~" H 5750 4250 50  0001 C CNN
	1    5750 4250
	1    0    0    -1  
$EndComp
Wire Wire Line
	5750 4400 5750 4600
Wire Wire Line
	5500 4650 5500 4950
Wire Wire Line
	5500 4950 5750 4950
Connection ~ 5750 4950
Wire Wire Line
	5750 4950 5750 5000
Wire Wire Line
	5500 3900 5750 3900
Connection ~ 5750 3900
Wire Wire Line
	5750 2000 6600 2000
Wire Wire Line
	5300 2000 5750 2000
Connection ~ 5750 2000
Wire Wire Line
	5750 2000 5750 1900
Connection ~ 5300 1500
Wire Wire Line
	5750 1500 5300 1500
$Comp
L Device:R R6
U 1 1 5F1A71E0
P 5750 3400
F 0 "R6" V 5543 3400 50  0000 C CNN
F 1 "100k" V 5634 3400 50  0000 C CNN
F 2 "" V 5680 3400 50  0001 C CNN
F 3 "~" H 5750 3400 50  0001 C CNN
	1    5750 3400
	0    1    1    0   
$EndComp
$Comp
L Device:R R2
U 1 1 5F1C6E02
P 4750 3000
F 0 "R2" V 4543 3000 50  0000 C CNN
F 1 "100k" V 4634 3000 50  0000 C CNN
F 2 "" V 4680 3000 50  0001 C CNN
F 3 "~" H 4750 3000 50  0001 C CNN
	1    4750 3000
	0    1    1    0   
$EndComp
$Comp
L Device:R R1
U 1 1 5F1C55E3
P 4500 2700
F 0 "R1" V 4293 2700 50  0000 C CNN
F 1 "100k" V 4384 2700 50  0000 C CNN
F 2 "" V 4430 2700 50  0001 C CNN
F 3 "~" H 4500 2700 50  0001 C CNN
	1    4500 2700
	0    1    1    0   
$EndComp
$Comp
L Device:R R3
U 1 1 5F1D6044
P 5300 1750
F 0 "R3" H 5230 1704 50  0000 R CNN
F 1 "100k" H 5230 1795 50  0000 R CNN
F 2 "" V 5230 1750 50  0001 C CNN
F 3 "~" H 5300 1750 50  0001 C CNN
	1    5300 1750
	-1   0    0    1   
$EndComp
$Comp
L Device:C C3
U 1 1 5F1FF729
P 4500 3500
F 0 "C3" H 4615 3546 50  0000 L CNN
F 1 "100u" H 4615 3455 50  0000 L CNN
F 2 "" H 4538 3350 50  0001 C CNN
F 3 "~" H 4500 3500 50  0001 C CNN
	1    4500 3500
	1    0    0    -1  
$EndComp
Text Notes 3450 5500 0    50   ~ 0
.tran 100n 10m\n\n\n
Wire Wire Line
	4500 3650 4500 3900
Wire Wire Line
	4500 3000 4500 3350
$Comp
L Device:R R7
U 1 1 5F20000D
P 5500 4500
F 0 "R7" H 5570 4546 50  0000 L CNN
F 1 "100k" H 5570 4455 50  0000 L CNN
F 2 "" V 5430 4500 50  0001 C CNN
F 3 "~" H 5500 4500 50  0001 C CNN
	1    5500 4500
	1    0    0    -1  
$EndComp
Wire Wire Line
	5500 4350 5500 3900
Wire Wire Line
	4500 3000 4300 3000
Wire Wire Line
	4300 3000 4300 3900
Wire Wire Line
	4300 3900 4500 3900
Connection ~ 4500 3000
Connection ~ 4500 3900
Wire Wire Line
	4500 3900 4500 3950
$Comp
L pspice:VSOURCE V1
U 1 1 5F1CFB9F
P 4500 4250
F 0 "V1" H 4728 4296 50  0000 L CNN
F 1 "sine(0, 1, 1k)" H 4728 4205 50  0000 L CNN
F 2 "" H 4500 4250 50  0001 C CNN
F 3 "~" H 4500 4250 50  0001 C CNN
	1    4500 4250
	1    0    0    -1  
$EndComp
Text Label 4500 3900 0    50   ~ 0
VIN
$EndSCHEMATC
