Timestamp	I_0	Q_0	I_1	Q_1	I_2	Q_2	I_3	Q_3
0.0	3.09634e+03	-1.82377e+03	4.91640e+03	-3.64199e+03	7.35241e+03	-5.86713e+03	1.14309e+04	-7.65576e+03
0.045021	3.10004e+03	-1.82747e+03	4.91640e+03	-3.64384e+03	7.35241e+03	-5.86713e+03	1.14309e+04	-7.65576e+03
0.096044	3.09819e+03	-1.82932e+03	4.91640e+03	-3.64384e+03	7.35241e+03	-5.86713e+03	1.14309e+04	-7.65576e+03
0.119127	3.09634e+03	-1.82932e+03	4.91640e+03	-3.64569e+03	7.35241e+03	-5.86713e+03	1.14309e+04	-7.65576e+03
0.169113	3.09819e+03	-1.82932e+03	4.91640e+03	-3.64569e+03	7.35426e+03	-5.86713e+03	1.14309e+04	-7.65576e+03
0.202143	3.09819e+03	-1.82562e+03	4.91825e+03	-3.64199e+03	7.35241e+03	-5.86713e+03	1.14328e+04	-7.65576e+03
0.252503	3.09634e+03	-1.82747e+03	4.91640e+03	-3.64384e+03	7.35241e+03	-5.86898e+03	1.14309e+04	-7.65576e+03
0.28578	3.09634e+03	-1.82747e+03	4.91455e+03	-3.64199e+03	7.35241e+03	-5.86713e+03	1.14309e+04	-7.65576e+03
0.336609	3.09819e+03	-1.82747e+03	4.91455e+03	-3.64014e+03	7.35241e+03	-5.86713e+03	1.14309e+04	-7.65576e+03
0.368088	3.09819e+03	-1.82747e+03	4.91640e+03	-3.64384e+03	7.35241e+03	-5.86713e+03	1.14309e+04	-7.65576e+03
0.413518	3.10004e+03	-1.82932e+03	4.91640e+03	-3.64199e+03	7.35241e+03	-5.86713e+03	1.14309e+04	-7.65576e+03
0.463564	3.09634e+03	-1.82747e+03	4.91640e+03	-3.64199e+03	7.35241e+03	-5.86713e+03	1.14309e+04	-7.65576e+03
0.495956	3.09634e+03	-1.82932e+03	4.91640e+03	-3.64384e+03	7.35241e+03	-5.86713e+03	1.14309e+04	-7.65576e+03
0.53577	3.09634e+03	-1.82562e+03	4.91640e+03	-3.64199e+03	7.35241e+03	-5.86713e+03	1.14309e+04	-7.65576e+03
0.569058	3.09634e+03	-1.83117e+03	4.91640e+03	-3.64384e+03	7.35241e+03	-5.86713e+03	1.14309e+04	-7.65576e+03
0.61904	3.09819e+03	-1.82747e+03	4.91825e+03	-3.64199e+03	7.35241e+03	-5.86713e+03	1.14309e+04	-7.65576e+03
0.652363	3.09819e+03	-1.82932e+03	4.91455e+03	-3.64199e+03	7.35241e+03	-5.86713e+03	1.14309e+04	-7.65576e+03
0.70402	3.09634e+03	-1.82932e+03	4.91455e+03	-3.64014e+03	7.35241e+03	-5.86713e+03	1.14309e+04	-7.65576e+03
0.75226	3.09819e+03	-1.82192e+03	4.91640e+03	-3.64014e+03	7.35241e+03	-5.86713e+03	1.14309e+04	-7.65576e+03
0.784732	3.09634e+03	-1.82562e+03	4.91825e+03	-3.64199e+03	7.35241e+03	-5.86713e+03	1.14309e+04	-7.65576e+03
0.832586	3.09449e+03	-1.82377e+03	4.91640e+03	-3.64199e+03	7.35241e+03	-5.86713e+03	1.14309e+04	-7.65576e+03
0.864481	3.09634e+03	-1.82377e+03	4.91640e+03	-3.64384e+03	7.35241e+03	-5.86898e+03	1.14309e+04	-7.65576e+03
0.912538	3.09819e+03	-1.82747e+03	4.91640e+03	-3.64014e+03	7.35241e+03	-5.86713e+03	1.14309e+04	-7.65576e+03
0.935731	3.09634e+03	-1.82562e+03	4.91825e+03	-3.64199e+03	7.35241e+03	-5.86898e+03	1.14309e+04	-7.65576e+03
0.986721	3.09634e+03	-1.82377e+03	4.91640e+03	-3.64199e+03	7.35241e+03	-5.86898e+03	1.14309e+04	-7.65576e+03
1.035726	3.09634e+03	-1.82562e+03	4.91640e+03	-3.64199e+03	7.35241e+03	-5.86713e+03	1.14309e+04	-7.65576e+03
1.069062	3.09634e+03	-1.82377e+03	4.91640e+03	-3.64199e+03	7.35241e+03	-5.86713e+03	1.14309e+04	-7.65576e+03
1.120571	3.09819e+03	-1.82562e+03	4.91640e+03	-3.64199e+03	7.35241e+03	-5.86713e+03	1.14309e+04	-7.65761e+03
1.152316	3.09819e+03	-1.82562e+03	4.91825e+03	-3.64014e+03	7.35241e+03	-5.86713e+03	1.14309e+04	-7.65576e+03
1.200566	3.09819e+03	-1.82747e+03	4.91640e+03	-3.64014e+03	7.35241e+03	-5.86528e+03	1.14309e+04	-7.65576e+03
1.23257	3.09819e+03	-1.82747e+03	4.91640e+03	-3.64569e+03	7.35241e+03	-5.86713e+03	1.14309e+04	-7.65576e+03
1.277846	3.09819e+03	-1.82747e+03	4.91640e+03	-3.64199e+03	7.35241e+03	-5.86713e+03	1.14309e+04	-7.65576e+03
1.319	3.09634e+03	-1.82747e+03	4.91455e+03	-3.64199e+03	7.35241e+03	-5.86713e+03	1.14309e+04	-7.65576e+03
1.353271	3.09634e+03	-1.82747e+03	4.91640e+03	-3.64384e+03	7.35241e+03	-5.86713e+03	1.14309e+04	-7.65576e+03
1.402322	3.09634e+03	-1.82932e+03	4.91640e+03	-3.64199e+03	7.35241e+03	-5.86713e+03	1.14309e+04	-7.65576e+03
1.435683	3.10004e+03	-1.82747e+03	4.91640e+03	-3.64014e+03	7.35241e+03	-5.86713e+03	1.14328e+04	-7.65576e+03
1.48857	3.10004e+03	-1.82932e+03	4.91825e+03	-3.64384e+03	7.35241e+03	-5.86713e+03	1.14309e+04	-7.65391e+03
1.51948	3.09634e+03	-1.82562e+03	4.91825e+03	-3.64384e+03	7.35241e+03	-5.86713e+03	1.14309e+04	-7.65576e+03
1.567983	3.09634e+03	-1.82377e+03	4.91825e+03	-3.64199e+03	7.35241e+03	-5.86713e+03	1.14328e+04	-7.65576e+03
1.613711	3.09634e+03	-1.82562e+03	4.91825e+03	-3.64199e+03	7.35241e+03	-5.86713e+03	1.14309e+04	-7.65576e+03
1.648571	3.09819e+03	-1.82747e+03	4.91640e+03	-3.64199e+03	7.35426e+03	-5.86713e+03	1.14309e+04	-7.65576e+03
1.696693	3.09634e+03	-1.82562e+03	4.91825e+03	-3.64199e+03	7.35241e+03	-5.86898e+03	1.14309e+04	-7.65761e+03
1.71997	3.10004e+03	-1.83117e+03	4.91825e+03	-3.64384e+03	7.35241e+03	-5.86713e+03	1.14309e+04	-7.65576e+03
1.768972	3.09819e+03	-1.82932e+03	4.91640e+03	-3.64384e+03	7.35241e+03	-5.86713e+03	1.14309e+04	-7.65576e+03
1.802089	3.09634e+03	-1.82562e+03	4.91640e+03	-3.64569e+03	7.35241e+03	-5.86713e+03	1.14309e+04	-7.65576e+03
1.853233	3.09819e+03	-1.82932e+03	4.91640e+03	-3.64199e+03	7.35426e+03	-5.86713e+03	1.14309e+04	-7.65576e+03
1.903254	3.09634e+03	-1.82747e+03	4.91640e+03	-3.64014e+03	7.35241e+03	-5.86713e+03	1.14309e+04	-7.65576e+03
1.936542	3.09819e+03	-1.82562e+03	4.91640e+03	-3.64199e+03	7.35241e+03	-5.86713e+03	1.14291e+04	-7.65576e+03
1.984646	3.09819e+03	-1.82932e+03	4.91640e+03	-3.64384e+03	7.35241e+03	-5.86528e+03	1.14309e+04	-7.65576e+03
2.01435	3.09819e+03	-1.82562e+03	4.91640e+03	-3.64384e+03	7.35241e+03	-5.86713e+03	1.14309e+04	-7.65576e+03
2.064497	3.09634e+03	-1.82562e+03	4.91455e+03	-3.64384e+03	7.35241e+03	-5.86713e+03	1.14291e+04	-7.65576e+03
2.096554	3.09819e+03	-1.82932e+03	4.91455e+03	-3.64199e+03	7.35241e+03	-5.86713e+03	1.14291e+04	-7.65576e+03
2.137358	3.09819e+03	-1.82747e+03	4.91455e+03	-3.64384e+03	7.35241e+03	-5.86713e+03	1.14309e+04	-7.65576e+03
2.185526	3.09819e+03	-1.82747e+03	4.91455e+03	-3.64384e+03	7.35241e+03	-5.86713e+03	1.14309e+04	-7.65576e+03
2.218926	3.09634e+03	-1.82932e+03	4.91271e+03	-3.64384e+03	7.35241e+03	-5.86713e+03	1.14309e+04	-7.65576e+03
2.268876	3.09634e+03	-1.82747e+03	4.91455e+03	-3.64384e+03	7.35241e+03	-5.86713e+03	1.14309e+04	-7.65576e+03
2.30242	3.09819e+03	-1.82747e+03	4.91825e+03	-3.64384e+03	7.35241e+03	-5.86713e+03	1.14309e+04	-7.65576e+03
2.352306	3.09819e+03	-1.82562e+03	4.91640e+03	-3.64384e+03	7.35241e+03	-5.86898e+03	1.14309e+04	-7.65576e+03
2.384519	3.09819e+03	-1.82562e+03	4.91640e+03	-3.64384e+03	7.35241e+03	-5.86713e+03	1.14309e+04	-7.65576e+03
2.429942	3.10004e+03	-1.82747e+03	4.91640e+03	-3.64199e+03	7.35241e+03	-5.86713e+03	1.14309e+04	-7.65576e+03
2.480546	3.09819e+03	-1.82747e+03	4.91640e+03	-3.64199e+03	7.35241e+03	-5.86713e+03	1.14309e+04	-7.65576e+03
2.512269	3.10004e+03	-1.82747e+03	4.91825e+03	-3.64199e+03	7.35241e+03	-5.86713e+03	1.14309e+04	-7.65576e+03
2.553175	3.09819e+03	-1.82932e+03	4.91640e+03	-3.64384e+03	7.35241e+03	-5.86713e+03	1.14309e+04	-7.65576e+03
2.58552	3.09634e+03	-1.82747e+03	4.91455e+03	-3.64199e+03	7.35241e+03	-5.86713e+03	1.14309e+04	-7.65576e+03
2.636536	3.09819e+03	-1.82932e+03	4.91640e+03	-3.64199e+03	7.35241e+03	-5.86528e+03	1.14309e+04	-7.65576e+03
2.668829	3.09634e+03	-1.83302e+03	4.91640e+03	-3.64199e+03	7.35241e+03	-5.86713e+03	1.14309e+04	-7.65576e+03
2.720535	3.09634e+03	-1.82932e+03	4.91455e+03	-3.64384e+03	7.35241e+03	-5.86713e+03	1.14291e+04	-7.65576e+03
2.767774	3.09819e+03	-1.82932e+03	4.91455e+03	-3.64384e+03	7.35241e+03	-5.86713e+03	1.14309e+04	-7.65576e+03
2.796685	3.10004e+03	-1.83117e+03	4.91455e+03	-3.64384e+03	7.35241e+03	-5.86713e+03	1.14309e+04	-7.65576e+03
2.841157	3.09819e+03	-1.82932e+03	4.91640e+03	-3.64199e+03	7.35241e+03	-5.86713e+03	1.14309e+04	-7.65576e+03
2.879797	3.09819e+03	-1.82747e+03	4.91640e+03	-3.64014e+03	7.35056e+03	-5.86713e+03	1.14309e+04	-7.65576e+03
2.918834	3.09634e+03	-1.82747e+03	4.91640e+03	-3.64199e+03	7.35241e+03	-5.86713e+03	1.14309e+04	-7.65576e+03
2.952109	3.09449e+03	-1.82562e+03	4.91640e+03	-3.64384e+03	7.35241e+03	-5.86713e+03	1.14291e+04	-7.65576e+03
3.002087	3.09449e+03	-1.82377e+03	4.91640e+03	-3.64199e+03	7.35241e+03	-5.86713e+03	1.14309e+04	-7.65576e+03
3.052154	3.09819e+03	-1.82747e+03	4.91640e+03	-3.64199e+03	7.35241e+03	-5.86713e+03	1.14309e+04	-7.65576e+03
3.085465	3.09819e+03	-1.82747e+03	4.91825e+03	-3.64199e+03	7.35241e+03	-5.86713e+03	1.14309e+04	-7.65576e+03
3.136467	3.09819e+03	-1.82562e+03	4.91640e+03	-3.64384e+03	7.35241e+03	-5.86713e+03	1.14309e+04	-7.65576e+03
3.168046	3.10004e+03	-1.82562e+03	4.91640e+03	-3.64569e+03	7.35241e+03	-5.86713e+03	1.14309e+04	-7.65576e+03
3.214522	3.09819e+03	-1.82377e+03	4.91640e+03	-3.64014e+03	7.35241e+03	-5.86713e+03	1.14309e+04	-7.65576e+03
3.248479	3.09819e+03	-1.82747e+03	4.91455e+03	-3.64199e+03	7.35241e+03	-5.86528e+03	1.14309e+04	-7.65576e+03
3.295712	3.09819e+03	-1.82747e+03	4.91455e+03	-3.64199e+03	7.35241e+03	-5.86713e+03	1.14291e+04	-7.65576e+03
3.336472	3.09634e+03	-1.82747e+03	4.91640e+03	-3.64384e+03	7.35241e+03	-5.86713e+03	1.14309e+04	-7.65576e+03
3.369687	3.09634e+03	-1.82932e+03	4.91455e+03	-3.64199e+03	7.35241e+03	-5.86713e+03	1.14309e+04	-7.65576e+03
3.419918	3.09819e+03	-1.82932e+03	4.91455e+03	-3.64199e+03	7.35241e+03	-5.86713e+03	1.14309e+04	-7.65576e+03
3.452045	3.10004e+03	-1.82562e+03	4.91640e+03	-3.64199e+03	7.35056e+03	-5.86713e+03	1.14309e+04	-7.65576e+03
3.504512	3.09819e+03	-1.82377e+03	4.91455e+03	-3.64384e+03	7.35241e+03	-5.86713e+03	1.14309e+04	-7.65576e+03
3.5353	3.09634e+03	-1.82747e+03	4.91455e+03	-3.64199e+03	7.35241e+03	-5.86713e+03	1.14309e+04	-7.65576e+03
3.584422	3.09449e+03	-1.82562e+03	4.91640e+03	-3.64014e+03	7.35056e+03	-5.86713e+03	1.14309e+04	-7.65576e+03
3.629875	3.09819e+03	-1.82747e+03	4.91825e+03	-3.64384e+03	7.35056e+03	-5.86898e+03	1.14309e+04	-7.65576e+03
3.664347	3.10004e+03	-1.82747e+03	4.91825e+03	-3.64199e+03	7.35241e+03	-5.86713e+03	1.14309e+04	-7.65576e+03
3.712695	3.09819e+03	-1.82747e+03	4.91640e+03	-3.64199e+03	7.35241e+03	-5.86898e+03	1.14309e+04	-7.65576e+03
3.736385	3.09634e+03	-1.82747e+03	4.91640e+03	-3.64199e+03	7.35241e+03	-5.86713e+03	1.14309e+04	-7.65576e+03
3.78538	3.09634e+03	-1.82747e+03	4.91640e+03	-3.64199e+03	7.35241e+03	-5.86898e+03	1.14309e+04	-7.65576e+03
3.818683	3.09449e+03	-1.82562e+03	4.91640e+03	-3.64199e+03	7.35241e+03	-5.86713e+03	1.14309e+04	-7.65576e+03
3.868684	3.09634e+03	-1.82747e+03	4.91640e+03	-3.64384e+03	7.35426e+03	-5.86713e+03	1.14309e+04	-7.65761e+03
3.920484	3.09819e+03	-1.82932e+03	4.91640e+03	-3.64384e+03	7.35241e+03	-5.86713e+03	1.14309e+04	-7.65761e+03
3.952478	3.09819e+03	-1.82562e+03	4.91825e+03	-3.64199e+03	7.35241e+03	-5.86713e+03	1.14309e+04	-7.65576e+03
3.997485	3.10004e+03	-1.82747e+03	4.91825e+03	-3.64384e+03	7.35241e+03	-5.86713e+03	1.14309e+04	-7.65576e+03
4.030314	3.09819e+03	-1.82747e+03	4.91825e+03	-3.64384e+03	7.35241e+03	-5.86713e+03	1.14309e+04	-7.65576e+03
4.079847	3.09819e+03	-1.82192e+03	4.91825e+03	-3.64384e+03	7.35241e+03	-5.86713e+03	1.14309e+04	-7.65576e+03
4.112549	3.10004e+03	-1.82562e+03	4.91640e+03	-3.64014e+03	7.35241e+03	-5.86713e+03	1.14309e+04	-7.65761e+03
4.152054	3.10004e+03	-1.82562e+03	4.91640e+03	-3.64014e+03	7.35241e+03	-5.86713e+03	1.14291e+04	-7.65576e+03
4.202316	3.09819e+03	-1.82562e+03	4.91825e+03	-3.64199e+03	7.35241e+03	-5.86713e+03	1.14309e+04	-7.65576e+03
4.235339	3.09634e+03	-1.82747e+03	4.91640e+03	-3.64014e+03	7.35056e+03	-5.86713e+03	1.14309e+04	-7.65576e+03
4.285142	3.09634e+03	-1.82932e+03	4.91455e+03	-3.64199e+03	7.35241e+03	-5.86713e+03	1.14309e+04	-7.65576e+03
4.320477	3.09634e+03	-1.82747e+03	4.91640e+03	-3.64199e+03	7.35241e+03	-5.86713e+03	1.14309e+04	-7.65576e+03
4.368626	3.09634e+03	-1.82562e+03	4.91825e+03	-3.64014e+03	7.35241e+03	-5.86713e+03	1.14309e+04	-7.65576e+03
4.400473	3.09819e+03	-1.82562e+03	4.91640e+03	-3.64014e+03	7.35241e+03	-5.86713e+03	1.14309e+04	-7.65576e+03
4.445093	3.09634e+03	-1.82377e+03	4.91640e+03	-3.64014e+03	7.35241e+03	-5.86713e+03	1.14291e+04	-7.65576e+03
4.496344	3.09634e+03	-1.82562e+03	4.91640e+03	-3.64199e+03	7.35241e+03	-5.86713e+03	1.14309e+04	-7.65576e+03
4.528612	3.09449e+03	-1.82562e+03	4.91455e+03	-3.64199e+03	7.35241e+03	-5.86713e+03	1.14309e+04	-7.65391e+03
4.568611	3.09634e+03	-1.82747e+03	4.91640e+03	-3.64199e+03	7.35241e+03	-5.86713e+03	1.14309e+04	-7.65576e+03
4.601936	3.09819e+03	-1.82377e+03	4.91825e+03	-3.64199e+03	7.35241e+03	-5.86713e+03	1.14309e+04	-7.65576e+03
4.651903	3.09819e+03	-1.82562e+03	4.91640e+03	-3.64384e+03	7.35241e+03	-5.86713e+03	1.14309e+04	-7.65576e+03
4.685286	3.09634e+03	-1.82747e+03	4.91640e+03	-3.64199e+03	7.35056e+03	-5.86713e+03	1.14309e+04	-7.65576e+03
4.736473	3.09634e+03	-1.82747e+03	4.91640e+03	-3.64199e+03	7.35056e+03	-5.86713e+03	1.14291e+04	-7.65576e+03
4.784238	3.09634e+03	-1.82562e+03	4.91640e+03	-3.64199e+03	7.35241e+03	-5.86713e+03	1.14309e+04	-7.65576e+03
4.812993	3.09819e+03	-1.82747e+03	4.91640e+03	-3.64199e+03	7.35241e+03	-5.86713e+03	1.14309e+04	-7.65576e+03
4.864467	3.09819e+03	-1.82747e+03	4.91455e+03	-3.64199e+03	7.35241e+03	-5.86713e+03	1.14309e+04	-7.65576e+03
4.896481	3.09634e+03	-1.82377e+03	4.91271e+03	-3.64199e+03	7.35241e+03	-5.86713e+03	1.14291e+04	-7.65576e+03
4.936263	3.09819e+03	-1.82562e+03	4.91640e+03	-3.64014e+03	7.35241e+03	-5.86713e+03	1.14309e+04	-7.65576e+03
4.969238	3.09819e+03	-1.82932e+03	4.91640e+03	-3.64014e+03	7.35241e+03	-5.86713e+03	1.14291e+04	-7.65391e+03
5.018536	3.09819e+03	-1.82747e+03	4.91640e+03	-3.64014e+03	7.35241e+03	-5.86713e+03	1.14291e+04	-7.65576e+03
5.051952	3.09634e+03	-1.82932e+03	4.91640e+03	-3.64199e+03	7.35241e+03	-5.86898e+03	1.14291e+04	-7.65576e+03
5.102832	3.09819e+03	-1.82562e+03	4.91640e+03	-3.64384e+03	7.35426e+03	-5.86713e+03	1.14309e+04	-7.65576e+03
5.152442	3.09819e+03	-1.82377e+03	4.91825e+03	-3.64384e+03	7.35241e+03	-5.86713e+03	1.14309e+04	-7.65576e+03
5.184372	3.10004e+03	-1.82747e+03	4.91640e+03	-3.64384e+03	7.35241e+03	-5.86713e+03	1.14309e+04	-7.65391e+03
5.230904	3.09819e+03	-1.82747e+03	4.91640e+03	-3.64199e+03	7.35241e+03	-5.86713e+03	1.14309e+04	-7.65576e+03
5.263754	3.09634e+03	-1.82932e+03	4.91640e+03	-3.64199e+03	7.35241e+03	-5.86898e+03	1.14309e+04	-7.65576e+03
5.311839	3.09819e+03	-1.83117e+03	4.91640e+03	-3.64384e+03	7.35241e+03	-5.86898e+03	1.14309e+04	-7.65576e+03
5.344507	3.09819e+03	-1.82747e+03	4.91640e+03	-3.64199e+03	7.35241e+03	-5.86898e+03	1.14309e+04	-7.65576e+03
5.385147	3.09819e+03	-1.82747e+03	4.91455e+03	-3.64199e+03	7.35241e+03	-5.86898e+03	1.14309e+04	-7.65576e+03
5.436164	3.09634e+03	-1.82747e+03	4.91455e+03	-3.64199e+03	7.35241e+03	-5.86713e+03	1.14309e+04	-7.65576e+03
5.468508	3.09634e+03	-1.82747e+03	4.91455e+03	-3.64384e+03	7.35241e+03	-5.86713e+03	1.14309e+04	-7.65576e+03
5.518357	3.09634e+03	-1.83117e+03	4.91455e+03	-3.64384e+03	7.35241e+03	-5.86898e+03	1.14309e+04	-7.65576e+03
5.552448	3.10004e+03	-1.83117e+03	4.91640e+03	-3.64569e+03	7.35241e+03	-5.86898e+03	1.14309e+04	-7.65576e+03
5.594035	3.09819e+03	-1.82932e+03	4.91640e+03	-3.64199e+03	7.35241e+03	-5.86898e+03	1.14309e+04	-7.65576e+03
5.629625	3.09634e+03	-1.82562e+03	4.91825e+03	-3.64199e+03	7.35056e+03	-5.86713e+03	1.14309e+04	-7.65576e+03
5.680407	3.10004e+03	-1.82747e+03	4.91640e+03	-3.64199e+03	7.35241e+03	-5.86898e+03	1.14309e+04	-7.65576e+03
5.728612	3.09819e+03	-1.82562e+03	4.91640e+03	-3.64199e+03	7.35056e+03	-5.86713e+03	1.14309e+04	-7.65761e+03
5.751833	3.09634e+03	-1.82562e+03	4.91455e+03	-3.64199e+03	7.35241e+03	-5.86713e+03	1.14309e+04	-7.65576e+03
5.802307	3.09819e+03	-1.82747e+03	4.91455e+03	-3.64014e+03	7.35056e+03	-5.86898e+03	1.14309e+04	-7.65576e+03
5.836131	3.09634e+03	-1.82377e+03	4.91271e+03	-3.64014e+03	7.35241e+03	-5.86713e+03	1.14309e+04	-7.65576e+03
5.885134	3.09819e+03	-1.82562e+03	4.91640e+03	-3.64199e+03	7.35241e+03	-5.86713e+03	1.14309e+04	-7.65761e+03
5.920442	3.09634e+03	-1.82562e+03	4.91640e+03	-3.64384e+03	7.35241e+03	-5.86713e+03	1.14309e+04	-7.65761e+03
5.96842	3.09449e+03	-1.82747e+03	4.91455e+03	-3.64199e+03	7.35241e+03	-5.86713e+03	1.14309e+04	-7.65576e+03
6.016425	3.09819e+03	-1.82747e+03	4.91640e+03	-3.64199e+03	7.35241e+03	-5.86898e+03	1.14309e+04	-7.65576e+03
6.043835	3.10004e+03	-1.82747e+03	4.91825e+03	-3.64384e+03	7.35241e+03	-5.86713e+03	1.14309e+04	-7.65576e+03
6.096208	3.10004e+03	-1.82377e+03	4.91640e+03	-3.64384e+03	7.35241e+03	-5.86713e+03	1.14309e+04	-7.65576e+03
6.119417	3.10004e+03	-1.82562e+03	4.91640e+03	-3.64199e+03	7.35241e+03	-5.86713e+03	1.14309e+04	-7.65576e+03
6.169372	3.09819e+03	-1.82932e+03	4.91455e+03	-3.64199e+03	7.35241e+03	-5.86713e+03	1.14309e+04	-7.65576e+03
6.208406	3.09634e+03	-1.82932e+03	4.91640e+03	-3.64014e+03	7.35056e+03	-5.86713e+03	1.14309e+04	-7.65576e+03
6.25177	3.09819e+03	-1.82932e+03	4.91640e+03	-3.64384e+03	7.35241e+03	-5.86898e+03	1.14309e+04	-7.65576e+03
6.304423	3.09634e+03	-1.82747e+03	4.91640e+03	-3.64199e+03	7.35241e+03	-5.86898e+03	1.14309e+04	-7.65576e+03
6.336423	3.09449e+03	-1.82562e+03	4.91640e+03	-3.64199e+03	7.35241e+03	-5.86713e+03	1.14309e+04	-7.65576e+03
6.384062	3.10004e+03	-1.82562e+03	4.91640e+03	-3.64384e+03	7.35241e+03	-5.86898e+03	1.14309e+04	-7.65761e+03
6.413751	3.09634e+03	-1.82747e+03	4.91640e+03	-3.64199e+03	7.35241e+03	-5.86713e+03	1.14309e+04	-7.65576e+03
6.461593	3.09449e+03	-1.82932e+03	4.91455e+03	-3.63829e+03	7.35241e+03	-5.86713e+03	1.14309e+04	-7.65576e+03
6.496147	3.09819e+03	-1.82747e+03	4.91455e+03	-3.64199e+03	7.35241e+03	-5.86713e+03	1.14309e+04	-7.65761e+03
6.535039	3.09819e+03	-1.82932e+03	4.91455e+03	-3.64199e+03	7.35241e+03	-5.86713e+03	1.14291e+04	-7.65576e+03
6.584866	3.10004e+03	-1.82562e+03	4.91640e+03	-3.64384e+03	7.35056e+03	-5.86713e+03	1.14309e+04	-7.65576e+03
6.619278	3.10188e+03	-1.82562e+03	4.91640e+03	-3.64569e+03	7.35241e+03	-5.86713e+03	1.14309e+04	-7.65576e+03
6.668341	3.09819e+03	-1.82377e+03	4.91640e+03	-3.64199e+03	7.35056e+03	-5.86713e+03	1.14309e+04	-7.65576e+03
6.704407	3.09819e+03	-1.82562e+03	4.91825e+03	-3.64199e+03	7.35056e+03	-5.86713e+03	1.14309e+04	-7.65576e+03
6.752404	3.10004e+03	-1.82747e+03	4.91640e+03	-3.64199e+03	7.35241e+03	-5.86713e+03	1.14309e+04	-7.65576e+03
6.783947	3.09819e+03	-1.82562e+03	4.91825e+03	-3.64199e+03	7.35241e+03	-5.86713e+03	1.14309e+04	-7.65576e+03
6.831757	3.09634e+03	-1.82562e+03	4.91640e+03	-3.64384e+03	7.35056e+03	-5.86713e+03	1.14309e+04	-7.65576e+03
6.879606	3.09634e+03	-1.82932e+03	4.91455e+03	-3.64384e+03	7.35241e+03	-5.86713e+03	1.14309e+04	-7.65576e+03
6.902773	3.09634e+03	-1.82932e+03	4.91640e+03	-3.64384e+03	7.35241e+03	-5.86713e+03	1.14309e+04	-7.65576e+03
6.95271	3.09819e+03	-1.83117e+03	4.91640e+03	-3.64384e+03	7.35241e+03	-5.86713e+03	1.14309e+04	-7.65576e+03
6.98492	3.09819e+03	-1.82932e+03	4.91640e+03	-3.64014e+03	7.35241e+03	-5.86713e+03	1.14309e+04	-7.65761e+03
7.035046	3.09819e+03	-1.82562e+03	4.91640e+03	-3.64199e+03	7.35241e+03	-5.86713e+03	1.14309e+04	-7.65576e+03
7.068354	3.09634e+03	-1.82562e+03	4.91455e+03	-3.64199e+03	7.35241e+03	-5.86713e+03	1.14309e+04	-7.65761e+03
7.120382	3.10004e+03	-1.82562e+03	4.91455e+03	-3.64199e+03	7.35056e+03	-5.86713e+03	1.14309e+04	-7.65761e+03
7.168384	3.09634e+03	-1.82377e+03	4.91640e+03	-3.64014e+03	7.35241e+03	-5.86713e+03	1.14309e+04	-7.65576e+03
7.196018	3.09634e+03	-1.82377e+03	4.91825e+03	-3.64014e+03	7.35241e+03	-5.86898e+03	1.14309e+04	-7.65576e+03
7.24614	3.09634e+03	-1.82932e+03	4.91640e+03	-3.64569e+03	7.35241e+03	-5.86713e+03	1.14309e+04	-7.65576e+03
7.280437	3.09634e+03	-1.82932e+03	4.91640e+03	-3.64384e+03	7.35241e+03	-5.86713e+03	1.14309e+04	-7.65576e+03
7.319291	3.09819e+03	-1.82932e+03	4.91640e+03	-3.64384e+03	7.35241e+03	-5.86713e+03	1.14309e+04	-7.65576e+03
7.352666	3.09634e+03	-1.82932e+03	4.91640e+03	-3.64199e+03	7.35241e+03	-5.86713e+03	1.14309e+04	-7.65761e+03
7.403403	3.09449e+03	-1.82562e+03	4.91640e+03	-3.64199e+03	7.35241e+03	-5.86713e+03	1.14309e+04	-7.65576e+03
7.453634	3.09634e+03	-1.82562e+03	4.91640e+03	-3.64199e+03	7.35241e+03	-5.86898e+03	1.14309e+04	-7.65761e+03
7.488366	3.09819e+03	-1.82562e+03	4.91455e+03	-3.64199e+03	7.35241e+03	-5.86713e+03	1.14309e+04	-7.65576e+03
7.53565	3.09634e+03	-1.82747e+03	4.91640e+03	-3.64199e+03	7.35056e+03	-5.86713e+03	1.14309e+04	-7.65576e+03
7.568223	3.10004e+03	-1.82562e+03	4.91640e+03	-3.64199e+03	7.35056e+03	-5.86713e+03	1.14309e+04	-7.65576e+03
7.616381	3.10004e+03	-1.82377e+03	4.91640e+03	-3.64199e+03	7.35241e+03	-5.86898e+03	1.14309e+04	-7.65576e+03
7.648377	3.09634e+03	-1.82747e+03	4.91640e+03	-3.64199e+03	7.35056e+03	-5.86713e+03	1.14309e+04	-7.65761e+03
7.696366	3.09819e+03	-1.82747e+03	4.91640e+03	-3.64199e+03	7.35241e+03	-5.86898e+03	1.14309e+04	-7.65761e+03
7.734917	3.09819e+03	-1.82562e+03	4.91640e+03	-3.64199e+03	7.35241e+03	-5.86898e+03	1.14309e+04	-7.65576e+03
7.768249	3.09634e+03	-1.82377e+03	4.91640e+03	-3.64199e+03	7.35241e+03	-5.86898e+03	1.14309e+04	-7.65761e+03
7.819213	3.10004e+03	-1.82747e+03	4.91640e+03	-3.64199e+03	7.35241e+03	-5.86898e+03	1.14309e+04	-7.65576e+03
7.852564	3.10004e+03	-1.83117e+03	4.91640e+03	-3.64199e+03	7.35241e+03	-5.86713e+03	1.14309e+04	-7.65761e+03
7.904364	3.09819e+03	-1.82562e+03	4.91640e+03	-3.64199e+03	7.35241e+03	-5.86713e+03	1.14309e+04	-7.65761e+03
7.936363	3.09819e+03	-1.82932e+03	4.91640e+03	-3.64199e+03	7.35241e+03	-5.86713e+03	1.14309e+04	-7.65761e+03
7.983852	3.09819e+03	-1.82932e+03	4.91640e+03	-3.64199e+03	7.35241e+03	-5.86713e+03	1.14309e+04	-7.65576e+03
8.029181	3.09634e+03	-1.82562e+03	4.91640e+03	-3.64384e+03	7.35241e+03	-5.86713e+03	1.14309e+04	-7.65576e+03
8.064367	3.09634e+03	-1.82932e+03	4.91455e+03	-3.64199e+03	7.35241e+03	-5.86898e+03	1.14309e+04	-7.65761e+03
8.10312	3.09819e+03	-1.82747e+03	4.91455e+03	-3.64199e+03	7.35056e+03	-5.86898e+03	1.14309e+04	-7.65761e+03
8.134854	3.09634e+03	-1.82747e+03	4.91455e+03	-3.64199e+03	7.35056e+03	-5.86713e+03	1.14309e+04	-7.65761e+03
8.185971	3.09819e+03	-1.82747e+03	4.91640e+03	-3.64199e+03	7.35241e+03	-5.86898e+03	1.14309e+04	-7.65761e+03
8.219227	3.09819e+03	-1.82377e+03	4.91640e+03	-3.64199e+03	7.35241e+03	-5.86898e+03	1.14309e+04	-7.65761e+03
8.268165	3.10004e+03	-1.82747e+03	4.91640e+03	-3.64199e+03	7.35241e+03	-5.86898e+03	1.14309e+04	-7.65761e+03
8.319167	3.09819e+03	-1.82192e+03	4.91640e+03	-3.64014e+03	7.35056e+03	-5.86713e+03	1.14309e+04	-7.65761e+03
8.351519	3.09634e+03	-1.82377e+03	4.91640e+03	-3.64014e+03	7.35241e+03	-5.86713e+03	1.14309e+04	-7.65761e+03
8.395855	3.10004e+03	-1.82562e+03	4.91640e+03	-3.64014e+03	7.35056e+03	-5.86898e+03	1.14309e+04	-7.65576e+03
8.431187	3.10004e+03	-1.82747e+03	4.91640e+03	-3.64014e+03	7.35241e+03	-5.86713e+03	1.14309e+04	-7.65761e+03
8.480549	3.09819e+03	-1.82562e+03	4.91640e+03	-3.64199e+03	7.35056e+03	-5.86713e+03	1.14309e+04	-7.65576e+03
8.51212	3.09819e+03	-1.82932e+03	4.91640e+03	-3.64199e+03	7.35241e+03	-5.86898e+03	1.14309e+04	-7.65761e+03
8.560128	3.09819e+03	-1.82747e+03	4.91455e+03	-3.64199e+03	7.35241e+03	-5.86713e+03	1.14309e+04	-7.65761e+03
8.604456	3.09819e+03	-1.82932e+03	4.91455e+03	-3.64199e+03	7.35241e+03	-5.86713e+03	1.14309e+04	-7.65761e+03
8.634781	3.09819e+03	-1.82932e+03	4.91640e+03	-3.64199e+03	7.35241e+03	-5.86713e+03	1.14309e+04	-7.65761e+03
8.684465	3.10004e+03	-1.83117e+03	4.91455e+03	-3.64014e+03	7.35241e+03	-5.86713e+03	1.14309e+04	-7.65761e+03
8.720328	3.10004e+03	-1.82747e+03	4.91455e+03	-3.64014e+03	7.35241e+03	-5.86713e+03	1.14309e+04	-7.65761e+03
8.76832	3.09819e+03	-1.82932e+03	4.91455e+03	-3.64199e+03	7.35056e+03	-5.86713e+03	1.14309e+04	-7.65761e+03
8.800397	3.09819e+03	-1.82932e+03	4.91455e+03	-3.64199e+03	7.35056e+03	-5.86713e+03	1.14309e+04	-7.65761e+03
8.846939	3.10004e+03	-1.82562e+03	4.91640e+03	-3.64199e+03	7.35056e+03	-5.86713e+03	1.14309e+04	-7.65761e+03
8.896295	3.09819e+03	-1.82562e+03	4.91640e+03	-3.64199e+03	7.35056e+03	-5.86898e+03	1.14309e+04	-7.65761e+03
8.918776	3.09634e+03	-1.82562e+03	4.91640e+03	-3.64384e+03	7.35241e+03	-5.86713e+03	1.14309e+04	-7.65761e+03
8.968121	3.09449e+03	-1.82562e+03	4.91825e+03	-3.64014e+03	7.35056e+03	-5.86713e+03	1.14309e+04	-7.65761e+03
9.004467	3.09634e+03	-1.82747e+03	4.91825e+03	-3.64199e+03	7.35241e+03	-5.86713e+03	1.14309e+04	-7.65761e+03
9.052378	3.09819e+03	-1.82377e+03	4.91640e+03	-3.64199e+03	7.35056e+03	-5.86898e+03	1.14309e+04	-7.65761e+03
9.085722	3.09634e+03	-1.82377e+03	4.91455e+03	-3.64199e+03	7.35056e+03	-5.86898e+03	1.14309e+04	-7.65761e+03
9.135712	3.09819e+03	-1.82562e+03	4.91455e+03	-3.64199e+03	7.35241e+03	-5.86713e+03	1.14309e+04	-7.65761e+03
9.183743	3.09634e+03	-1.83117e+03	4.91455e+03	-3.64569e+03	7.35241e+03	-5.86713e+03	1.14309e+04	-7.65761e+03
9.215614	3.09634e+03	-1.82747e+03	4.91455e+03	-3.64199e+03	7.35056e+03	-5.86713e+03	1.14309e+04	-7.65761e+03
9.263668	3.09819e+03	-1.82562e+03	4.91640e+03	-3.64199e+03	7.35241e+03	-5.86713e+03	1.14309e+04	-7.65761e+03
9.295915	3.09819e+03	-1.82562e+03	4.91455e+03	-3.64199e+03	7.35241e+03	-5.86898e+03	1.14309e+04	-7.65576e+03
9.334763	3.09634e+03	-1.82377e+03	4.91640e+03	-3.64199e+03	7.35056e+03	-5.86713e+03	1.14309e+04	-7.65576e+03
9.368073	3.09634e+03	-1.82747e+03	4.91640e+03	-3.64199e+03	7.35241e+03	-5.86713e+03	1.14309e+04	-7.65576e+03
9.418912	3.09819e+03	-1.82562e+03	4.91640e+03	-3.64384e+03	7.35241e+03	-5.86898e+03	1.14309e+04	-7.65576e+03
9.452365	3.09819e+03	-1.82377e+03	4.91640e+03	-3.64199e+03	7.35056e+03	-5.86713e+03	1.14309e+04	-7.65576e+03
9.504364	3.09634e+03	-1.82932e+03	4.91640e+03	-3.64384e+03	7.35241e+03	-5.86713e+03	1.14309e+04	-7.65576e+03
9.551583	3.09634e+03	-1.82747e+03	4.91455e+03	-3.64199e+03	7.35241e+03	-5.86713e+03	1.14309e+04	-7.65761e+03
9.583689	3.09634e+03	-1.82377e+03	4.91455e+03	-3.64199e+03	7.35241e+03	-5.86898e+03	1.14309e+04	-7.65576e+03
9.628478	3.09634e+03	-1.82562e+03	4.91455e+03	-3.64199e+03	7.35241e+03	-5.86713e+03	1.14309e+04	-7.65761e+03
9.664152	3.09819e+03	-1.82562e+03	4.91271e+03	-3.64199e+03	7.35241e+03	-5.86713e+03	1.14309e+04	-7.65761e+03
9.704443	3.09634e+03	-1.82747e+03	4.91455e+03	-3.64199e+03	7.35241e+03	-5.86898e+03	1.14309e+04	-7.65761e+03
9.744281	3.09819e+03	-1.82562e+03	4.91455e+03	-3.64199e+03	7.35056e+03	-5.86713e+03	1.14309e+04	-7.65761e+03
9.785606	3.09634e+03	-1.82747e+03	4.91640e+03	-3.64199e+03	7.35056e+03	-5.86713e+03	1.14309e+04	-7.65576e+03
9.835862	3.09449e+03	-1.82377e+03	4.91455e+03	-3.64199e+03	7.35056e+03	-5.86713e+03	1.14309e+04	-7.65761e+03
9.868008	3.09449e+03	-1.82562e+03	4.91455e+03	-3.64199e+03	7.35241e+03	-5.86898e+03	1.14309e+04	-7.65761e+03
9.918598	3.09449e+03	-1.82747e+03	4.91455e+03	-3.64569e+03	7.35241e+03	-5.86898e+03	1.14328e+04	-7.65761e+03
9.952271	3.09634e+03	-1.82932e+03	4.91640e+03	-3.64199e+03	7.35241e+03	-5.86713e+03	1.14309e+04	-7.65761e+03
9.995805	3.09634e+03	-1.82932e+03	4.91640e+03	-3.64384e+03	7.35241e+03	-5.86898e+03	1.14309e+04	-7.65761e+03
10.030166	3.10004e+03	-1.82562e+03	4.91455e+03	-3.64384e+03	7.35241e+03	-5.86713e+03	1.14309e+04	-7.65761e+03
10.080292	3.10004e+03	-1.82562e+03	4.91640e+03	-3.64384e+03	7.35056e+03	-5.86898e+03	1.14309e+04	-7.65761e+03
10.118565	3.10004e+03	-1.82562e+03	4.91640e+03	-3.64199e+03	7.35241e+03	-5.86713e+03	1.14309e+04	-7.65761e+03
10.152266	3.09634e+03	-1.82747e+03	4.91640e+03	-3.64384e+03	7.35241e+03	-5.86713e+03	1.14309e+04	-7.65761e+03
10.208282	3.10004e+03	-1.82932e+03	4.91640e+03	-3.64384e+03	7.35056e+03	-5.86713e+03	1.14309e+04	-7.65761e+03
10.234643	3.09634e+03	-1.82562e+03	4.91455e+03	-3.64199e+03	7.35241e+03	-5.86713e+03	1.14309e+04	-7.65761e+03
10.285435	3.09634e+03	-1.82747e+03	4.91640e+03	-3.64384e+03	7.35056e+03	-5.86713e+03	1.14309e+04	-7.65576e+03
10.318495	3.09634e+03	-1.82747e+03	4.91825e+03	-3.64199e+03	7.35056e+03	-5.86898e+03	1.14309e+04	-7.65761e+03
10.368281	3.09819e+03	-1.82562e+03	4.91640e+03	-3.64199e+03	7.35056e+03	-5.86898e+03	1.14309e+04	-7.65761e+03
10.416283	3.09819e+03	-1.82377e+03	4.91825e+03	-3.64014e+03	7.35056e+03	-5.86898e+03	1.14309e+04	-7.65761e+03
10.445749	3.09819e+03	-1.82562e+03	4.91640e+03	-3.64569e+03	7.35056e+03	-5.86898e+03	1.14309e+04	-7.65761e+03
10.49574	3.09634e+03	-1.82562e+03	4.91640e+03	-3.64384e+03	7.35056e+03	-5.86713e+03	1.14309e+04	-7.65576e+03
10.518546	3.09634e+03	-1.82562e+03	4.91455e+03	-3.64199e+03	7.35056e+03	-5.86713e+03	1.14309e+04	-7.65576e+03
10.567932	3.09819e+03	-1.82747e+03	4.91640e+03	-3.64199e+03	7.35241e+03	-5.86898e+03	1.14309e+04	-7.65576e+03
10.608281	3.09634e+03	-1.82377e+03	4.91640e+03	-3.64199e+03	7.35056e+03	-5.86898e+03	1.14309e+04	-7.65576e+03
10.652796	3.09634e+03	-1.82747e+03	4.91640e+03	-3.64199e+03	7.35056e+03	-5.86713e+03	1.14309e+04	-7.65761e+03
10.704204	3.09634e+03	-1.82932e+03	4.91455e+03	-3.64199e+03	7.35056e+03	-5.86898e+03	1.14309e+04	-7.65761e+03
10.736261	3.09819e+03	-1.82747e+03	4.91455e+03	-3.64384e+03	7.35056e+03	-5.86713e+03	1.14309e+04	-7.65761e+03
10.78347	3.09819e+03	-1.82747e+03	4.91640e+03	-3.64384e+03	7.35056e+03	-5.86713e+03	1.14309e+04	-7.65761e+03
10.816261	3.09819e+03	-1.82932e+03	4.91640e+03	-3.64199e+03	7.35056e+03	-5.86713e+03	1.14309e+04	-7.65761e+03
10.864257	3.09634e+03	-1.83117e+03	4.91455e+03	-3.64199e+03	7.35056e+03	-5.86713e+03	1.14291e+04	-7.65761e+03
10.895871	3.09819e+03	-1.82932e+03	4.91825e+03	-3.64199e+03	7.35056e+03	-5.86713e+03	1.14309e+04	-7.65761e+03
10.934536	3.09634e+03	-1.82562e+03	4.91640e+03	-3.64384e+03	7.35241e+03	-5.86898e+03	1.14309e+04	-7.65761e+03
10.984532	3.09634e+03	-1.82747e+03	4.91455e+03	-3.64199e+03	7.35056e+03	-5.86713e+03	1.14309e+04	-7.65761e+03
11.018758	3.09819e+03	-1.82377e+03	4.91271e+03	-3.64199e+03	7.35241e+03	-5.86713e+03	1.14309e+04	-7.65761e+03
11.067833	3.09819e+03	-1.82747e+03	4.91455e+03	-3.64199e+03	7.35056e+03	-5.86898e+03	1.14291e+04	-7.65576e+03
11.101144	3.09634e+03	-1.82562e+03	4.91640e+03	-3.64014e+03	7.35056e+03	-5.86898e+03	1.14291e+04	-7.65761e+03
11.151183	3.09819e+03	-1.82562e+03	4.91455e+03	-3.64199e+03	7.35056e+03	-5.86713e+03	1.14309e+04	-7.65761e+03
11.183489	3.09634e+03	-1.82932e+03	4.91455e+03	-3.64569e+03	7.35241e+03	-5.86898e+03	1.14291e+04	-7.65761e+03
11.226917	3.09449e+03	-1.82747e+03	4.91640e+03	-3.64199e+03	7.35056e+03	-5.86898e+03	1.14291e+04	-7.65576e+03
11.280246	3.09634e+03	-1.82562e+03	4.91455e+03	-3.64569e+03	7.35241e+03	-5.86713e+03	1.14291e+04	-7.65761e+03
11.304644	3.09634e+03	-1.82562e+03	4.91640e+03	-3.64199e+03	7.35056e+03	-5.86713e+03	1.14291e+04	-7.65576e+03
11.352021	3.09819e+03	-1.82747e+03	4.91455e+03	-3.64199e+03	7.35056e+03	-5.86713e+03	1.14291e+04	-7.65576e+03
11.385649	3.09819e+03	-1.82747e+03	4.91455e+03	-3.64199e+03	7.35056e+03	-5.86713e+03	1.14291e+04	-7.65761e+03
11.435471	3.09819e+03	-1.82562e+03	4.91455e+03	-3.64014e+03	7.35056e+03	-5.86713e+03	1.14291e+04	-7.65761e+03
11.467716	3.09819e+03	-1.82562e+03	4.91455e+03	-3.64014e+03	7.35241e+03	-5.86713e+03	1.14291e+04	-7.65576e+03
11.520238	3.10004e+03	-1.82747e+03	4.91455e+03	-3.64384e+03	7.35056e+03	-5.86898e+03	1.14291e+04	-7.65761e+03
11.567717	3.09634e+03	-1.82932e+03	4.91455e+03	-3.64199e+03	7.35056e+03	-5.86713e+03	1.14291e+04	-7.65576e+03
11.600032	3.09634e+03	-1.82562e+03	4.91455e+03	-3.64014e+03	7.35056e+03	-5.86713e+03	1.14291e+04	-7.65761e+03
11.648243	3.09634e+03	-1.82562e+03	4.91455e+03	-3.64384e+03	7.35056e+03	-5.86713e+03	1.14291e+04	-7.65761e+03
11.68028	3.09449e+03	-1.82932e+03	4.91271e+03	-3.64199e+03	7.35056e+03	-5.86713e+03	1.14309e+04	-7.65576e+03
11.723855	3.09819e+03	-1.82562e+03	4.91455e+03	-3.64384e+03	7.35056e+03	-5.86713e+03	1.14291e+04	-7.65576e+03
11.753837	3.09819e+03	-1.82747e+03	4.91271e+03	-3.64384e+03	7.35056e+03	-5.86713e+03	1.14309e+04	-7.65761e+03
11.805807	3.09819e+03	-1.82562e+03	4.91455e+03	-3.64199e+03	7.35241e+03	-5.86713e+03	1.14291e+04	-7.65761e+03
11.853132	3.10004e+03	-1.82377e+03	4.91455e+03	-3.64014e+03	7.35056e+03	-5.86713e+03	1.14291e+04	-7.65761e+03
11.884185	3.10004e+03	-1.82747e+03	4.91455e+03	-3.64199e+03	7.35241e+03	-5.86898e+03	1.14309e+04	-7.65761e+03
11.93624	3.09449e+03	-1.82747e+03	4.91455e+03	-3.64199e+03	7.35056e+03	-5.86898e+03	1.14309e+04	-7.65576e+03
11.967741	3.09819e+03	-1.82562e+03	4.91455e+03	-3.64199e+03	7.35056e+03	-5.86713e+03	1.14309e+04	-7.65576e+03
12.016217	3.09819e+03	-1.82932e+03	4.91640e+03	-3.64014e+03	7.35241e+03	-5.86713e+03	1.14309e+04	-7.65761e+03
12.046545	3.09819e+03	-1.82747e+03	4.91640e+03	-3.63829e+03	7.35056e+03	-5.86713e+03	1.14309e+04	-7.65761e+03
12.09556	3.09819e+03	-1.82747e+03	4.91640e+03	-3.64014e+03	7.35056e+03	-5.86713e+03	1.14309e+04	-7.65761e+03
12.13538	3.09634e+03	-1.82747e+03	4.91640e+03	-3.64384e+03	7.35241e+03	-5.86898e+03	1.14309e+04	-7.65576e+03
12.167677	3.09449e+03	-1.82562e+03	4.91455e+03	-3.64384e+03	7.35241e+03	-5.86713e+03	1.14309e+04	-7.65576e+03
12.218844	3.09449e+03	-1.82377e+03	4.91455e+03	-3.64199e+03	7.35056e+03	-5.86713e+03	1.14309e+04	-7.65576e+03
12.251077	3.09819e+03	-1.82747e+03	4.91640e+03	-3.64199e+03	7.35056e+03	-5.86713e+03	1.14291e+04	-7.65576e+03
12.302002	3.09449e+03	-1.82562e+03	4.91455e+03	-3.64384e+03	7.35056e+03	-5.86713e+03	1.14291e+04	-7.65576e+03
12.336222	3.09634e+03	-1.82747e+03	4.91455e+03	-3.64384e+03	7.35241e+03	-5.86713e+03	1.14309e+04	-7.65576e+03
12.384236	3.09634e+03	-1.82932e+03	4.91455e+03	-3.64384e+03	7.35056e+03	-5.86713e+03	1.14309e+04	-7.65761e+03
12.428817	3.09634e+03	-1.82747e+03	4.91455e+03	-3.64199e+03	7.35241e+03	-5.86713e+03	1.14291e+04	-7.65576e+03
12.464234	3.09819e+03	-1.82932e+03	4.91825e+03	-3.64384e+03	7.35056e+03	-5.86713e+03	1.14309e+04	-7.65761e+03
12.505602	3.09634e+03	-1.83117e+03	4.91640e+03	-3.64384e+03	7.35056e+03	-5.86713e+03	1.14309e+04	-7.65576e+03
12.535335	3.09819e+03	-1.82562e+03	4.91640e+03	-3.64014e+03	7.35056e+03	-5.86713e+03	1.14291e+04	-7.65576e+03
12.584378	3.10004e+03	-1.82562e+03	4.91640e+03	-3.64199e+03	7.35241e+03	-5.86713e+03	1.14309e+04	-7.65761e+03
12.618705	3.09819e+03	-1.82747e+03	4.91455e+03	-3.64384e+03	7.35056e+03	-5.86713e+03	1.14291e+04	-7.65761e+03
12.668645	3.09264e+03	-1.82377e+03	4.91455e+03	-3.64199e+03	7.35056e+03	-5.86713e+03	1.14291e+04	-7.65576e+03
12.7202	3.09819e+03	-1.82377e+03	4.91640e+03	-3.64384e+03	7.35056e+03	-5.86713e+03	1.14309e+04	-7.65761e+03
12.752201	3.09819e+03	-1.82377e+03	4.91640e+03	-3.64199e+03	7.35241e+03	-5.86713e+03	1.14291e+04	-7.65761e+03
12.800216	3.09819e+03	-1.82562e+03	4.91455e+03	-3.64199e+03	7.35056e+03	-5.86713e+03	1.14309e+04	-7.65576e+03
12.83048	3.09819e+03	-1.82747e+03	4.91825e+03	-3.64384e+03	7.35056e+03	-5.86713e+03	1.14309e+04	-7.65761e+03
12.880196	3.09819e+03	-1.82562e+03	4.91640e+03	-3.64199e+03	7.35241e+03	-5.86713e+03	1.14291e+04	-7.65576e+03
12.912453	3.09634e+03	-1.82377e+03	4.91455e+03	-3.64199e+03	7.35241e+03	-5.86713e+03	1.14309e+04	-7.65761e+03
12.952087	3.09634e+03	-1.82562e+03	4.91455e+03	-3.64384e+03	7.35056e+03	-5.86713e+03	1.14309e+04	-7.65761e+03
13.004989	3.09634e+03	-1.82747e+03	4.91640e+03	-3.64199e+03	7.35056e+03	-5.86898e+03	1.14309e+04	-7.65761e+03
13.034298	3.09634e+03	-1.82562e+03	4.91640e+03	-3.64199e+03	7.35056e+03	-5.86713e+03	1.14309e+04	-7.65576e+03
13.084285	3.10004e+03	-1.82377e+03	4.91640e+03	-3.64014e+03	7.35241e+03	-5.86713e+03	1.14309e+04	-7.65576e+03
13.117588	3.09634e+03	-1.82377e+03	4.91640e+03	-3.64014e+03	7.35056e+03	-5.86898e+03	1.14309e+04	-7.65761e+03
13.168197	3.09634e+03	-1.82562e+03	4.91640e+03	-3.64014e+03	7.35056e+03	-5.86713e+03	1.14309e+04	-7.65576e+03
13.199896	3.09819e+03	-1.82932e+03	4.91640e+03	-3.64199e+03	7.35056e+03	-5.86898e+03	1.14309e+04	-7.65761e+03
13.247386	3.10004e+03	-1.82932e+03	4.91455e+03	-3.64199e+03	7.35056e+03	-5.86713e+03	1.14291e+04	-7.65761e+03
13.295521	3.10004e+03	-1.82747e+03	4.91455e+03	-3.64014e+03	7.35056e+03	-5.86713e+03	1.14309e+04	-7.65761e+03
13.328025	3.09819e+03	-1.83117e+03	4.91640e+03	-3.64199e+03	7.35056e+03	-5.86713e+03	1.14291e+04	-7.65761e+03
13.375897	3.09634e+03	-1.82747e+03	4.91455e+03	-3.64199e+03	7.35241e+03	-5.86713e+03	1.14309e+04	-7.65761e+03
13.406053	3.09819e+03	-1.82377e+03	4.91455e+03	-3.64384e+03	7.35056e+03	-5.86898e+03	1.14309e+04	-7.65761e+03
13.451568	3.09819e+03	-1.82747e+03	4.91455e+03	-3.64199e+03	7.35056e+03	-5.86898e+03	1.14309e+04	-7.65761e+03
13.485361	3.09449e+03	-1.82377e+03	4.91455e+03	-3.64014e+03	7.35056e+03	-5.86713e+03	1.14291e+04	-7.65761e+03
13.536196	3.09819e+03	-1.82377e+03	4.91825e+03	-3.64199e+03	7.34871e+03	-5.86898e+03	1.14291e+04	-7.65761e+03
13.584318	3.09819e+03	-1.82562e+03	4.91640e+03	-3.64199e+03	7.35056e+03	-5.86713e+03	1.14291e+04	-7.65761e+03
13.616225	3.09449e+03	-1.82747e+03	4.91455e+03	-3.64014e+03	7.35056e+03	-5.86898e+03	1.14309e+04	-7.65761e+03
13.663034	3.09819e+03	-1.82932e+03	4.91640e+03	-3.64014e+03	7.35056e+03	-5.86713e+03	1.14309e+04	-7.65761e+03
13.695444	3.09819e+03	-1.82747e+03	4.91825e+03	-3.63829e+03	7.35056e+03	-5.86713e+03	1.14291e+04	-7.65576e+03
13.735169	3.09634e+03	-1.82562e+03	4.91455e+03	-3.64199e+03	7.35056e+03	-5.86713e+03	1.14291e+04	-7.65576e+03
13.775875	3.09819e+03	-1.82747e+03	4.91455e+03	-3.64199e+03	7.35056e+03	-5.86713e+03	1.14309e+04	-7.65576e+03
13.818576	3.10004e+03	-1.82747e+03	4.91640e+03	-3.64384e+03	7.35056e+03	-5.86713e+03	1.14309e+04	-7.65761e+03
13.852031	3.09634e+03	-1.82562e+03	4.91640e+03	-3.64384e+03	7.35056e+03	-5.86713e+03	1.14309e+04	-7.65761e+03
13.902008	3.09634e+03	-1.82747e+03	4.91640e+03	-3.64384e+03	7.35056e+03	-5.86713e+03	1.14309e+04	-7.65761e+03
13.95077	3.09634e+03	-1.83117e+03	4.91455e+03	-3.64384e+03	7.35056e+03	-5.86713e+03	1.14291e+04	-7.65576e+03
13.98418	3.09819e+03	-1.82747e+03	4.91455e+03	-3.64384e+03	7.35241e+03	-5.86713e+03	1.14291e+04	-7.65576e+03
14.032166	3.09819e+03	-1.82747e+03	4.91455e+03	-3.64384e+03	7.35056e+03	-5.86713e+03	1.14291e+04	-7.65761e+03
14.064173	3.09634e+03	-1.82747e+03	4.91455e+03	-3.64384e+03	7.35056e+03	-5.86898e+03	1.14291e+04	-7.65576e+03
14.105895	3.09449e+03	-1.82377e+03	4.91640e+03	-3.64384e+03	7.35056e+03	-5.86713e+03	1.14309e+04	-7.65761e+03
14.135109	3.09819e+03	-1.82377e+03	4.91640e+03	-3.64199e+03	7.35056e+03	-5.86713e+03	1.14291e+04	-7.65761e+03
14.184132	3.09819e+03	-1.82932e+03	4.91455e+03	-3.64014e+03	7.35056e+03	-5.86713e+03	1.14309e+04	-7.65761e+03
14.23512	3.09819e+03	-1.82747e+03	4.91455e+03	-3.64199e+03	7.35056e+03	-5.86713e+03	1.14291e+04	-7.65576e+03
14.268455	3.09819e+03	-1.82747e+03	4.91455e+03	-3.64199e+03	7.35056e+03	-5.86898e+03	1.14309e+04	-7.65761e+03
14.318503	3.09819e+03	-1.82562e+03	4.91825e+03	-3.64199e+03	7.35241e+03	-5.86713e+03	1.14309e+04	-7.65761e+03
14.352152	3.09634e+03	-1.82747e+03	4.91640e+03	-3.64014e+03	7.35056e+03	-5.86713e+03	1.14309e+04	-7.65576e+03
14.399742	3.09634e+03	-1.82747e+03	4.91455e+03	-3.64384e+03	7.35241e+03	-5.86713e+03	1.14309e+04	-7.65761e+03
14.424315	3.09634e+03	-1.82747e+03	4.91640e+03	-3.64199e+03	7.35056e+03	-5.86898e+03	1.14291e+04	-7.65761e+03
14.480167	3.09449e+03	-1.82562e+03	4.91455e+03	-3.64014e+03	7.35056e+03	-5.86713e+03	1.14291e+04	-7.65576e+03
14.528157	3.09634e+03	-1.82377e+03	4.91455e+03	-3.64199e+03	7.35056e+03	-5.86713e+03	1.14309e+04	-7.65576e+03
14.551906	3.09819e+03	-1.82377e+03	4.91455e+03	-3.64199e+03	7.35241e+03	-5.86713e+03	1.14291e+04	-7.65576e+03
14.608156	3.09634e+03	-1.82377e+03	4.91455e+03	-3.64014e+03	7.35056e+03	-5.86713e+03	1.14309e+04	-7.65576e+03
14.635104	3.09819e+03	-1.82747e+03	4.91455e+03	-3.64014e+03	7.35056e+03	-5.86713e+03	1.14309e+04	-7.65576e+03
14.68413	3.09634e+03	-1.82747e+03	4.91455e+03	-3.64014e+03	7.35241e+03	-5.86713e+03	1.14291e+04	-7.65761e+03
14.717458	3.09634e+03	-1.82747e+03	4.91455e+03	-3.64014e+03	7.35241e+03	-5.86713e+03	1.14309e+04	-7.65761e+03
14.768143	3.09819e+03	-1.82747e+03	4.91455e+03	-3.64199e+03	7.35056e+03	-5.86713e+03	1.14309e+04	-7.65576e+03
14.809504	3.09634e+03	-1.82377e+03	4.91640e+03	-3.64014e+03	7.35241e+03	-5.86713e+03	1.14309e+04	-7.65576e+03
14.843503	3.09634e+03	-1.82562e+03	4.91640e+03	-3.64014e+03	7.35056e+03	-5.86713e+03	1.14291e+04	-7.65761e+03
14.888546	3.09819e+03	-1.82562e+03	4.91455e+03	-3.64199e+03	7.35056e+03	-5.86713e+03	1.14309e+04	-7.65576e+03
14.928138	3.09819e+03	-1.82562e+03	4.91455e+03	-3.64014e+03	7.34871e+03	-5.86713e+03	1.14291e+04	-7.65576e+03
14.967347	3.09634e+03	-1.82562e+03	4.91455e+03	-3.64199e+03	7.35056e+03	-5.86713e+03	1.14291e+04	-7.65761e+03
15.008141	3.10004e+03	-1.82562e+03	4.91640e+03	-3.64199e+03	7.35056e+03	-5.86713e+03	1.14291e+04	-7.65761e+03
15.050403	3.09634e+03	-1.82377e+03	4.91455e+03	-3.64014e+03	7.35241e+03	-5.86713e+03	1.14309e+04	-7.65576e+03
15.100704	3.09819e+03	-1.82562e+03	4.91640e+03	-3.64199e+03	7.35056e+03	-5.86713e+03	1.14309e+04	-7.65761e+03
15.134942	3.09819e+03	-1.82562e+03	4.91825e+03	-3.64199e+03	7.35056e+03	-5.86713e+03	1.14309e+04	-7.65576e+03
15.184017	3.09634e+03	-1.82377e+03	4.91640e+03	-3.64199e+03	7.35056e+03	-5.86898e+03	1.14291e+04	-7.65576e+03
15.216253	3.09819e+03	-1.82747e+03	4.91825e+03	-3.64384e+03	7.35056e+03	-5.86898e+03	1.14309e+04	-7.65761e+03
15.261766	3.09819e+03	-1.82562e+03	4.91640e+03	-3.64384e+03	7.35056e+03	-5.86713e+03	1.14291e+04	-7.65576e+03
15.296122	3.09634e+03	-1.82562e+03	4.91455e+03	-3.64384e+03	7.35056e+03	-5.86898e+03	1.14291e+04	-7.65576e+03
15.33498	3.09819e+03	-1.82377e+03	4.91455e+03	-3.64199e+03	7.35056e+03	-5.86713e+03	1.14291e+04	-7.65576e+03
15.383998	3.10004e+03	-1.82562e+03	4.91640e+03	-3.64199e+03	7.35056e+03	-5.86713e+03	1.14291e+04	-7.65576e+03
15.424064	3.09634e+03	-1.82747e+03	4.91271e+03	-3.64384e+03	7.35056e+03	-5.86713e+03	1.14291e+04	-7.65576e+03
15.467338	3.09819e+03	-1.82747e+03	4.91271e+03	-3.64569e+03	7.35056e+03	-5.86713e+03	1.14291e+04	-7.65576e+03
15.500689	3.09634e+03	-1.82747e+03	4.91455e+03	-3.64199e+03	7.35056e+03	-5.86713e+03	1.14291e+04	-7.65761e+03
15.552124	3.09449e+03	-1.82562e+03	4.91640e+03	-3.64199e+03	7.35056e+03	-5.86713e+03	1.14291e+04	-7.65576e+03
15.583832	3.09819e+03	-1.82562e+03	4.91640e+03	-3.64384e+03	7.35056e+03	-5.86713e+03	1.14291e+04	-7.65761e+03
15.628263	3.09634e+03	-1.82562e+03	4.91640e+03	-3.64014e+03	7.35056e+03	-5.86713e+03	1.14291e+04	-7.65576e+03
15.680131	3.09819e+03	-1.82377e+03	4.91455e+03	-3.64014e+03	7.35241e+03	-5.86528e+03	1.14291e+04	-7.65761e+03
15.708725	3.09819e+03	-1.82377e+03	4.91640e+03	-3.64384e+03	7.35056e+03	-5.86713e+03	1.14309e+04	-7.65761e+03
15.75157	3.09819e+03	-1.82562e+03	4.91825e+03	-3.64384e+03	7.35056e+03	-5.86713e+03	1.14309e+04	-7.65576e+03
15.784958	3.09819e+03	-1.82562e+03	4.91640e+03	-3.64199e+03	7.35056e+03	-5.86713e+03	1.14309e+04	-7.65576e+03
15.834015	3.09819e+03	-1.82747e+03	4.91640e+03	-3.64199e+03	7.35056e+03	-5.86713e+03	1.14309e+04	-7.65761e+03
15.867285	3.09634e+03	-1.82932e+03	4.91640e+03	-3.64199e+03	7.35056e+03	-5.86713e+03	1.14309e+04	-7.65576e+03
15.920094	3.09634e+03	-1.82562e+03	4.91455e+03	-3.64014e+03	7.35056e+03	-5.86713e+03	1.14309e+04	-7.65576e+03
15.967171	3.09819e+03	-1.82747e+03	4.91455e+03	-3.64384e+03	7.35241e+03	-5.86898e+03	1.14309e+04	-7.65761e+03
15.9998	3.09819e+03	-1.82377e+03	4.91640e+03	-3.64384e+03	7.35056e+03	-5.86898e+03	1.14309e+04	-7.65761e+03
16.046061	3.10004e+03	-1.82377e+03	4.91455e+03	-3.64199e+03	7.35056e+03	-5.86713e+03	1.14309e+04	-7.65761e+03
16.080097	3.09819e+03	-1.82747e+03	4.91455e+03	-3.64014e+03	7.35241e+03	-5.86898e+03	1.14309e+04	-7.65761e+03
16.12818	3.09449e+03	-1.82747e+03	4.91271e+03	-3.64199e+03	7.35241e+03	-5.86713e+03	1.14291e+04	-7.65761e+03
16.151592	3.09449e+03	-1.83117e+03	4.91640e+03	-3.64199e+03	7.35056e+03	-5.86713e+03	1.14309e+04	-7.65761e+03
16.207743	3.09634e+03	-1.82932e+03	4.91825e+03	-3.64199e+03	7.35056e+03	-5.86898e+03	1.14309e+04	-7.65761e+03
16.251559	3.09449e+03	-1.82932e+03	4.91640e+03	-3.64199e+03	7.35056e+03	-5.86898e+03	1.14309e+04	-7.65576e+03
16.284875	3.09634e+03	-1.82747e+03	4.91640e+03	-3.64199e+03	7.35056e+03	-5.86898e+03	1.14309e+04	-7.65761e+03
16.333866	3.09819e+03	-1.82747e+03	4.91825e+03	-3.64384e+03	7.35056e+03	-5.86713e+03	1.14309e+04	-7.65576e+03
16.368098	3.09449e+03	-1.82562e+03	4.91825e+03	-3.64199e+03	7.35056e+03	-5.86713e+03	1.14291e+04	-7.65576e+03
16.416093	3.09634e+03	-1.82747e+03	4.91640e+03	-3.64199e+03	7.35056e+03	-5.86713e+03	1.14309e+04	-7.65761e+03
16.448101	3.09819e+03	-1.82747e+03	4.91825e+03	-3.64384e+03	7.35056e+03	-5.86713e+03	1.14309e+04	-7.65576e+03
16.495965	3.09634e+03	-1.82562e+03	4.91455e+03	-3.64199e+03	7.35056e+03	-5.86898e+03	1.14309e+04	-7.65576e+03
16.544049	3.09819e+03	-1.82562e+03	4.91640e+03	-3.64199e+03	7.35241e+03	-5.86713e+03	1.14309e+04	-7.65761e+03
16.567225	3.10004e+03	-1.82747e+03	4.91455e+03	-3.64014e+03	7.35056e+03	-5.86713e+03	1.14309e+04	-7.65576e+03
16.619193	3.09634e+03	-1.82932e+03	4.91455e+03	-3.64199e+03	7.35056e+03	-5.86713e+03	1.14309e+04	-7.65576e+03
16.650347	3.09634e+03	-1.82747e+03	4.91640e+03	-3.64199e+03	7.35056e+03	-5.86898e+03	1.14309e+04	-7.65761e+03
16.700489	3.09819e+03	-1.82562e+03	4.91640e+03	-3.64014e+03	7.35056e+03	-5.86713e+03	1.14309e+04	-7.65576e+03
16.733848	3.09819e+03	-1.82377e+03	4.91455e+03	-3.64014e+03	7.35056e+03	-5.86713e+03	1.14309e+04	-7.65576e+03
16.783842	3.10188e+03	-1.82377e+03	4.91455e+03	-3.64199e+03	7.35056e+03	-5.86713e+03	1.14309e+04	-7.65576e+03
16.832082	3.09819e+03	-1.82747e+03	4.91455e+03	-3.64199e+03	7.35056e+03	-5.86713e+03	1.14309e+04	-7.65761e+03
16.858785	3.09819e+03	-1.82377e+03	4.91640e+03	-3.64199e+03	7.35056e+03	-5.86713e+03	1.14309e+04	-7.65576e+03
16.90868	3.09819e+03	-1.82562e+03	4.91640e+03	-3.64199e+03	7.35241e+03	-5.86713e+03	1.14309e+04	-7.65576e+03
16.934996	3.10004e+03	-1.82747e+03	4.91640e+03	-3.64014e+03	7.35241e+03	-5.86528e+03	1.14309e+04	-7.65576e+03
16.992074	3.09819e+03	-1.82377e+03	4.91455e+03	-3.64014e+03	7.35056e+03	-5.86713e+03	1.14309e+04	-7.65761e+03
17.018128	3.10004e+03	-1.82192e+03	4.91455e+03	-3.64199e+03	7.35056e+03	-5.86713e+03	1.14309e+04	-7.65576e+03
17.068986	3.09819e+03	-1.82562e+03	4.91640e+03	-3.64199e+03	7.35241e+03	-5.86713e+03	1.14309e+04	-7.65576e+03
17.117122	3.09449e+03	-1.82932e+03	4.91640e+03	-3.64014e+03	7.35241e+03	-5.86713e+03	1.14309e+04	-7.65576e+03
17.152077	3.09819e+03	-1.82932e+03	4.91640e+03	-3.64199e+03	7.35056e+03	-5.86713e+03	1.14309e+04	-7.65576e+03
17.199368	3.09819e+03	-1.82747e+03	4.91640e+03	-3.64014e+03	7.35056e+03	-5.86713e+03	1.14309e+04	-7.65576e+03
17.232056	3.09819e+03	-1.82562e+03	4.91455e+03	-3.64199e+03	7.35056e+03	-5.86713e+03	1.14309e+04	-7.65576e+03
17.277565	3.09819e+03	-1.82377e+03	4.91455e+03	-3.64199e+03	7.35056e+03	-5.86713e+03	1.14309e+04	-7.65576e+03
17.307975	3.09634e+03	-1.82562e+03	4.91455e+03	-3.64014e+03	7.35056e+03	-5.86713e+03	1.14291e+04	-7.65576e+03
17.350353	3.09634e+03	-1.82747e+03	4.91455e+03	-3.64014e+03	7.35056e+03	-5.86713e+03	1.14291e+04	-7.65576e+03
17.407959	3.10004e+03	-1.82377e+03	4.91640e+03	-3.64199e+03	7.35056e+03	-5.86713e+03	1.14291e+04	-7.65576e+03
17.43377	3.09819e+03	-1.82377e+03	4.91640e+03	-3.64199e+03	7.35056e+03	-5.86713e+03	1.14291e+04	-7.65576e+03
17.483749	3.09634e+03	-1.82562e+03	4.91640e+03	-3.64199e+03	7.35056e+03	-5.86713e+03	1.14291e+04	-7.65576e+03
17.51711	3.09819e+03	-1.82747e+03	4.91455e+03	-3.64384e+03	7.35056e+03	-5.86713e+03	1.14291e+04	-7.65576e+03
17.568005	3.09819e+03	-1.82562e+03	4.91640e+03	-3.64199e+03	7.35241e+03	-5.86713e+03	1.14291e+04	-7.65576e+03
17.599367	3.09819e+03	-1.82377e+03	4.91455e+03	-3.64199e+03	7.35056e+03	-5.86713e+03	1.14291e+04	-7.65576e+03
17.645585	3.09819e+03	-1.82562e+03	4.91640e+03	-3.64199e+03	7.35056e+03	-5.86898e+03	1.14291e+04	-7.65576e+03
17.696078	3.09819e+03	-1.82747e+03	4.91640e+03	-3.64384e+03	7.35056e+03	-5.86713e+03	1.14309e+04	-7.65576e+03
17.728049	3.10004e+03	-1.82562e+03	4.91271e+03	-3.64384e+03	7.35056e+03	-5.86898e+03	1.14309e+04	-7.65761e+03
17.768032	3.09819e+03	-1.82747e+03	4.91455e+03	-3.63829e+03	7.35056e+03	-5.86713e+03	1.14291e+04	-7.65576e+03
17.801376	3.09449e+03	-1.82377e+03	4.91455e+03	-3.64014e+03	7.35056e+03	-5.86713e+03	1.14291e+04	-7.65761e+03
17.850393	3.09634e+03	-1.82562e+03	4.91640e+03	-3.64199e+03	7.35056e+03	-5.86713e+03	1.14291e+04	-7.65576e+03
17.884712	3.09819e+03	-1.82562e+03	4.91825e+03	-3.64199e+03	7.35056e+03	-5.86713e+03	1.14291e+04	-7.65761e+03
17.936038	3.09634e+03	-1.82192e+03	4.91455e+03	-3.64014e+03	7.35056e+03	-5.86713e+03	1.14291e+04	-7.65576e+03
17.984039	3.09819e+03	-1.82747e+03	4.91455e+03	-3.64199e+03	7.35241e+03	-5.86713e+03	1.14291e+04	-7.65576e+03
18.015872	3.09819e+03	-1.82747e+03	4.91455e+03	-3.64199e+03	7.35241e+03	-5.86713e+03	1.14291e+04	-7.65761e+03
18.060357	3.09634e+03	-1.82377e+03	4.91271e+03	-3.64384e+03	7.35056e+03	-5.86713e+03	1.14291e+04	-7.65576e+03
18.096015	3.09449e+03	-1.82932e+03	4.91640e+03	-3.64384e+03	7.35056e+03	-5.86713e+03	1.14309e+04	-7.65761e+03
18.143795	3.09449e+03	-1.82932e+03	4.91455e+03	-3.64199e+03	7.35056e+03	-5.86713e+03	1.14291e+04	-7.65576e+03
18.166994	3.09634e+03	-1.82562e+03	4.91271e+03	-3.64014e+03	7.35056e+03	-5.86713e+03	1.14291e+04	-7.65576e+03
18.217739	3.09819e+03	-1.82747e+03	4.91455e+03	-3.64014e+03	7.35056e+03	-5.86713e+03	1.14291e+04	-7.65576e+03
18.267988	3.09634e+03	-1.82377e+03	4.91455e+03	-3.64014e+03	7.35241e+03	-5.86713e+03	1.14291e+04	-7.65576e+03
18.300282	3.09449e+03	-1.82377e+03	4.91455e+03	-3.64014e+03	7.35241e+03	-5.86713e+03	1.14291e+04	-7.65576e+03
18.35205	3.09634e+03	-1.82562e+03	4.91640e+03	-3.64199e+03	7.35056e+03	-5.86713e+03	1.14309e+04	-7.65576e+03
18.384032	3.09449e+03	-1.82747e+03	4.91640e+03	-3.64199e+03	7.35056e+03	-5.86713e+03	1.14309e+04	-7.65576e+03
18.429141	3.09634e+03	-1.82562e+03	4.91640e+03	-3.64014e+03	7.35241e+03	-5.86713e+03	1.14309e+04	-7.65576e+03
18.462474	3.10004e+03	-1.82562e+03	4.91825e+03	-3.64199e+03	7.35056e+03	-5.86713e+03	1.14309e+04	-7.65576e+03
18.512038	3.09819e+03	-1.82377e+03	4.91640e+03	-3.64199e+03	7.35056e+03	-5.86713e+03	1.14291e+04	-7.65576e+03
18.534643	3.09819e+03	-1.82377e+03	4.91640e+03	-3.64199e+03	7.35056e+03	-5.86713e+03	1.14309e+04	-7.65576e+03
18.584652	3.09819e+03	-1.82562e+03	4.91455e+03	-3.64199e+03	7.35241e+03	-5.86713e+03	1.14309e+04	-7.65761e+03
18.633583	3.09819e+03	-1.82377e+03	4.91455e+03	-3.64199e+03	7.35056e+03	-5.86713e+03	1.14291e+04	-7.65576e+03
18.667931	3.09819e+03	-1.82007e+03	4.91640e+03	-3.64569e+03	7.35241e+03	-5.86713e+03	1.14309e+04	-7.65576e+03
18.719345	3.09819e+03	-1.82747e+03	4.91640e+03	-3.64384e+03	7.35241e+03	-5.86713e+03	1.14309e+04	-7.65761e+03
18.749937	3.10004e+03	-1.82377e+03	4.91455e+03	-3.64199e+03	7.35241e+03	-5.86713e+03	1.14291e+04	-7.65576e+03
18.799266	3.10004e+03	-1.82377e+03	4.91640e+03	-3.64199e+03	7.35056e+03	-5.86713e+03	1.14309e+04	-7.65761e+03
18.829765	3.09819e+03	-1.82747e+03	4.91640e+03	-3.64199e+03	7.35056e+03	-5.86713e+03	1.14309e+04	-7.65576e+03
18.876902	3.10004e+03	-1.82747e+03	4.91455e+03	-3.64014e+03	7.35056e+03	-5.86898e+03	1.14309e+04	-7.65576e+03
18.928085	3.10004e+03	-1.82562e+03	4.91455e+03	-3.64014e+03	7.35241e+03	-5.86713e+03	1.14309e+04	-7.65576e+03
18.950249	3.10004e+03	-1.82562e+03	4.91640e+03	-3.64384e+03	7.35241e+03	-5.86713e+03	1.14291e+04	-7.65761e+03
19.007677	3.09819e+03	-1.82747e+03	4.91640e+03	-3.64199e+03	7.35241e+03	-5.86713e+03	1.14309e+04	-7.65576e+03
19.033545	3.10004e+03	-1.82747e+03	4.91455e+03	-3.64199e+03	7.35056e+03	-5.86713e+03	1.14309e+04	-7.65761e+03
19.084549	3.09819e+03	-1.82747e+03	4.91455e+03	-3.64384e+03	7.35056e+03	-5.86713e+03	1.14309e+04	-7.65576e+03
19.119685	3.09634e+03	-1.82377e+03	4.91640e+03	-3.64014e+03	7.35241e+03	-5.86713e+03	1.14309e+04	-7.65576e+03
19.168039	3.09819e+03	-1.82747e+03	4.91640e+03	-3.64199e+03	7.35056e+03	-5.86898e+03	1.14309e+04	-7.65576e+03
19.215815	3.09634e+03	-1.83117e+03	4.91455e+03	-3.64014e+03	7.35241e+03	-5.86713e+03	1.14309e+04	-7.65576e+03
19.245111	3.09634e+03	-1.82932e+03	4.91455e+03	-3.64199e+03	7.35241e+03	-5.86713e+03	1.14309e+04	-7.65576e+03
19.29249	3.09634e+03	-1.82562e+03	4.91640e+03	-3.64384e+03	7.35241e+03	-5.86713e+03	1.14309e+04	-7.65761e+03
19.328033	3.09634e+03	-1.82747e+03	4.91640e+03	-3.64384e+03	7.35241e+03	-5.86713e+03	1.14291e+04	-7.65576e+03
19.366819	3.09634e+03	-1.82377e+03	4.91455e+03	-3.64199e+03	7.35056e+03	-5.86713e+03	1.14309e+04	-7.65576e+03
19.400191	3.09449e+03	-1.82747e+03	4.91455e+03	-3.64199e+03	7.35056e+03	-5.86898e+03	1.14309e+04	-7.65761e+03
19.450112	3.09449e+03	-1.82562e+03	4.91640e+03	-3.64199e+03	7.35056e+03	-5.86898e+03	1.14291e+04	-7.65761e+03
19.50016	3.09449e+03	-1.82747e+03	4.91455e+03	-3.64199e+03	7.35241e+03	-5.86713e+03	1.14309e+04	-7.65761e+03
19.533609	3.09634e+03	-1.82747e+03	4.91455e+03	-3.64384e+03	7.35056e+03	-5.86713e+03	1.14309e+04	-7.65761e+03
19.584017	3.09634e+03	-1.82377e+03	4.91455e+03	-3.64384e+03	7.35241e+03	-5.86713e+03	1.14309e+04	-7.65761e+03
19.615834	3.09449e+03	-1.82377e+03	4.91640e+03	-3.64199e+03	7.35241e+03	-5.86713e+03	1.14309e+04	-7.65761e+03
19.661336	3.09819e+03	-1.82932e+03	4.91640e+03	-3.64384e+03	7.35241e+03	-5.86713e+03	1.14309e+04	-7.65761e+03
19.696013	3.09819e+03	-1.83117e+03	4.91640e+03	-3.64199e+03	7.35056e+03	-5.86713e+03	1.14291e+04	-7.65576e+03
19.734518	3.09819e+03	-1.82932e+03	4.91640e+03	-3.64014e+03	7.35056e+03	-5.86713e+03	1.14309e+04	-7.65761e+03
19.783502	3.09819e+03	-1.82747e+03	4.91825e+03	-3.64014e+03	7.35241e+03	-5.86713e+03	1.14309e+04	-7.65576e+03
19.818672	3.09819e+03	-1.82377e+03	4.91455e+03	-3.64199e+03	7.35241e+03	-5.86713e+03	1.14291e+04	-7.65761e+03
19.867775	3.09634e+03	-1.82562e+03	4.91455e+03	-3.64014e+03	7.35056e+03	-5.86713e+03	1.14309e+04	-7.65576e+03
19.90108	3.09634e+03	-1.82747e+03	4.91455e+03	-3.64199e+03	7.35056e+03	-5.86898e+03	1.14309e+04	-7.65576e+03
19.951992	3.09634e+03	-1.82747e+03	4.91640e+03	-3.64199e+03	7.35056e+03	-5.86713e+03	1.14309e+04	-7.65576e+03
19.983976	3.09819e+03	-1.82562e+03	4.91455e+03	-3.64014e+03	7.35241e+03	-5.86713e+03	1.14309e+04	-7.65576e+03
20.03204	3.09634e+03	-1.82562e+03	4.91455e+03	-3.64199e+03	7.35241e+03	-5.86713e+03	1.14309e+04	-7.65761e+03
20.077845	3.09449e+03	-1.82562e+03	4.91455e+03	-3.64014e+03	7.35241e+03	-5.86713e+03	1.14309e+04	-7.65576e+03
20.111989	3.09819e+03	-1.82562e+03	4.91640e+03	-3.64199e+03	7.35056e+03	-5.86898e+03	1.14309e+04	-7.65761e+03
20.159888	3.09819e+03	-1.82562e+03	4.91640e+03	-3.64199e+03	7.35056e+03	-5.86898e+03	1.14309e+04	-7.65576e+03
20.184431	3.09634e+03	-1.82747e+03	4.91455e+03	-3.64384e+03	7.35056e+03	-5.86713e+03	1.14309e+04	-7.65761e+03
20.235278	3.09634e+03	-1.82747e+03	4.91640e+03	-3.64199e+03	7.35056e+03	-5.86713e+03	1.14309e+04	-7.65576e+03
20.266687	3.09449e+03	-1.82932e+03	4.91455e+03	-3.64199e+03	7.35056e+03	-5.86713e+03	1.14291e+04	-7.65761e+03
20.316747	3.09449e+03	-1.82747e+03	4.91455e+03	-3.64014e+03	7.35056e+03	-5.86713e+03	1.14309e+04	-7.65576e+03
20.367974	3.09449e+03	-1.82747e+03	4.91455e+03	-3.64199e+03	7.35056e+03	-5.86713e+03	1.14291e+04	-7.65761e+03
20.400026	3.09634e+03	-1.82562e+03	4.91271e+03	-3.64384e+03	7.35056e+03	-5.86713e+03	1.14291e+04	-7.65576e+03
20.445754	3.09634e+03	-1.82932e+03	4.91455e+03	-3.64199e+03	7.35056e+03	-5.86898e+03	1.14309e+04	-7.65576e+03
20.477926	3.09634e+03	-1.82932e+03	4.91271e+03	-3.64199e+03	7.35241e+03	-5.86713e+03	1.14309e+04	-7.65576e+03
20.52802	3.09819e+03	-1.82932e+03	4.91455e+03	-3.64199e+03	7.35241e+03	-5.86713e+03	1.14291e+04	-7.65576e+03
20.560112	3.09634e+03	-1.82747e+03	4.91640e+03	-3.64384e+03	7.35056e+03	-5.86713e+03	1.14309e+04	-7.65576e+03
20.601072	3.10004e+03	-1.82747e+03	4.91640e+03	-3.64384e+03	7.35056e+03	-5.86713e+03	1.14291e+04	-7.65576e+03
20.650056	3.10004e+03	-1.82747e+03	4.91455e+03	-3.64199e+03	7.35056e+03	-5.86713e+03	1.14291e+04	-7.65761e+03
20.683343	3.09634e+03	-1.82562e+03	4.91640e+03	-3.64199e+03	7.35056e+03	-5.86713e+03	1.14291e+04	-7.65576e+03
20.734363	3.09634e+03	-1.82562e+03	4.91455e+03	-3.64384e+03	7.35056e+03	-5.86713e+03	1.14309e+04	-7.65576e+03
20.767974	3.09449e+03	-1.82747e+03	4.91640e+03	-3.64384e+03	7.35241e+03	-5.86713e+03	1.14309e+04	-7.65576e+03
20.815667	3.09264e+03	-1.82562e+03	4.91640e+03	-3.64199e+03	7.35056e+03	-5.86713e+03	1.14291e+04	-7.65576e+03
20.845228	3.09634e+03	-1.82932e+03	4.91825e+03	-3.64014e+03	7.35056e+03	-5.86713e+03	1.14291e+04	-7.65576e+03
20.895948	3.09634e+03	-1.82932e+03	4.91640e+03	-3.63829e+03	7.35241e+03	-5.86528e+03	1.14291e+04	-7.65576e+03
20.943416	3.09634e+03	-1.82377e+03	4.91825e+03	-3.64014e+03	7.35056e+03	-5.86713e+03	1.14309e+04	-7.65576e+03
20.967691	3.09819e+03	-1.82377e+03	4.91640e+03	-3.64199e+03	7.35056e+03	-5.86713e+03	1.14291e+04	-7.65576e+03
21.016699	3.09634e+03	-1.82377e+03	4.91640e+03	-3.64199e+03	7.35056e+03	-5.86713e+03	1.14309e+04	-7.65576e+03
21.050039	3.09819e+03	-1.82562e+03	4.91825e+03	-3.64199e+03	7.35056e+03	-5.86713e+03	1.14291e+04	-7.65576e+03
21.100948	3.09634e+03	-1.82932e+03	4.91640e+03	-3.64014e+03	7.35056e+03	-5.86713e+03	1.14309e+04	-7.65576e+03
21.13332	3.09634e+03	-1.82747e+03	4.91640e+03	-3.64014e+03	7.35241e+03	-5.86713e+03	1.14291e+04	-7.65761e+03
21.183286	3.09634e+03	-1.82562e+03	4.91640e+03	-3.64199e+03	7.35056e+03	-5.86713e+03	1.14309e+04	-7.65576e+03
21.225101	3.09634e+03	-1.82932e+03	4.91455e+03	-3.64384e+03	7.35241e+03	-5.86713e+03	1.14309e+04	-7.65576e+03
21.26007	3.09449e+03	-1.82747e+03	4.91271e+03	-3.64384e+03	7.35056e+03	-5.86713e+03	1.14309e+04	-7.65576e+03
21.310401	3.09819e+03	-1.82747e+03	4.91640e+03	-3.64199e+03	7.35056e+03	-5.86713e+03	1.14309e+04	-7.65576e+03
21.334459	3.10188e+03	-1.82747e+03	4.91640e+03	-3.64384e+03	7.35056e+03	-5.86898e+03	1.14291e+04	-7.65576e+03
21.383264	3.09634e+03	-1.82747e+03	4.91455e+03	-3.64384e+03	7.35056e+03	-5.86713e+03	1.14291e+04	-7.65576e+03
21.416449	3.09634e+03	-1.82747e+03	4.91640e+03	-3.64384e+03	7.35056e+03	-5.86713e+03	1.14291e+04	-7.65576e+03
