Timestamp	I_0	Q_0	I_1	Q_1	I_2	Q_2	I_3	Q_3
0.0	3.14443e+03	-1.89960e+03	5.05513e+03	-3.71967e+03	7.56882e+03	-5.89303e+03	1.16714e+04	-7.57807e+03
0.032613	3.14443e+03	-1.90145e+03	5.05513e+03	-3.71967e+03	7.56882e+03	-5.89303e+03	1.16732e+04	-7.57992e+03
0.080603	3.14443e+03	-1.90145e+03	5.05513e+03	-3.71967e+03	7.56882e+03	-5.89303e+03	1.16732e+04	-7.57807e+03
0.104342	3.14443e+03	-1.90330e+03	5.05328e+03	-3.72152e+03	7.56882e+03	-5.89303e+03	1.16732e+04	-7.57807e+03
0.153378	3.14628e+03	-1.90145e+03	5.05328e+03	-3.71967e+03	7.56882e+03	-5.89488e+03	1.16732e+04	-7.57807e+03
0.18671	3.14628e+03	-1.89960e+03	5.05513e+03	-3.71967e+03	7.56697e+03	-5.89488e+03	1.16732e+04	-7.57807e+03
0.237598	3.14628e+03	-1.89960e+03	5.05698e+03	-3.71967e+03	7.56882e+03	-5.89303e+03	1.16732e+04	-7.57807e+03
0.2886	3.14443e+03	-1.90145e+03	5.05698e+03	-3.71967e+03	7.56882e+03	-5.89303e+03	1.16714e+04	-7.57807e+03
0.320595	3.14443e+03	-1.89960e+03	5.05698e+03	-3.71967e+03	7.56882e+03	-5.89303e+03	1.16732e+04	-7.57807e+03
0.365842	3.14443e+03	-1.89775e+03	5.05513e+03	-3.71967e+03	7.56882e+03	-5.89303e+03	1.16714e+04	-7.57807e+03
0.400596	3.14813e+03	-1.89775e+03	5.05328e+03	-3.71967e+03	7.56697e+03	-5.89488e+03	1.16714e+04	-7.57992e+03
0.448568	3.14813e+03	-1.89960e+03	5.05513e+03	-3.71967e+03	7.56697e+03	-5.89488e+03	1.16714e+04	-7.57807e+03
0.47093	3.14628e+03	-1.89775e+03	5.05328e+03	-3.71782e+03	7.56697e+03	-5.89488e+03	1.16714e+04	-7.57992e+03
0.520444	3.14443e+03	-1.90145e+03	5.05328e+03	-3.71967e+03	7.56697e+03	-5.89673e+03	1.16714e+04	-7.57992e+03
0.570225	3.14443e+03	-1.89775e+03	5.05513e+03	-3.71967e+03	7.56697e+03	-5.89488e+03	1.16714e+04	-7.57807e+03
0.604355	3.14813e+03	-1.89775e+03	5.05513e+03	-3.71967e+03	7.56697e+03	-5.89303e+03	1.16714e+04	-7.57807e+03
0.653283	3.14628e+03	-1.89775e+03	5.05513e+03	-3.71967e+03	7.56697e+03	-5.89488e+03	1.16714e+04	-7.57992e+03
0.6886	3.14628e+03	-1.90145e+03	5.05328e+03	-3.71967e+03	7.56697e+03	-5.89488e+03	1.16714e+04	-7.57807e+03
0.736593	3.14628e+03	-1.89590e+03	5.05328e+03	-3.71967e+03	7.56697e+03	-5.89488e+03	1.16732e+04	-7.57807e+03
0.76643	3.14628e+03	-1.89960e+03	5.05513e+03	-3.72152e+03	7.56697e+03	-5.89488e+03	1.16732e+04	-7.57807e+03
0.814384	3.14443e+03	-1.89960e+03	5.05328e+03	-3.71782e+03	7.56882e+03	-5.89303e+03	1.16732e+04	-7.57807e+03
0.864583	3.14628e+03	-1.89960e+03	5.05328e+03	-3.71967e+03	7.56697e+03	-5.89303e+03	1.16732e+04	-7.57807e+03
0.896752	3.14628e+03	-1.90145e+03	5.05513e+03	-3.72152e+03	7.56697e+03	-5.89303e+03	1.16732e+04	-7.57992e+03
0.937278	3.14258e+03	-1.90145e+03	5.05513e+03	-3.71967e+03	7.56697e+03	-5.89488e+03	1.16732e+04	-7.57807e+03
0.970249	3.14443e+03	-1.89960e+03	5.05328e+03	-3.71967e+03	7.56697e+03	-5.89303e+03	1.16714e+04	-7.57992e+03
1.022944	3.14813e+03	-1.89960e+03	5.05328e+03	-3.71967e+03	7.56697e+03	-5.89488e+03	1.16714e+04	-7.57992e+03
1.054309	3.14443e+03	-1.89960e+03	5.05328e+03	-3.71967e+03	7.56697e+03	-5.89488e+03	1.16714e+04	-7.57992e+03
1.103543	3.14443e+03	-1.90145e+03	5.05328e+03	-3.71782e+03	7.56697e+03	-5.89488e+03	1.16732e+04	-7.57992e+03
1.152985	3.14073e+03	-1.90330e+03	5.05143e+03	-3.71967e+03	7.56697e+03	-5.89488e+03	1.16732e+04	-7.58177e+03
1.184588	3.14258e+03	-1.89960e+03	5.05698e+03	-3.71967e+03	7.56697e+03	-5.89488e+03	1.16732e+04	-7.57992e+03
1.232687	3.14443e+03	-1.89775e+03	5.05513e+03	-3.71967e+03	7.56697e+03	-5.89303e+03	1.16732e+04	-7.57992e+03
1.26443	3.14258e+03	-1.90330e+03	5.05328e+03	-3.71782e+03	7.56697e+03	-5.89488e+03	1.16732e+04	-7.57992e+03
1.303539	3.14073e+03	-1.90145e+03	5.05328e+03	-3.71597e+03	7.56697e+03	-5.89118e+03	1.16714e+04	-7.57992e+03
1.33666	3.14073e+03	-1.90330e+03	5.05328e+03	-3.71782e+03	7.56697e+03	-5.89488e+03	1.16732e+04	-7.58177e+03
1.388588	3.14443e+03	-1.90145e+03	5.05513e+03	-3.71782e+03	7.56697e+03	-5.89488e+03	1.16732e+04	-7.57992e+03
1.436556	3.14628e+03	-1.90145e+03	5.05513e+03	-3.71967e+03	7.56697e+03	-5.89488e+03	1.16732e+04	-7.57992e+03
1.469913	3.14628e+03	-1.89960e+03	5.05328e+03	-3.71967e+03	7.56697e+03	-5.89488e+03	1.16732e+04	-7.57992e+03
1.519888	3.14443e+03	-1.89960e+03	5.05698e+03	-3.71782e+03	7.56697e+03	-5.89303e+03	1.16732e+04	-7.57992e+03
1.552147	3.14628e+03	-1.89775e+03	5.05513e+03	-3.71967e+03	7.56697e+03	-5.89303e+03	1.16732e+04	-7.57807e+03
1.600575	3.14813e+03	-1.89775e+03	5.05328e+03	-3.72152e+03	7.56697e+03	-5.89488e+03	1.16732e+04	-7.57992e+03
1.632575	3.14628e+03	-1.89590e+03	5.05328e+03	-3.71782e+03	7.56697e+03	-5.89488e+03	1.16732e+04	-7.57807e+03
1.680587	3.14628e+03	-1.89590e+03	5.05513e+03	-3.71967e+03	7.56697e+03	-5.89303e+03	1.16732e+04	-7.57807e+03
1.728574	3.14628e+03	-1.89775e+03	5.05513e+03	-3.72152e+03	7.56882e+03	-5.89303e+03	1.16732e+04	-7.57992e+03
1.754144	3.14443e+03	-1.90145e+03	5.05143e+03	-3.71967e+03	7.56697e+03	-5.89303e+03	1.16732e+04	-7.57807e+03
1.803198	3.14258e+03	-1.90145e+03	5.05513e+03	-3.71967e+03	7.56882e+03	-5.89118e+03	1.16732e+04	-7.57807e+03
1.83655	3.14258e+03	-1.89775e+03	5.05513e+03	-3.71967e+03	7.56697e+03	-5.89303e+03	1.16732e+04	-7.57992e+03
1.886461	3.14813e+03	-1.89960e+03	5.05513e+03	-3.71967e+03	7.56697e+03	-5.89303e+03	1.16732e+04	-7.57807e+03
1.919802	3.14998e+03	-1.90330e+03	5.05513e+03	-3.71782e+03	7.56882e+03	-5.89303e+03	1.16732e+04	-7.57807e+03
1.966615	3.14813e+03	-1.90330e+03	5.05328e+03	-3.71967e+03	7.56697e+03	-5.89488e+03	1.16732e+04	-7.57992e+03
2.014213	3.14628e+03	-1.89960e+03	5.05143e+03	-3.71782e+03	7.56882e+03	-5.89488e+03	1.16732e+04	-7.57807e+03
2.047774	3.14813e+03	-1.89775e+03	5.05328e+03	-3.71967e+03	7.56882e+03	-5.89488e+03	1.16732e+04	-7.57807e+03
2.087495	3.14813e+03	-1.89775e+03	5.05513e+03	-3.71967e+03	7.56697e+03	-5.89303e+03	1.16732e+04	-7.57807e+03
2.121414	3.14628e+03	-1.89960e+03	5.05698e+03	-3.71782e+03	7.56882e+03	-5.89303e+03	1.16732e+04	-7.57992e+03
2.169846	3.14443e+03	-1.89960e+03	5.05328e+03	-3.71967e+03	7.56697e+03	-5.89303e+03	1.16732e+04	-7.57807e+03
2.208567	3.14628e+03	-1.90145e+03	5.05513e+03	-3.71967e+03	7.56882e+03	-5.89488e+03	1.16732e+04	-7.57807e+03
2.2541	3.14443e+03	-1.90145e+03	5.05698e+03	-3.71782e+03	7.56882e+03	-5.89488e+03	1.16714e+04	-7.57807e+03
2.304659	3.14443e+03	-1.90145e+03	5.05513e+03	-3.71967e+03	7.56882e+03	-5.89303e+03	1.16732e+04	-7.57807e+03
2.33657	3.14628e+03	-1.89960e+03	5.05513e+03	-3.71967e+03	7.56697e+03	-5.89303e+03	1.16714e+04	-7.57807e+03
2.384566	3.14628e+03	-1.89775e+03	5.05513e+03	-3.71967e+03	7.56697e+03	-5.89488e+03	1.16732e+04	-7.57807e+03
2.416563	3.14628e+03	-1.89775e+03	5.05698e+03	-3.71967e+03	7.56697e+03	-5.89488e+03	1.16714e+04	-7.57807e+03
2.464297	3.14443e+03	-1.89960e+03	5.05328e+03	-3.71967e+03	7.56697e+03	-5.89488e+03	1.16714e+04	-7.57992e+03
2.487401	3.14813e+03	-1.90145e+03	5.05328e+03	-3.71782e+03	7.56697e+03	-5.89303e+03	1.16714e+04	-7.57807e+03
2.536529	3.14443e+03	-1.89960e+03	5.05328e+03	-3.72152e+03	7.56697e+03	-5.89488e+03	1.16714e+04	-7.57992e+03
2.569802	3.14258e+03	-1.89590e+03	5.05143e+03	-3.71967e+03	7.56697e+03	-5.89303e+03	1.16714e+04	-7.57992e+03
2.620581	3.14258e+03	-1.89590e+03	5.05328e+03	-3.71782e+03	7.56697e+03	-5.89303e+03	1.16714e+04	-7.57807e+03
2.669778	3.14258e+03	-1.89960e+03	5.05698e+03	-3.71967e+03	7.56697e+03	-5.89303e+03	1.16714e+04	-7.57807e+03
2.704568	3.14073e+03	-1.90145e+03	5.05328e+03	-3.72152e+03	7.56697e+03	-5.89303e+03	1.16714e+04	-7.57992e+03
2.75206	3.14813e+03	-1.89960e+03	5.05513e+03	-3.71782e+03	7.56882e+03	-5.89303e+03	1.16714e+04	-7.57807e+03
2.781914	3.14813e+03	-1.90145e+03	5.05513e+03	-3.71782e+03	7.56697e+03	-5.89488e+03	1.16714e+04	-7.57807e+03
2.825687	3.14443e+03	-1.90330e+03	5.05513e+03	-3.71597e+03	7.56697e+03	-5.89303e+03	1.16714e+04	-7.57992e+03
2.864215	3.14443e+03	-1.89960e+03	5.05328e+03	-3.71967e+03	7.56882e+03	-5.89303e+03	1.16714e+04	-7.57807e+03
2.904577	3.14628e+03	-1.89960e+03	5.05143e+03	-3.72152e+03	7.56697e+03	-5.89303e+03	1.16714e+04	-7.57807e+03
2.953072	3.14258e+03	-1.90145e+03	5.05328e+03	-3.71782e+03	7.56882e+03	-5.89303e+03	1.16714e+04	-7.57807e+03
2.98638	3.14258e+03	-1.89960e+03	5.05513e+03	-3.71782e+03	7.56882e+03	-5.89118e+03	1.16714e+04	-7.57807e+03
3.036396	3.14443e+03	-1.89960e+03	5.05513e+03	-3.71967e+03	7.56697e+03	-5.89303e+03	1.16714e+04	-7.57807e+03
3.069709	3.14813e+03	-1.89590e+03	5.05328e+03	-3.71782e+03	7.56697e+03	-5.89303e+03	1.16714e+04	-7.57807e+03
3.120571	3.14998e+03	-1.89960e+03	5.05513e+03	-3.71782e+03	7.56697e+03	-5.89303e+03	1.16714e+04	-7.57807e+03
3.152278	3.14628e+03	-1.89960e+03	5.05513e+03	-3.71782e+03	7.56697e+03	-5.89303e+03	1.16714e+04	-7.57992e+03
3.200783	3.14258e+03	-1.90145e+03	5.05513e+03	-3.71597e+03	7.56697e+03	-5.89303e+03	1.16714e+04	-7.57807e+03
3.24822	3.14258e+03	-1.90515e+03	5.05513e+03	-3.71782e+03	7.56697e+03	-5.89303e+03	1.16714e+04	-7.57992e+03
3.279862	3.14443e+03	-1.89775e+03	5.05513e+03	-3.71967e+03	7.56697e+03	-5.89488e+03	1.16714e+04	-7.57807e+03
3.320655	3.14628e+03	-1.89960e+03	5.05328e+03	-3.71967e+03	7.56697e+03	-5.89488e+03	1.16714e+04	-7.57807e+03
3.353987	3.14813e+03	-1.90145e+03	5.05328e+03	-3.71967e+03	7.56697e+03	-5.89303e+03	1.16714e+04	-7.57807e+03
3.403536	3.14813e+03	-1.89960e+03	5.05328e+03	-3.71967e+03	7.56697e+03	-5.89303e+03	1.16714e+04	-7.57807e+03
3.436438	3.14628e+03	-1.90145e+03	5.05698e+03	-3.71782e+03	7.56697e+03	-5.89303e+03	1.16714e+04	-7.57807e+03
3.488544	3.14443e+03	-1.90145e+03	5.05513e+03	-3.71967e+03	7.56882e+03	-5.89303e+03	1.16714e+04	-7.57807e+03
3.536546	3.14443e+03	-1.89775e+03	5.05698e+03	-3.72152e+03	7.56697e+03	-5.89488e+03	1.16714e+04	-7.57807e+03
3.568629	3.14628e+03	-1.89775e+03	5.05513e+03	-3.71967e+03	7.56697e+03	-5.89303e+03	1.16714e+04	-7.57807e+03
3.616496	3.14443e+03	-1.90330e+03	5.05513e+03	-3.71782e+03	7.56697e+03	-5.89303e+03	1.16714e+04	-7.57807e+03
3.648364	3.14443e+03	-1.90145e+03	5.05513e+03	-3.71782e+03	7.56697e+03	-5.89303e+03	1.16714e+04	-7.57992e+03
3.696552	3.14443e+03	-1.89960e+03	5.05328e+03	-3.72152e+03	7.56697e+03	-5.89303e+03	1.16714e+04	-7.57807e+03
3.72819	3.14813e+03	-1.89960e+03	5.05328e+03	-3.71967e+03	7.56697e+03	-5.89303e+03	1.16714e+04	-7.57807e+03
3.776549	3.14258e+03	-1.89775e+03	5.05328e+03	-3.71967e+03	7.56697e+03	-5.89303e+03	1.16714e+04	-7.57807e+03
3.824563	3.14443e+03	-1.89775e+03	5.05328e+03	-3.71967e+03	7.56697e+03	-5.89303e+03	1.16714e+04	-7.57807e+03
3.855865	3.14258e+03	-1.89775e+03	5.05513e+03	-3.71967e+03	7.56697e+03	-5.89303e+03	1.16714e+04	-7.57807e+03
3.904565	3.14258e+03	-1.89775e+03	5.05513e+03	-3.71967e+03	7.56512e+03	-5.89488e+03	1.16714e+04	-7.57807e+03
3.936179	3.14443e+03	-1.89590e+03	5.05328e+03	-3.71967e+03	7.56697e+03	-5.89488e+03	1.16714e+04	-7.57807e+03
3.984052	3.14443e+03	-1.89960e+03	5.05328e+03	-3.71967e+03	7.56512e+03	-5.89303e+03	1.16714e+04	-7.57992e+03
4.016531	3.14443e+03	-1.89775e+03	5.05328e+03	-3.71967e+03	7.56697e+03	-5.89303e+03	1.16714e+04	-7.57807e+03
4.064393	3.14443e+03	-1.89960e+03	5.05328e+03	-3.71782e+03	7.56697e+03	-5.89303e+03	1.16714e+04	-7.57992e+03
4.112267	3.14813e+03	-1.90145e+03	5.05328e+03	-3.71967e+03	7.56697e+03	-5.89303e+03	1.16714e+04	-7.57807e+03
4.144532	3.14628e+03	-1.89960e+03	5.05328e+03	-3.71967e+03	7.56697e+03	-5.89488e+03	1.16714e+04	-7.57807e+03
4.192055	3.14443e+03	-1.89960e+03	5.05328e+03	-3.71967e+03	7.56697e+03	-5.89488e+03	1.16714e+04	-7.57622e+03
4.22453	3.14628e+03	-1.89960e+03	5.05513e+03	-3.71967e+03	7.56697e+03	-5.89303e+03	1.16714e+04	-7.57807e+03
4.27254	3.14628e+03	-1.90330e+03	5.05328e+03	-3.71782e+03	7.56697e+03	-5.89303e+03	1.16714e+04	-7.57807e+03
4.304534	3.14258e+03	-1.90330e+03	5.05328e+03	-3.71782e+03	7.56882e+03	-5.89303e+03	1.16714e+04	-7.57807e+03
4.351767	3.14258e+03	-1.89960e+03	5.05328e+03	-3.71967e+03	7.56697e+03	-5.89488e+03	1.16714e+04	-7.57807e+03
4.400637	3.13888e+03	-1.89775e+03	5.05513e+03	-3.71967e+03	7.56697e+03	-5.89303e+03	1.16714e+04	-7.57807e+03
4.432539	3.14258e+03	-1.89960e+03	5.05513e+03	-3.71967e+03	7.56697e+03	-5.89303e+03	1.16714e+04	-7.57807e+03
4.480022	3.14258e+03	-1.90145e+03	5.05513e+03	-3.71967e+03	7.56697e+03	-5.89303e+03	1.16714e+04	-7.57992e+03
4.51251	3.14443e+03	-1.89960e+03	5.05513e+03	-3.71967e+03	7.56697e+03	-5.89303e+03	1.16714e+04	-7.57807e+03
4.553843	3.14628e+03	-1.89960e+03	5.05513e+03	-3.71782e+03	7.56697e+03	-5.89303e+03	1.16714e+04	-7.57807e+03
4.587157	3.14628e+03	-1.89960e+03	5.05513e+03	-3.71782e+03	7.56697e+03	-5.89303e+03	1.16714e+04	-7.57992e+03
4.636293	3.14443e+03	-1.89960e+03	5.05328e+03	-3.71782e+03	7.56697e+03	-5.89303e+03	1.16714e+04	-7.57807e+03
4.687117	3.14628e+03	-1.90145e+03	5.05513e+03	-3.71782e+03	7.56697e+03	-5.89303e+03	1.16714e+04	-7.57807e+03
4.7205	3.14443e+03	-1.90145e+03	5.05513e+03	-3.71782e+03	7.56697e+03	-5.89303e+03	1.16714e+04	-7.57807e+03
4.768242	3.14258e+03	-1.89775e+03	5.05513e+03	-3.71782e+03	7.56697e+03	-5.89303e+03	1.16714e+04	-7.57807e+03
4.798069	3.14443e+03	-1.89960e+03	5.05513e+03	-3.71967e+03	7.56697e+03	-5.89488e+03	1.16714e+04	-7.57807e+03
4.848528	3.14628e+03	-1.90145e+03	5.05143e+03	-3.72152e+03	7.56697e+03	-5.89488e+03	1.16714e+04	-7.57807e+03
4.87074	3.14258e+03	-1.90145e+03	5.05143e+03	-3.71782e+03	7.56697e+03	-5.89303e+03	1.16714e+04	-7.57807e+03
4.92051	3.14628e+03	-1.89775e+03	5.05328e+03	-3.71967e+03	7.56697e+03	-5.89303e+03	1.16714e+04	-7.57807e+03
4.969569	3.14813e+03	-1.89775e+03	5.05328e+03	-3.71967e+03	7.56512e+03	-5.89488e+03	1.16714e+04	-7.57992e+03
5.008002	3.14443e+03	-1.89590e+03	5.05328e+03	-3.71782e+03	7.56512e+03	-5.89488e+03	1.16714e+04	-7.57992e+03
5.052849	3.14443e+03	-1.89590e+03	5.05513e+03	-3.71597e+03	7.56512e+03	-5.89303e+03	1.16714e+04	-7.57992e+03
5.087204	3.14443e+03	-1.89775e+03	5.05328e+03	-3.72152e+03	7.56512e+03	-5.89303e+03	1.16714e+04	-7.57992e+03
5.136533	3.14628e+03	-1.89960e+03	5.05143e+03	-3.71967e+03	7.56697e+03	-5.89303e+03	1.16714e+04	-7.57807e+03
5.16852	3.14628e+03	-1.90145e+03	5.05143e+03	-3.71967e+03	7.56697e+03	-5.89303e+03	1.16714e+04	-7.57807e+03
5.20803	3.14258e+03	-1.89960e+03	5.05328e+03	-3.71782e+03	7.56697e+03	-5.89303e+03	1.16714e+04	-7.57992e+03
5.264264	3.14258e+03	-1.89775e+03	5.05328e+03	-3.71597e+03	7.56697e+03	-5.89303e+03	1.16714e+04	-7.57992e+03
5.287092	3.14258e+03	-1.89960e+03	5.05513e+03	-3.71967e+03	7.56697e+03	-5.89303e+03	1.16714e+04	-7.57807e+03
5.337183	3.14443e+03	-1.89960e+03	5.05513e+03	-3.71782e+03	7.56697e+03	-5.89303e+03	1.16714e+04	-7.57807e+03
5.371474	3.14443e+03	-1.89590e+03	5.05143e+03	-3.71782e+03	7.56697e+03	-5.89488e+03	1.16714e+04	-7.57807e+03
5.420521	3.14628e+03	-1.89405e+03	5.05143e+03	-3.71782e+03	7.56697e+03	-5.89303e+03	1.16714e+04	-7.57992e+03
5.452783	3.14443e+03	-1.89775e+03	5.05143e+03	-3.71782e+03	7.56697e+03	-5.89118e+03	1.16714e+04	-7.57807e+03
5.504524	3.14258e+03	-1.89775e+03	5.05328e+03	-3.71967e+03	7.56697e+03	-5.89303e+03	1.16714e+04	-7.57807e+03
5.551856	3.14258e+03	-1.89960e+03	5.05513e+03	-3.71967e+03	7.56697e+03	-5.89303e+03	1.16714e+04	-7.57992e+03
5.580475	3.14258e+03	-1.89960e+03	5.05328e+03	-3.71782e+03	7.56697e+03	-5.89488e+03	1.16714e+04	-7.57807e+03
5.631986	3.14443e+03	-1.89775e+03	5.05328e+03	-3.71782e+03	7.56697e+03	-5.89303e+03	1.16714e+04	-7.57992e+03
5.664516	3.14443e+03	-1.89960e+03	5.05328e+03	-3.72152e+03	7.56512e+03	-5.89488e+03	1.16714e+04	-7.57807e+03
5.708407	3.14628e+03	-1.89960e+03	5.05328e+03	-3.71967e+03	7.56512e+03	-5.89488e+03	1.16714e+04	-7.57807e+03
5.737088	3.14443e+03	-1.90330e+03	5.05328e+03	-3.71782e+03	7.56512e+03	-5.89488e+03	1.16695e+04	-7.57992e+03
5.786179	3.14628e+03	-1.90145e+03	5.05513e+03	-3.71782e+03	7.56512e+03	-5.89488e+03	1.16714e+04	-7.57992e+03
5.837304	3.14443e+03	-1.90145e+03	5.05698e+03	-3.71782e+03	7.56512e+03	-5.89303e+03	1.16714e+04	-7.57992e+03
5.870476	3.14258e+03	-1.89775e+03	5.05513e+03	-3.71967e+03	7.56512e+03	-5.89303e+03	1.16714e+04	-7.57807e+03
5.920527	3.14628e+03	-1.89590e+03	5.05328e+03	-3.72152e+03	7.56512e+03	-5.89488e+03	1.16695e+04	-7.57807e+03
5.951749	3.14628e+03	-1.89960e+03	5.05143e+03	-3.71782e+03	7.56512e+03	-5.89303e+03	1.16714e+04	-7.57807e+03
5.999196	3.14258e+03	-1.90145e+03	5.05143e+03	-3.71782e+03	7.56512e+03	-5.89303e+03	1.16714e+04	-7.57992e+03
6.032506	3.14443e+03	-1.90145e+03	5.05143e+03	-3.71782e+03	7.56512e+03	-5.89303e+03	1.16695e+04	-7.57992e+03
6.080581	3.14628e+03	-1.89775e+03	5.05328e+03	-3.71782e+03	7.56512e+03	-5.89303e+03	1.16714e+04	-7.57992e+03
6.119422	3.14628e+03	-1.89775e+03	5.05513e+03	-3.71782e+03	7.56512e+03	-5.89303e+03	1.16714e+04	-7.57992e+03
6.152722	3.14443e+03	-1.89775e+03	5.05328e+03	-3.71967e+03	7.56512e+03	-5.89303e+03	1.16714e+04	-7.57992e+03
6.207898	3.14628e+03	-1.89960e+03	5.05328e+03	-3.71782e+03	7.56512e+03	-5.89303e+03	1.16714e+04	-7.57992e+03
6.237083	3.14443e+03	-1.89960e+03	5.05328e+03	-3.71967e+03	7.56512e+03	-5.89488e+03	1.16714e+04	-7.57807e+03
6.286133	3.14443e+03	-1.89960e+03	5.05328e+03	-3.71782e+03	7.56512e+03	-5.89488e+03	1.16714e+04	-7.57992e+03
6.320505	3.14628e+03	-1.90145e+03	5.05143e+03	-3.71782e+03	7.56512e+03	-5.89303e+03	1.16714e+04	-7.57992e+03
6.368398	3.14443e+03	-1.90145e+03	5.05328e+03	-3.71782e+03	7.56697e+03	-5.89488e+03	1.16714e+04	-7.57807e+03
6.416528	3.14628e+03	-1.89960e+03	5.05143e+03	-3.72152e+03	7.56512e+03	-5.89488e+03	1.16714e+04	-7.57992e+03
6.443862	3.14443e+03	-1.89960e+03	5.05143e+03	-3.71782e+03	7.56512e+03	-5.89303e+03	1.16714e+04	-7.57807e+03
6.496222	3.14443e+03	-1.89775e+03	5.05328e+03	-3.71967e+03	7.56512e+03	-5.89303e+03	1.16714e+04	-7.57992e+03
6.520438	3.14258e+03	-1.89960e+03	5.05513e+03	-3.71782e+03	7.56512e+03	-5.89303e+03	1.16714e+04	-7.57992e+03
6.575687	3.14443e+03	-1.90145e+03	5.05328e+03	-3.71782e+03	7.56512e+03	-5.89303e+03	1.16714e+04	-7.57807e+03
6.608342	3.14628e+03	-1.90145e+03	5.05328e+03	-3.71782e+03	7.56512e+03	-5.89303e+03	1.16714e+04	-7.57992e+03
6.653841	3.14443e+03	-1.89960e+03	5.05328e+03	-3.71782e+03	7.56512e+03	-5.89488e+03	1.16714e+04	-7.57992e+03
6.704495	3.14073e+03	-1.89775e+03	5.05328e+03	-3.71782e+03	7.56697e+03	-5.89303e+03	1.16714e+04	-7.57992e+03
6.736028	3.14258e+03	-1.89590e+03	5.05328e+03	-3.71782e+03	7.56512e+03	-5.89303e+03	1.16714e+04	-7.57992e+03
6.780325	3.14443e+03	-1.89405e+03	5.05143e+03	-3.71782e+03	7.56512e+03	-5.89488e+03	1.16714e+04	-7.57992e+03
6.816497	3.14628e+03	-1.89960e+03	5.04958e+03	-3.71597e+03	7.56512e+03	-5.89488e+03	1.16714e+04	-7.57992e+03
6.864214	3.14258e+03	-1.90145e+03	5.05328e+03	-3.71597e+03	7.56512e+03	-5.89303e+03	1.16714e+04	-7.58177e+03
6.886857	3.14073e+03	-1.90145e+03	5.05328e+03	-3.71782e+03	7.56512e+03	-5.89303e+03	1.16714e+04	-7.57992e+03
6.935934	3.14628e+03	-1.90145e+03	5.05328e+03	-3.71782e+03	7.56512e+03	-5.89303e+03	1.16714e+04	-7.57992e+03
6.98592	3.14628e+03	-1.89775e+03	5.05143e+03	-3.71967e+03	7.56512e+03	-5.89488e+03	1.16714e+04	-7.57992e+03
7.021464	3.14628e+03	-1.89775e+03	5.05143e+03	-3.71967e+03	7.56512e+03	-5.89488e+03	1.16714e+04	-7.57992e+03
7.069375	3.14443e+03	-1.89590e+03	5.05328e+03	-3.71967e+03	7.56512e+03	-5.89303e+03	1.16714e+04	-7.57992e+03
7.10265	3.14258e+03	-1.89775e+03	5.05328e+03	-3.72152e+03	7.56512e+03	-5.89488e+03	1.16695e+04	-7.57992e+03
7.152622	3.14443e+03	-1.89590e+03	5.05328e+03	-3.71967e+03	7.56512e+03	-5.89488e+03	1.16714e+04	-7.57992e+03
7.179463	3.14628e+03	-1.89590e+03	5.05328e+03	-3.71782e+03	7.56512e+03	-5.89488e+03	1.16714e+04	-7.57992e+03
7.232287	3.14628e+03	-1.89590e+03	5.05328e+03	-3.71967e+03	7.56512e+03	-5.89488e+03	1.16714e+04	-7.57992e+03
7.263902	3.14628e+03	-1.89775e+03	5.05513e+03	-3.71967e+03	7.56512e+03	-5.89303e+03	1.16714e+04	-7.57992e+03
7.309114	3.14628e+03	-1.89775e+03	5.05143e+03	-3.71967e+03	7.56512e+03	-5.89488e+03	1.16714e+04	-7.57992e+03
7.353611	3.14628e+03	-1.89960e+03	5.05328e+03	-3.71967e+03	7.56512e+03	-5.89488e+03	1.16714e+04	-7.57992e+03
7.385977	3.14443e+03	-1.90330e+03	5.05328e+03	-3.71782e+03	7.56697e+03	-5.89303e+03	1.16714e+04	-7.57992e+03
7.437923	3.14628e+03	-1.89775e+03	5.05513e+03	-3.71782e+03	7.56697e+03	-5.89303e+03	1.16714e+04	-7.57992e+03
7.472467	3.14443e+03	-1.89775e+03	5.05328e+03	-3.71782e+03	7.56512e+03	-5.89488e+03	1.16714e+04	-7.57992e+03
7.519208	3.14443e+03	-1.89960e+03	5.05143e+03	-3.71782e+03	7.56512e+03	-5.89488e+03	1.16714e+04	-7.57807e+03
7.551909	3.14443e+03	-1.89960e+03	5.05143e+03	-3.71782e+03	7.56512e+03	-5.89303e+03	1.16714e+04	-7.57992e+03
7.598017	3.14443e+03	-1.89960e+03	5.05328e+03	-3.71782e+03	7.56512e+03	-5.89488e+03	1.16714e+04	-7.57992e+03
7.648486	3.14628e+03	-1.89775e+03	5.05513e+03	-3.71967e+03	7.56697e+03	-5.89488e+03	1.16714e+04	-7.57992e+03
7.68035	3.14443e+03	-1.89775e+03	5.05513e+03	-3.71782e+03	7.56512e+03	-5.89488e+03	1.16714e+04	-7.57992e+03
7.720263	3.14443e+03	-1.89775e+03	5.05143e+03	-3.71782e+03	7.56512e+03	-5.89488e+03	1.16714e+04	-7.57992e+03
7.752567	3.14443e+03	-1.89960e+03	5.05143e+03	-3.71967e+03	7.56512e+03	-5.89303e+03	1.16714e+04	-7.57807e+03
7.803607	3.14443e+03	-1.89960e+03	5.05513e+03	-3.71967e+03	7.56327e+03	-5.89488e+03	1.16714e+04	-7.57992e+03
7.836885	3.14628e+03	-1.89775e+03	5.05328e+03	-3.71967e+03	7.56512e+03	-5.89488e+03	1.16714e+04	-7.57992e+03
7.885906	3.14628e+03	-1.89960e+03	5.05143e+03	-3.71967e+03	7.56512e+03	-5.89488e+03	1.16714e+04	-7.57992e+03
7.936476	3.14628e+03	-1.89590e+03	5.05143e+03	-3.71782e+03	7.56512e+03	-5.89488e+03	1.16714e+04	-7.57992e+03
7.96841	3.14443e+03	-1.89775e+03	5.05513e+03	-3.71967e+03	7.56512e+03	-5.89488e+03	1.16714e+04	-7.58177e+03
8.010698	3.14443e+03	-1.89775e+03	5.05143e+03	-3.71782e+03	7.56512e+03	-5.89673e+03	1.16714e+04	-7.57992e+03
8.045179	3.14628e+03	-1.89775e+03	5.05143e+03	-3.71967e+03	7.56512e+03	-5.89488e+03	1.16714e+04	-7.57992e+03
8.096051	3.14628e+03	-1.89775e+03	5.05143e+03	-3.71782e+03	7.56512e+03	-5.89488e+03	1.16714e+04	-7.57992e+03
8.121242	3.14443e+03	-1.89960e+03	5.05143e+03	-3.71782e+03	7.56697e+03	-5.89303e+03	1.16714e+04	-7.57992e+03
8.170169	3.14443e+03	-1.90145e+03	5.04958e+03	-3.71782e+03	7.56512e+03	-5.89488e+03	1.16714e+04	-7.57992e+03
8.220273	3.14443e+03	-1.89960e+03	5.05143e+03	-3.71967e+03	7.56697e+03	-5.89488e+03	1.16714e+04	-7.57992e+03
8.252598	3.14258e+03	-1.89775e+03	5.05143e+03	-3.71967e+03	7.56697e+03	-5.89488e+03	1.16714e+04	-7.57992e+03
8.304478	3.14258e+03	-1.89590e+03	5.05143e+03	-3.71967e+03	7.56697e+03	-5.89488e+03	1.16714e+04	-7.57992e+03
8.335799	3.14443e+03	-1.90145e+03	5.05513e+03	-3.71782e+03	7.56697e+03	-5.89488e+03	1.16714e+04	-7.57992e+03
8.381341	3.14443e+03	-1.90145e+03	5.05513e+03	-3.71597e+03	7.56697e+03	-5.89303e+03	1.16714e+04	-7.57992e+03
8.410778	3.14443e+03	-1.89960e+03	5.05513e+03	-3.71597e+03	7.56697e+03	-5.89488e+03	1.16714e+04	-7.57807e+03
8.46448	3.14443e+03	-1.89960e+03	5.05328e+03	-3.71782e+03	7.56697e+03	-5.89488e+03	1.16714e+04	-7.57992e+03
8.50975	3.14628e+03	-1.89775e+03	5.05143e+03	-3.71782e+03	7.56512e+03	-5.89488e+03	1.16714e+04	-7.57992e+03
8.536706	3.14628e+03	-1.89775e+03	5.05143e+03	-3.71597e+03	7.56512e+03	-5.89488e+03	1.16714e+04	-7.57992e+03
8.585894	3.14443e+03	-1.90145e+03	5.05328e+03	-3.71782e+03	7.56327e+03	-5.89488e+03	1.16714e+04	-7.57992e+03
8.619139	3.14628e+03	-1.89775e+03	5.05143e+03	-3.71967e+03	7.56512e+03	-5.89488e+03	1.16714e+04	-7.57992e+03
8.670134	3.14258e+03	-1.89590e+03	5.05143e+03	-3.71597e+03	7.56697e+03	-5.89488e+03	1.16714e+04	-7.57992e+03
8.704459	3.14258e+03	-1.89775e+03	5.04958e+03	-3.71782e+03	7.56512e+03	-5.89488e+03	1.16714e+04	-7.57992e+03
8.75246	3.14813e+03	-1.89775e+03	5.05143e+03	-3.71782e+03	7.56512e+03	-5.89488e+03	1.16714e+04	-7.57992e+03
8.800464	3.14443e+03	-1.89590e+03	5.05328e+03	-3.71412e+03	7.56512e+03	-5.89303e+03	1.16714e+04	-7.57992e+03
8.832476	3.14258e+03	-1.89590e+03	5.05328e+03	-3.71782e+03	7.56512e+03	-5.89303e+03	1.16714e+04	-7.58177e+03
8.880363	3.14443e+03	-1.89775e+03	5.05328e+03	-3.71782e+03	7.56512e+03	-5.89303e+03	1.16714e+04	-7.58177e+03
8.912465	3.14258e+03	-1.89775e+03	5.05143e+03	-3.71597e+03	7.56512e+03	-5.89488e+03	1.16714e+04	-7.58177e+03
8.952515	3.14258e+03	-1.89775e+03	5.05143e+03	-3.71782e+03	7.56327e+03	-5.89488e+03	1.16714e+04	-7.58177e+03
8.985511	3.14443e+03	-1.89775e+03	5.05143e+03	-3.71782e+03	7.56512e+03	-5.89488e+03	1.16714e+04	-7.58177e+03
9.036764	3.14628e+03	-1.89775e+03	5.05143e+03	-3.71782e+03	7.56512e+03	-5.89488e+03	1.16714e+04	-7.57992e+03
9.085723	3.14628e+03	-1.89590e+03	5.05143e+03	-3.71597e+03	7.56512e+03	-5.89303e+03	1.16714e+04	-7.57992e+03
9.120471	3.14628e+03	-1.89590e+03	5.05513e+03	-3.71782e+03	7.56512e+03	-5.89673e+03	1.16714e+04	-7.57992e+03
9.168085	3.14628e+03	-1.89775e+03	5.05143e+03	-3.71782e+03	7.56697e+03	-5.89488e+03	1.16714e+04	-7.57992e+03
9.197847	3.14258e+03	-1.89960e+03	5.05143e+03	-3.71782e+03	7.56512e+03	-5.89488e+03	1.16714e+04	-7.58177e+03
9.248446	3.14258e+03	-1.89775e+03	5.05513e+03	-3.71967e+03	7.56512e+03	-5.89488e+03	1.16714e+04	-7.57992e+03
9.275142	3.14443e+03	-1.89960e+03	5.05328e+03	-3.71967e+03	7.56697e+03	-5.89488e+03	1.16714e+04	-7.57992e+03
9.319065	3.14628e+03	-1.89960e+03	5.05328e+03	-3.71782e+03	7.56512e+03	-5.89488e+03	1.16714e+04	-7.57992e+03
9.369041	3.14813e+03	-1.89775e+03	5.05513e+03	-3.71782e+03	7.56697e+03	-5.89488e+03	1.16714e+04	-7.57992e+03
9.402383	3.14258e+03	-1.89775e+03	5.05328e+03	-3.71967e+03	7.56512e+03	-5.89488e+03	1.16714e+04	-7.57992e+03
9.452354	3.14443e+03	-1.89775e+03	5.05328e+03	-3.71782e+03	7.56512e+03	-5.89488e+03	1.16714e+04	-7.57992e+03
9.485757	3.14443e+03	-1.89590e+03	5.05513e+03	-3.71782e+03	7.56512e+03	-5.89488e+03	1.16714e+04	-7.57992e+03
9.536458	3.14628e+03	-1.89960e+03	5.05328e+03	-3.71967e+03	7.56512e+03	-5.89488e+03	1.16714e+04	-7.57992e+03
9.567886	3.14628e+03	-1.89775e+03	5.05143e+03	-3.71782e+03	7.56512e+03	-5.89303e+03	1.16714e+04	-7.57992e+03
9.613196	3.14443e+03	-1.89590e+03	5.05328e+03	-3.71782e+03	7.56512e+03	-5.89303e+03	1.16714e+04	-7.57992e+03
9.664449	3.14628e+03	-1.89405e+03	5.05143e+03	-3.71967e+03	7.56697e+03	-5.89303e+03	1.16714e+04	-7.57992e+03
9.686706	3.14628e+03	-1.89590e+03	5.04958e+03	-3.72152e+03	7.56512e+03	-5.89488e+03	1.16714e+04	-7.57992e+03
9.73572	3.14443e+03	-1.89960e+03	5.05143e+03	-3.71782e+03	7.56697e+03	-5.89303e+03	1.16714e+04	-7.57992e+03
9.769045	3.14258e+03	-1.90145e+03	5.05143e+03	-3.71597e+03	7.56512e+03	-5.89118e+03	1.16714e+04	-7.57992e+03
9.820026	3.14443e+03	-1.89590e+03	5.05143e+03	-3.71782e+03	7.56512e+03	-5.89303e+03	1.16714e+04	-7.58177e+03
9.85646	3.14628e+03	-1.89775e+03	5.05328e+03	-3.71782e+03	7.56512e+03	-5.89488e+03	1.16714e+04	-7.57807e+03
9.902321	3.14628e+03	-1.89960e+03	5.05328e+03	-3.71782e+03	7.56512e+03	-5.89303e+03	1.16714e+04	-7.57992e+03
9.952337	3.14628e+03	-1.89775e+03	5.05328e+03	-3.71782e+03	7.56512e+03	-5.89303e+03	1.16714e+04	-7.57992e+03
9.981184	3.14443e+03	-1.89775e+03	5.05698e+03	-3.71782e+03	7.56512e+03	-5.89488e+03	1.16714e+04	-7.57807e+03
10.032125	3.14443e+03	-1.90330e+03	5.05513e+03	-3.71782e+03	7.56512e+03	-5.89488e+03	1.16714e+04	-7.57992e+03
10.064442	3.14443e+03	-1.89775e+03	5.05513e+03	-3.71782e+03	7.56512e+03	-5.89488e+03	1.16714e+04	-7.57992e+03
10.112457	3.14443e+03	-1.89775e+03	5.05143e+03	-3.71967e+03	7.56512e+03	-5.89488e+03	1.16714e+04	-7.57992e+03
10.136635	3.14628e+03	-1.89775e+03	5.04958e+03	-3.71782e+03	7.56512e+03	-5.89488e+03	1.16714e+04	-7.58177e+03
10.186594	3.14628e+03	-1.89775e+03	5.05513e+03	-3.71782e+03	7.56512e+03	-5.89488e+03	1.16714e+04	-7.57992e+03
10.235616	3.14443e+03	-1.89775e+03	5.05143e+03	-3.71782e+03	7.56512e+03	-5.89488e+03	1.16714e+04	-7.57992e+03
10.268999	3.14443e+03	-1.89775e+03	5.05143e+03	-3.71967e+03	7.56697e+03	-5.89488e+03	1.16714e+04	-7.57992e+03
10.320448	3.14628e+03	-1.89960e+03	5.05328e+03	-3.71967e+03	7.56697e+03	-5.89303e+03	1.16714e+04	-7.57992e+03
10.352319	3.14813e+03	-1.90145e+03	5.05328e+03	-3.71967e+03	7.56512e+03	-5.89488e+03	1.16714e+04	-7.57807e+03
10.400447	3.14628e+03	-1.90145e+03	5.05143e+03	-3.71967e+03	7.56697e+03	-5.89303e+03	1.16714e+04	-7.57992e+03
10.432111	3.14628e+03	-1.89960e+03	5.05328e+03	-3.71782e+03	7.56697e+03	-5.89488e+03	1.16714e+04	-7.57992e+03
10.480111	3.14628e+03	-1.89775e+03	5.05328e+03	-3.71782e+03	7.56697e+03	-5.89488e+03	1.16714e+04	-7.57992e+03
10.519961	3.14628e+03	-1.89960e+03	5.05328e+03	-3.71967e+03	7.56697e+03	-5.89488e+03	1.16714e+04	-7.57992e+03
10.553292	3.14628e+03	-1.89960e+03	5.05328e+03	-3.71967e+03	7.56512e+03	-5.89303e+03	1.16714e+04	-7.57992e+03
10.604723	3.14443e+03	-1.89960e+03	5.05328e+03	-3.71782e+03	7.56512e+03	-5.89488e+03	1.16714e+04	-7.57992e+03
10.635915	3.14443e+03	-1.89590e+03	5.05513e+03	-3.71967e+03	7.56512e+03	-5.89488e+03	1.16714e+04	-7.57992e+03
10.686389	3.14258e+03	-1.89775e+03	5.05328e+03	-3.71967e+03	7.56512e+03	-5.89488e+03	1.16714e+04	-7.57992e+03
10.720411	3.14443e+03	-1.89960e+03	5.05328e+03	-3.71967e+03	7.56512e+03	-5.89488e+03	1.16714e+04	-7.57992e+03
10.76794	3.14258e+03	-1.89405e+03	5.05328e+03	-3.71967e+03	7.56512e+03	-5.89488e+03	1.16714e+04	-7.57992e+03
10.812	3.14443e+03	-1.89590e+03	5.05513e+03	-3.71597e+03	7.56697e+03	-5.89303e+03	1.16714e+04	-7.57992e+03
10.848432	3.14628e+03	-1.89590e+03	5.05513e+03	-3.71782e+03	7.56697e+03	-5.89303e+03	1.16714e+04	-7.57992e+03
10.88656	3.14628e+03	-1.89590e+03	5.05143e+03	-3.71967e+03	7.56512e+03	-5.89488e+03	1.16714e+04	-7.57992e+03
10.919921	3.14628e+03	-1.89960e+03	5.05143e+03	-3.71782e+03	7.56512e+03	-5.89488e+03	1.16714e+04	-7.57992e+03
10.969017	3.14628e+03	-1.90145e+03	5.05328e+03	-3.71782e+03	7.56512e+03	-5.89673e+03	1.16714e+04	-7.57807e+03
11.002262	3.14258e+03	-1.89960e+03	5.05328e+03	-3.71967e+03	7.56512e+03	-5.89488e+03	1.16714e+04	-7.57992e+03
11.053227	3.14258e+03	-1.89960e+03	5.05143e+03	-3.71967e+03	7.56697e+03	-5.89488e+03	1.16714e+04	-7.57992e+03
11.104439	3.14443e+03	-1.90330e+03	5.05143e+03	-3.71782e+03	7.56512e+03	-5.89488e+03	1.16714e+04	-7.57992e+03
11.136438	3.14443e+03	-1.89960e+03	5.05328e+03	-3.71967e+03	7.56512e+03	-5.89488e+03	1.16714e+04	-7.57992e+03
11.184555	3.14443e+03	-1.89590e+03	5.05513e+03	-3.71782e+03	7.56697e+03	-5.89488e+03	1.16714e+04	-7.58177e+03
11.212843	3.14443e+03	-1.89775e+03	5.05328e+03	-3.71782e+03	7.56697e+03	-5.89303e+03	1.16714e+04	-7.57992e+03
11.264426	3.14628e+03	-1.89775e+03	5.05328e+03	-3.71967e+03	7.56512e+03	-5.89488e+03	1.16714e+04	-7.57992e+03
11.295676	3.14628e+03	-1.89775e+03	5.05328e+03	-3.71782e+03	7.56512e+03	-5.89303e+03	1.16714e+04	-7.57992e+03
11.336547	3.14443e+03	-1.89775e+03	5.05143e+03	-3.71597e+03	7.56512e+03	-5.89488e+03	1.16714e+04	-7.57992e+03
11.385491	3.14443e+03	-1.89960e+03	5.05328e+03	-3.71782e+03	7.56512e+03	-5.89303e+03	1.16714e+04	-7.57992e+03
11.424443	3.14443e+03	-1.89960e+03	5.05328e+03	-3.71782e+03	7.56697e+03	-5.89488e+03	1.16714e+04	-7.57992e+03
11.468827	3.14443e+03	-1.89960e+03	5.05328e+03	-3.71967e+03	7.56512e+03	-5.89488e+03	1.16714e+04	-7.57992e+03
11.502225	3.14258e+03	-1.89775e+03	5.05328e+03	-3.71597e+03	7.56512e+03	-5.89303e+03	1.16714e+04	-7.57992e+03
11.552421	3.14258e+03	-1.89775e+03	5.05143e+03	-3.71412e+03	7.56512e+03	-5.89488e+03	1.16714e+04	-7.57992e+03
11.584532	3.14258e+03	-1.90145e+03	5.05143e+03	-3.71782e+03	7.56512e+03	-5.89488e+03	1.16714e+04	-7.57992e+03
11.630208	3.14443e+03	-1.89960e+03	5.05143e+03	-3.71967e+03	7.56512e+03	-5.89488e+03	1.16714e+04	-7.57992e+03
11.664426	3.14443e+03	-1.90145e+03	5.04958e+03	-3.71967e+03	7.56512e+03	-5.89488e+03	1.16714e+04	-7.57992e+03
11.712401	3.14443e+03	-1.89775e+03	5.05143e+03	-3.72152e+03	7.56512e+03	-5.89673e+03	1.16714e+04	-7.57992e+03
11.753028	3.14443e+03	-1.89775e+03	5.05143e+03	-3.71967e+03	7.56512e+03	-5.89673e+03	1.16714e+04	-7.57992e+03
11.786461	3.14258e+03	-1.90145e+03	5.05143e+03	-3.71782e+03	7.56512e+03	-5.89488e+03	1.16714e+04	-7.57992e+03
11.835501	3.14628e+03	-1.90145e+03	5.05143e+03	-3.71967e+03	7.56512e+03	-5.89673e+03	1.16714e+04	-7.57992e+03
11.868832	3.14628e+03	-1.89775e+03	5.05328e+03	-3.71597e+03	7.56512e+03	-5.89488e+03	1.16714e+04	-7.57992e+03
11.920408	3.14813e+03	-1.89590e+03	5.04958e+03	-3.71597e+03	7.56512e+03	-5.89673e+03	1.16695e+04	-7.57992e+03
11.952175	3.14628e+03	-1.89590e+03	5.04958e+03	-3.71597e+03	7.56512e+03	-5.89488e+03	1.16714e+04	-7.57992e+03
11.997806	3.14258e+03	-1.89775e+03	5.05328e+03	-3.71782e+03	7.56512e+03	-5.89488e+03	1.16695e+04	-7.57992e+03
12.048517	3.14258e+03	-1.89775e+03	5.05328e+03	-3.71782e+03	7.56512e+03	-5.89488e+03	1.16714e+04	-7.57992e+03
12.080386	3.14258e+03	-1.89775e+03	5.04958e+03	-3.72152e+03	7.56512e+03	-5.89303e+03	1.16714e+04	-7.57992e+03
12.119799	3.14443e+03	-1.89775e+03	5.05143e+03	-3.71782e+03	7.56512e+03	-5.89488e+03	1.16714e+04	-7.57992e+03
12.152128	3.14443e+03	-1.89775e+03	5.05143e+03	-3.71782e+03	7.56512e+03	-5.89488e+03	1.16714e+04	-7.57992e+03
12.20329	3.14628e+03	-1.89775e+03	5.05328e+03	-3.71782e+03	7.56512e+03	-5.89488e+03	1.16714e+04	-7.58177e+03
12.235439	3.14628e+03	-1.89960e+03	5.05328e+03	-3.71597e+03	7.56512e+03	-5.89488e+03	1.16714e+04	-7.57992e+03
12.286431	3.14813e+03	-1.89960e+03	5.05328e+03	-3.71782e+03	7.56512e+03	-5.89303e+03	1.16714e+04	-7.57992e+03
12.336412	3.14628e+03	-1.89960e+03	5.05143e+03	-3.71782e+03	7.56512e+03	-5.89488e+03	1.16714e+04	-7.58177e+03
12.367749	3.14628e+03	-1.89775e+03	5.05328e+03	-3.71597e+03	7.56512e+03	-5.89303e+03	1.16695e+04	-7.57992e+03
12.414632	3.14443e+03	-1.89775e+03	5.05143e+03	-3.71597e+03	7.56512e+03	-5.89303e+03	1.16714e+04	-7.58177e+03
12.448417	3.14258e+03	-1.89960e+03	5.05143e+03	-3.71597e+03	7.56512e+03	-5.89303e+03	1.16714e+04	-7.57992e+03
12.49642	3.14258e+03	-1.89775e+03	5.05143e+03	-3.71782e+03	7.56512e+03	-5.89303e+03	1.16714e+04	-7.57992e+03
12.519733	3.14443e+03	-1.89775e+03	5.04958e+03	-3.71782e+03	7.56512e+03	-5.89303e+03	1.16695e+04	-7.58177e+03
12.569808	3.14628e+03	-1.89405e+03	5.05328e+03	-3.71782e+03	7.56512e+03	-5.89488e+03	1.16714e+04	-7.57992e+03
12.619738	3.14443e+03	-1.89405e+03	5.05328e+03	-3.71782e+03	7.56512e+03	-5.89488e+03	1.16714e+04	-7.57992e+03
12.653076	3.14443e+03	-1.89960e+03	5.05143e+03	-3.71782e+03	7.56327e+03	-5.89488e+03	1.16695e+04	-7.57992e+03
12.704403	3.14628e+03	-1.89960e+03	5.05328e+03	-3.71782e+03	7.56327e+03	-5.89488e+03	1.16714e+04	-7.57992e+03
12.735743	3.14628e+03	-1.89960e+03	5.05328e+03	-3.71782e+03	7.56512e+03	-5.89488e+03	1.16714e+04	-7.57992e+03
12.783917	3.14628e+03	-1.90145e+03	5.05143e+03	-3.71967e+03	7.56327e+03	-5.89488e+03	1.16714e+04	-7.58177e+03
12.815098	3.14628e+03	-1.89960e+03	5.05328e+03	-3.71967e+03	7.56512e+03	-5.89488e+03	1.16714e+04	-7.57992e+03
12.863448	3.14628e+03	-1.90145e+03	5.05143e+03	-3.71597e+03	7.56512e+03	-5.89488e+03	1.16714e+04	-7.57992e+03
12.912106	3.14443e+03	-1.89775e+03	5.05143e+03	-3.71782e+03	7.56512e+03	-5.89673e+03	1.16695e+04	-7.57992e+03
12.935365	3.14628e+03	-1.89590e+03	5.05143e+03	-3.71782e+03	7.56512e+03	-5.89488e+03	1.16714e+04	-7.57992e+03
12.985405	3.14258e+03	-1.89775e+03	5.05328e+03	-3.71782e+03	7.56512e+03	-5.89303e+03	1.16695e+04	-7.57992e+03
13.019692	3.14443e+03	-1.90145e+03	5.05143e+03	-3.71967e+03	7.56512e+03	-5.89488e+03	1.16695e+04	-7.57992e+03
13.068681	3.14258e+03	-1.90145e+03	5.05328e+03	-3.71782e+03	7.56512e+03	-5.89303e+03	1.16695e+04	-7.58177e+03
13.102944	3.14073e+03	-1.89775e+03	5.05143e+03	-3.71782e+03	7.56512e+03	-5.89303e+03	1.16695e+04	-7.57992e+03
13.152386	3.14628e+03	-1.89960e+03	5.04773e+03	-3.71967e+03	7.56327e+03	-5.89488e+03	1.16695e+04	-7.57992e+03
13.19745	3.14628e+03	-1.90145e+03	5.04958e+03	-3.71967e+03	7.56327e+03	-5.89488e+03	1.16695e+04	-7.57992e+03
13.230779	3.14258e+03	-1.89775e+03	5.05143e+03	-3.71782e+03	7.56512e+03	-5.89488e+03	1.16695e+04	-7.57992e+03
13.279818	3.14443e+03	-1.89775e+03	5.05143e+03	-3.71782e+03	7.56327e+03	-5.89488e+03	1.16695e+04	-7.57992e+03
13.31218	3.14813e+03	-1.89590e+03	5.05143e+03	-3.71782e+03	7.56512e+03	-5.89488e+03	1.16695e+04	-7.57992e+03
13.352005	3.14628e+03	-1.89590e+03	5.05143e+03	-3.71782e+03	7.56327e+03	-5.89488e+03	1.16695e+04	-7.57992e+03
13.385353	3.14443e+03	-1.89775e+03	5.05143e+03	-3.71782e+03	7.56327e+03	-5.89488e+03	1.16695e+04	-7.57992e+03
13.435357	3.14443e+03	-1.89590e+03	5.04958e+03	-3.71597e+03	7.56327e+03	-5.89488e+03	1.16695e+04	-7.58177e+03
13.485328	3.14443e+03	-1.89775e+03	5.04958e+03	-3.71782e+03	7.56327e+03	-5.89488e+03	1.16695e+04	-7.57992e+03
13.51965	3.14628e+03	-1.89960e+03	5.04958e+03	-3.71782e+03	7.56327e+03	-5.89488e+03	1.16714e+04	-7.58177e+03
13.567647	3.14443e+03	-1.90145e+03	5.05143e+03	-3.71597e+03	7.56327e+03	-5.89488e+03	1.16695e+04	-7.57992e+03
13.592083	3.14443e+03	-1.89960e+03	5.04958e+03	-3.71597e+03	7.56327e+03	-5.89488e+03	1.16695e+04	-7.58177e+03
13.648387	3.14443e+03	-1.89775e+03	5.04958e+03	-3.71782e+03	7.56327e+03	-5.89488e+03	1.16695e+04	-7.57992e+03
13.679803	3.14813e+03	-1.89775e+03	5.05143e+03	-3.71597e+03	7.56327e+03	-5.89488e+03	1.16695e+04	-7.57992e+03
13.720638	3.14258e+03	-1.89590e+03	5.05143e+03	-3.71412e+03	7.56327e+03	-5.89303e+03	1.16695e+04	-7.58177e+03
13.769481	3.14443e+03	-1.89960e+03	5.05143e+03	-3.71782e+03	7.56327e+03	-5.89488e+03	1.16695e+04	-7.58177e+03
13.802857	3.14443e+03	-1.89960e+03	5.05328e+03	-3.71967e+03	7.56327e+03	-5.89488e+03	1.16695e+04	-7.57992e+03
13.852991	3.14628e+03	-1.90145e+03	5.05143e+03	-3.71782e+03	7.56327e+03	-5.89488e+03	1.16695e+04	-7.58177e+03
13.888377	3.14443e+03	-1.89590e+03	5.05328e+03	-3.71782e+03	7.56327e+03	-5.89303e+03	1.16695e+04	-7.58177e+03
13.936381	3.14628e+03	-1.89775e+03	5.04958e+03	-3.71782e+03	7.56512e+03	-5.89488e+03	1.16695e+04	-7.57992e+03
13.968529	3.14628e+03	-1.89960e+03	5.04958e+03	-3.71967e+03	7.56327e+03	-5.89488e+03	1.16695e+04	-7.57992e+03
14.011375	3.14258e+03	-1.89775e+03	5.05143e+03	-3.71967e+03	7.56327e+03	-5.89488e+03	1.16695e+04	-7.57992e+03
14.064385	3.14258e+03	-1.89775e+03	5.05143e+03	-3.71782e+03	7.56512e+03	-5.89488e+03	1.16695e+04	-7.57992e+03
14.086702	3.14258e+03	-1.89775e+03	5.05328e+03	-3.71967e+03	7.56327e+03	-5.89488e+03	1.16695e+04	-7.57992e+03
14.136187	3.14258e+03	-1.90145e+03	5.05143e+03	-3.71967e+03	7.56327e+03	-5.89673e+03	1.16714e+04	-7.57992e+03
14.168592	3.14443e+03	-1.89960e+03	5.05143e+03	-3.71967e+03	7.56512e+03	-5.89488e+03	1.16695e+04	-7.58177e+03
14.2186	3.14443e+03	-1.89960e+03	5.04773e+03	-3.71967e+03	7.56327e+03	-5.89673e+03	1.16695e+04	-7.58177e+03
14.251917	3.14258e+03	-1.89775e+03	5.05143e+03	-3.71782e+03	7.56327e+03	-5.89488e+03	1.16695e+04	-7.57992e+03
14.302748	3.14073e+03	-1.89960e+03	5.05143e+03	-3.71782e+03	7.56512e+03	-5.89303e+03	1.16695e+04	-7.57992e+03
14.352384	3.14443e+03	-1.89775e+03	5.05143e+03	-3.71967e+03	7.56512e+03	-5.89488e+03	1.16695e+04	-7.58177e+03
14.384309	3.14628e+03	-1.89775e+03	5.05328e+03	-3.71967e+03	7.56327e+03	-5.89488e+03	1.16695e+04	-7.57992e+03
14.432364	3.14628e+03	-1.90145e+03	5.05328e+03	-3.71782e+03	7.56327e+03	-5.89488e+03	1.16695e+04	-7.57992e+03
14.464365	3.14628e+03	-1.89960e+03	5.05143e+03	-3.71967e+03	7.56327e+03	-5.89488e+03	1.16695e+04	-7.57992e+03
14.502887	3.14628e+03	-1.89960e+03	5.05328e+03	-3.71597e+03	7.56512e+03	-5.89303e+03	1.16695e+04	-7.57992e+03
14.535242	3.14628e+03	-1.89960e+03	5.05143e+03	-3.71597e+03	7.56512e+03	-5.89303e+03	1.16695e+04	-7.57992e+03
14.58556	3.14443e+03	-1.89775e+03	5.05143e+03	-3.71967e+03	7.56512e+03	-5.89488e+03	1.16695e+04	-7.57992e+03
14.636353	3.14258e+03	-1.89775e+03	5.05328e+03	-3.71967e+03	7.56512e+03	-5.89488e+03	1.16714e+04	-7.57992e+03
14.669507	3.14443e+03	-1.89590e+03	5.05328e+03	-3.71782e+03	7.56512e+03	-5.89673e+03	1.16695e+04	-7.57992e+03
14.720361	3.14258e+03	-1.89775e+03	5.05143e+03	-3.71967e+03	7.56512e+03	-5.89488e+03	1.16714e+04	-7.58177e+03
14.752369	3.14443e+03	-1.89960e+03	5.05328e+03	-3.71782e+03	7.56697e+03	-5.89488e+03	1.16695e+04	-7.57992e+03
14.800365	3.14813e+03	-1.89775e+03	5.05328e+03	-3.71782e+03	7.56512e+03	-5.89303e+03	1.16714e+04	-7.57992e+03
14.828998	3.14628e+03	-1.89960e+03	5.05143e+03	-3.71782e+03	7.56512e+03	-5.89488e+03	1.16714e+04	-7.58177e+03
14.872634	3.14443e+03	-1.89960e+03	5.05143e+03	-3.71597e+03	7.56512e+03	-5.89488e+03	1.16714e+04	-7.57992e+03
14.91858	3.14443e+03	-1.90145e+03	5.04958e+03	-3.71782e+03	7.56512e+03	-5.89488e+03	1.16714e+04	-7.57992e+03
14.960481	3.14628e+03	-1.90145e+03	5.04958e+03	-3.71967e+03	7.56512e+03	-5.89488e+03	1.16714e+04	-7.57992e+03
15.001808	3.14443e+03	-1.89775e+03	5.05143e+03	-3.71782e+03	7.56697e+03	-5.89488e+03	1.16714e+04	-7.57992e+03
15.036151	3.14443e+03	-1.89775e+03	5.05143e+03	-3.71782e+03	7.56512e+03	-5.89488e+03	1.16714e+04	-7.57992e+03
15.085165	3.14443e+03	-1.90145e+03	5.05328e+03	-3.71782e+03	7.56512e+03	-5.89488e+03	1.16714e+04	-7.57992e+03
15.120372	3.14628e+03	-1.90330e+03	5.05328e+03	-3.71597e+03	7.56512e+03	-5.89303e+03	1.16714e+04	-7.57992e+03
15.168398	3.14628e+03	-1.89960e+03	5.05143e+03	-3.71782e+03	7.56512e+03	-5.89303e+03	1.16714e+04	-7.57992e+03
15.216354	3.14628e+03	-1.89775e+03	5.05328e+03	-3.71967e+03	7.56512e+03	-5.89488e+03	1.16714e+04	-7.57992e+03
15.246127	3.14813e+03	-1.90330e+03	5.05143e+03	-3.71782e+03	7.56512e+03	-5.89303e+03	1.16714e+04	-7.57992e+03
15.296427	3.14813e+03	-1.90145e+03	5.05143e+03	-3.71967e+03	7.56512e+03	-5.89488e+03	1.16714e+04	-7.57992e+03
15.3285	3.14628e+03	-1.89590e+03	5.05143e+03	-3.71782e+03	7.56512e+03	-5.89488e+03	1.16695e+04	-7.57992e+03
15.369321	3.14628e+03	-1.89775e+03	5.05143e+03	-3.71782e+03	7.56327e+03	-5.89303e+03	1.16714e+04	-7.57992e+03
15.402796	3.14443e+03	-1.89590e+03	5.05143e+03	-3.71782e+03	7.56512e+03	-5.89303e+03	1.16695e+04	-7.57992e+03
15.451752	3.14813e+03	-1.89775e+03	5.05328e+03	-3.71782e+03	7.56512e+03	-5.89488e+03	1.16714e+04	-7.57992e+03
15.501767	3.14443e+03	-1.89590e+03	5.05513e+03	-3.71597e+03	7.56512e+03	-5.89488e+03	1.16695e+04	-7.57992e+03
15.535091	3.14443e+03	-1.89960e+03	5.05328e+03	-3.71782e+03	7.56512e+03	-5.89303e+03	1.16714e+04	-7.58177e+03
15.584047	3.14628e+03	-1.89960e+03	5.05143e+03	-3.71967e+03	7.56512e+03	-5.89488e+03	1.16714e+04	-7.58177e+03
15.612438	3.14443e+03	-1.89960e+03	5.05143e+03	-3.71782e+03	7.56512e+03	-5.89303e+03	1.16695e+04	-7.57992e+03
15.662362	3.14443e+03	-1.89775e+03	5.05143e+03	-3.71967e+03	7.56327e+03	-5.89488e+03	1.16714e+04	-7.57992e+03
15.687035	3.14628e+03	-1.89775e+03	5.05328e+03	-3.71782e+03	7.56327e+03	-5.89488e+03	1.16695e+04	-7.57992e+03
15.73613	3.14443e+03	-1.89775e+03	5.05328e+03	-3.71782e+03	7.56512e+03	-5.89303e+03	1.16714e+04	-7.57992e+03
15.784995	3.14628e+03	-1.89775e+03	5.05143e+03	-3.71782e+03	7.56512e+03	-5.89488e+03	1.16714e+04	-7.57992e+03
15.818345	3.14628e+03	-1.89775e+03	5.05328e+03	-3.71967e+03	7.56512e+03	-5.89488e+03	1.16695e+04	-7.57992e+03
15.869419	3.14443e+03	-1.89775e+03	5.05143e+03	-3.71597e+03	7.56512e+03	-5.89303e+03	1.16695e+04	-7.58177e+03
15.902587	3.14443e+03	-1.89960e+03	5.05143e+03	-3.71597e+03	7.56327e+03	-5.89303e+03	1.16695e+04	-7.57992e+03
15.951397	3.14628e+03	-1.89960e+03	5.05328e+03	-3.71782e+03	7.56512e+03	-5.89488e+03	1.16695e+04	-7.57992e+03
15.983827	3.14628e+03	-1.89775e+03	5.05328e+03	-3.71967e+03	7.56512e+03	-5.89488e+03	1.16695e+04	-7.57992e+03
16.028117	3.14628e+03	-1.89775e+03	5.05328e+03	-3.71782e+03	7.56512e+03	-5.89488e+03	1.16695e+04	-7.58177e+03
16.064475	3.14628e+03	-1.89775e+03	5.05328e+03	-3.71597e+03	7.56512e+03	-5.89303e+03	1.16714e+04	-7.57992e+03
16.111811	3.14443e+03	-1.89775e+03	5.04958e+03	-3.71782e+03	7.56512e+03	-5.89303e+03	1.16695e+04	-7.57992e+03
16.152648	3.14443e+03	-1.89960e+03	5.05143e+03	-3.71597e+03	7.56327e+03	-5.89303e+03	1.16714e+04	-7.58177e+03
16.185984	3.14443e+03	-1.89960e+03	5.05143e+03	-3.71597e+03	7.56512e+03	-5.89303e+03	1.16714e+04	-7.57992e+03
16.235061	3.14443e+03	-1.89775e+03	5.04958e+03	-3.71782e+03	7.56512e+03	-5.89303e+03	1.16695e+04	-7.58177e+03
16.268388	3.14443e+03	-1.89775e+03	5.05143e+03	-3.71782e+03	7.56512e+03	-5.89303e+03	1.16714e+04	-7.58177e+03
16.320352	3.14998e+03	-1.89590e+03	5.05328e+03	-3.71782e+03	7.56512e+03	-5.89303e+03	1.16714e+04	-7.58177e+03
16.351658	3.14813e+03	-1.89590e+03	5.05328e+03	-3.71967e+03	7.56512e+03	-5.89488e+03	1.16695e+04	-7.57992e+03
16.400458	3.14628e+03	-1.89775e+03	5.05328e+03	-3.71967e+03	7.56512e+03	-5.89488e+03	1.16714e+04	-7.57992e+03
16.448331	3.14258e+03	-1.89960e+03	5.05328e+03	-3.71782e+03	7.56512e+03	-5.89303e+03	1.16695e+04	-7.57992e+03
16.48035	3.14258e+03	-1.89960e+03	5.04773e+03	-3.71782e+03	7.56512e+03	-5.89488e+03	1.16695e+04	-7.57992e+03
16.518808	3.14443e+03	-1.89775e+03	5.05328e+03	-3.71967e+03	7.56512e+03	-5.89303e+03	1.16695e+04	-7.57992e+03
16.552678	3.14813e+03	-1.89960e+03	5.05513e+03	-3.71782e+03	7.56512e+03	-5.89303e+03	1.16695e+04	-7.57992e+03
16.601752	3.14628e+03	-1.89960e+03	5.05143e+03	-3.71967e+03	7.56512e+03	-5.89488e+03	1.16714e+04	-7.57992e+03
16.635068	3.14443e+03	-1.89960e+03	5.05143e+03	-3.71967e+03	7.56512e+03	-5.89303e+03	1.16714e+04	-7.57992e+03
16.685905	3.14628e+03	-1.89590e+03	5.05143e+03	-3.71782e+03	7.56512e+03	-5.89303e+03	1.16714e+04	-7.58177e+03
16.73634	3.14443e+03	-1.89775e+03	5.05143e+03	-3.71782e+03	7.56512e+03	-5.89488e+03	1.16714e+04	-7.57992e+03
16.76829	3.14258e+03	-1.89775e+03	5.05328e+03	-3.71782e+03	7.56512e+03	-5.89488e+03	1.16714e+04	-7.57992e+03
16.812722	3.14628e+03	-1.89775e+03	5.05328e+03	-3.71782e+03	7.56512e+03	-5.89488e+03	1.16695e+04	-7.57992e+03
16.847106	3.14443e+03	-1.89960e+03	5.05143e+03	-3.71967e+03	7.56512e+03	-5.89488e+03	1.16695e+04	-7.57992e+03
16.89635	3.14628e+03	-1.89590e+03	5.04958e+03	-3.71782e+03	7.56512e+03	-5.89488e+03	1.16695e+04	-7.58177e+03
16.918825	3.14813e+03	-1.89405e+03	5.04958e+03	-3.71597e+03	7.56512e+03	-5.89488e+03	1.16714e+04	-7.57992e+03
16.96949	3.14813e+03	-1.89960e+03	5.04958e+03	-3.71782e+03	7.56327e+03	-5.89488e+03	1.16714e+04	-7.57992e+03
17.021239	3.14628e+03	-1.89960e+03	5.05328e+03	-3.71597e+03	7.56512e+03	-5.89488e+03	1.16714e+04	-7.57992e+03
17.056347	3.14443e+03	-1.89775e+03	5.05328e+03	-3.71412e+03	7.56512e+03	-5.89303e+03	1.16695e+04	-7.57992e+03
17.102964	3.14443e+03	-1.89221e+03	5.05143e+03	-3.71597e+03	7.56327e+03	-5.89488e+03	1.16714e+04	-7.57992e+03
17.136183	3.14443e+03	-1.89405e+03	5.05328e+03	-3.71597e+03	7.56512e+03	-5.89303e+03	1.16714e+04	-7.58177e+03
17.18393	3.14443e+03	-1.89775e+03	5.05143e+03	-3.71782e+03	7.56512e+03	-5.89488e+03	1.16714e+04	-7.58177e+03
17.213849	3.14443e+03	-1.89775e+03	5.05143e+03	-3.71782e+03	7.56327e+03	-5.89488e+03	1.16714e+04	-7.58177e+03
17.263696	3.14443e+03	-1.89960e+03	5.05328e+03	-3.71782e+03	7.56512e+03	-5.89488e+03	1.16695e+04	-7.58177e+03
17.302631	3.14258e+03	-1.89960e+03	5.04958e+03	-3.71782e+03	7.56512e+03	-5.89488e+03	1.16695e+04	-7.58177e+03
17.339096	3.14258e+03	-1.90145e+03	5.04773e+03	-3.71597e+03	7.56512e+03	-5.89488e+03	1.16714e+04	-7.58177e+03
17.384913	3.14443e+03	-1.90145e+03	5.05513e+03	-3.71597e+03	7.56512e+03	-5.89488e+03	1.16714e+04	-7.57992e+03
17.41975	3.14258e+03	-1.89775e+03	5.05328e+03	-3.71782e+03	7.56512e+03	-5.89488e+03	1.16695e+04	-7.58177e+03
17.467953	3.14628e+03	-1.90145e+03	5.05143e+03	-3.71782e+03	7.56512e+03	-5.89488e+03	1.16714e+04	-7.58177e+03
17.504341	3.14628e+03	-1.89775e+03	5.05328e+03	-3.71597e+03	7.56512e+03	-5.89488e+03	1.16714e+04	-7.57992e+03
17.552324	3.14443e+03	-1.89775e+03	5.05328e+03	-3.71782e+03	7.56512e+03	-5.89673e+03	1.16695e+04	-7.57992e+03
17.598218	3.14258e+03	-1.89960e+03	5.05143e+03	-3.71782e+03	7.56512e+03	-5.89488e+03	1.16714e+04	-7.57992e+03
17.63153	3.14628e+03	-1.89590e+03	5.05143e+03	-3.71597e+03	7.56512e+03	-5.89303e+03	1.16714e+04	-7.57992e+03
17.6707	3.14628e+03	-1.89960e+03	5.05328e+03	-3.71597e+03	7.56512e+03	-5.89303e+03	1.16714e+04	-7.58177e+03
17.711605	3.14443e+03	-1.89960e+03	5.05328e+03	-3.71782e+03	7.56512e+03	-5.89303e+03	1.16714e+04	-7.58177e+03
17.751586	3.14258e+03	-1.89405e+03	5.05328e+03	-3.71782e+03	7.56512e+03	-5.89303e+03	1.16714e+04	-7.57992e+03
17.784849	3.14443e+03	-1.89775e+03	5.05328e+03	-3.71782e+03	7.56512e+03	-5.89303e+03	1.16714e+04	-7.57992e+03
17.834818	3.14443e+03	-1.89405e+03	5.05328e+03	-3.71782e+03	7.56512e+03	-5.89488e+03	1.16714e+04	-7.57992e+03
17.884816	3.14628e+03	-1.89590e+03	5.05328e+03	-3.71782e+03	7.56512e+03	-5.89488e+03	1.16714e+04	-7.57992e+03
17.920318	3.14443e+03	-1.89960e+03	5.05143e+03	-3.71782e+03	7.56512e+03	-5.89303e+03	1.16714e+04	-7.57992e+03
17.968335	3.14258e+03	-1.89960e+03	5.05328e+03	-3.71782e+03	7.56327e+03	-5.89488e+03	1.16714e+04	-7.58177e+03
18.000224	3.14443e+03	-1.89775e+03	5.05698e+03	-3.71782e+03	7.56512e+03	-5.89673e+03	1.16714e+04	-7.57992e+03
18.048319	3.14443e+03	-1.89960e+03	5.05143e+03	-3.71967e+03	7.56512e+03	-5.89303e+03	1.16714e+04	-7.57992e+03
18.075709	3.14443e+03	-1.89775e+03	5.05328e+03	-3.71967e+03	7.56512e+03	-5.89488e+03	1.16714e+04	-7.57992e+03
18.128389	3.14628e+03	-1.90145e+03	5.05328e+03	-3.71782e+03	7.56512e+03	-5.89303e+03	1.16695e+04	-7.57992e+03
18.169406	3.14443e+03	-1.89960e+03	5.05143e+03	-3.71782e+03	7.56327e+03	-5.89303e+03	1.16695e+04	-7.58177e+03
18.201496	3.14813e+03	-1.89960e+03	5.05143e+03	-3.71782e+03	7.56512e+03	-5.89488e+03	1.16695e+04	-7.57992e+03
18.252421	3.14443e+03	-1.90145e+03	5.05328e+03	-3.71782e+03	7.56512e+03	-5.89488e+03	1.16695e+04	-7.57992e+03
18.285878	3.14443e+03	-1.89775e+03	5.05328e+03	-3.71782e+03	7.56512e+03	-5.89488e+03	1.16695e+04	-7.57992e+03
18.336305	3.14443e+03	-1.89960e+03	5.05143e+03	-3.71782e+03	7.56512e+03	-5.89488e+03	1.16695e+04	-7.57992e+03
18.368305	3.14443e+03	-1.89775e+03	5.05328e+03	-3.71782e+03	7.56512e+03	-5.89303e+03	1.16695e+04	-7.57992e+03
18.412581	3.14443e+03	-1.89960e+03	5.05328e+03	-3.71782e+03	7.56512e+03	-5.89488e+03	1.16695e+04	-7.57992e+03
18.463634	3.14443e+03	-1.89775e+03	5.05513e+03	-3.71782e+03	7.56512e+03	-5.89488e+03	1.16695e+04	-7.57992e+03
18.495973	3.14628e+03	-1.89590e+03	5.05328e+03	-3.71782e+03	7.56512e+03	-5.89488e+03	1.16695e+04	-7.57992e+03
18.5443	3.14443e+03	-1.89960e+03	5.05143e+03	-3.71782e+03	7.56327e+03	-5.89303e+03	1.16714e+04	-7.57992e+03
18.56814	3.14443e+03	-1.89960e+03	5.05143e+03	-3.71782e+03	7.56512e+03	-5.89303e+03	1.16714e+04	-7.57992e+03
18.620687	3.14813e+03	-1.89590e+03	5.05143e+03	-3.71782e+03	7.56512e+03	-5.89488e+03	1.16695e+04	-7.57992e+03
18.652493	3.14443e+03	-1.89590e+03	5.05328e+03	-3.71967e+03	7.56327e+03	-5.89303e+03	1.16695e+04	-7.57992e+03
18.703661	3.14443e+03	-1.90145e+03	5.05328e+03	-3.71782e+03	7.56512e+03	-5.89303e+03	1.16695e+04	-7.57992e+03
18.752329	3.14443e+03	-1.90145e+03	5.05328e+03	-3.71782e+03	7.56512e+03	-5.89303e+03	1.16695e+04	-7.57992e+03
18.783721	3.14813e+03	-1.89960e+03	5.05143e+03	-3.71782e+03	7.56512e+03	-5.89488e+03	1.16695e+04	-7.57992e+03
18.823091	3.14813e+03	-1.89775e+03	5.05143e+03	-3.71782e+03	7.56512e+03	-5.89488e+03	1.16695e+04	-7.57992e+03
18.863525	3.14258e+03	-1.89775e+03	5.05143e+03	-3.71967e+03	7.56512e+03	-5.89488e+03	1.16695e+04	-7.57992e+03
18.902658	3.14628e+03	-1.89590e+03	5.04958e+03	-3.71782e+03	7.56327e+03	-5.89488e+03	1.16695e+04	-7.57992e+03
18.93481	3.14628e+03	-1.89590e+03	5.05143e+03	-3.71782e+03	7.56512e+03	-5.89303e+03	1.16695e+04	-7.57992e+03
18.985736	3.14443e+03	-1.89590e+03	5.05328e+03	-3.71597e+03	7.56327e+03	-5.89303e+03	1.16695e+04	-7.57992e+03
19.035682	3.14628e+03	-1.89775e+03	5.05328e+03	-3.71782e+03	7.56512e+03	-5.89303e+03	1.16695e+04	-7.57992e+03
19.068834	3.14628e+03	-1.89775e+03	5.05513e+03	-3.71782e+03	7.56512e+03	-5.89303e+03	1.16695e+04	-7.57992e+03
19.12029	3.14443e+03	-1.89775e+03	5.05328e+03	-3.71782e+03	7.56512e+03	-5.89303e+03	1.16695e+04	-7.57992e+03
19.152423	3.14258e+03	-1.90145e+03	5.05143e+03	-3.71967e+03	7.56512e+03	-5.89303e+03	1.16714e+04	-7.57992e+03
19.200585	3.14443e+03	-1.89775e+03	5.05328e+03	-3.71597e+03	7.56697e+03	-5.89303e+03	1.16695e+04	-7.57992e+03
19.231511	3.14628e+03	-1.89775e+03	5.05328e+03	-3.71597e+03	7.56512e+03	-5.89118e+03	1.16695e+04	-7.57992e+03
19.280346	3.14628e+03	-1.89960e+03	5.05143e+03	-3.71967e+03	7.56512e+03	-5.89303e+03	1.16714e+04	-7.57807e+03
19.320049	3.14443e+03	-1.90330e+03	5.05143e+03	-3.71782e+03	7.56697e+03	-5.89303e+03	1.16695e+04	-7.57992e+03
19.352347	3.14443e+03	-1.90145e+03	5.05328e+03	-3.71782e+03	7.56512e+03	-5.89303e+03	1.16695e+04	-7.57992e+03
19.401432	3.14628e+03	-1.89960e+03	5.05328e+03	-3.71782e+03	7.56512e+03	-5.89488e+03	1.16695e+04	-7.57992e+03
19.435644	3.14628e+03	-1.89960e+03	5.05143e+03	-3.71782e+03	7.56512e+03	-5.89488e+03	1.16695e+04	-7.57992e+03
19.484756	3.14628e+03	-1.90330e+03	5.05143e+03	-3.71967e+03	7.56327e+03	-5.89488e+03	1.16695e+04	-7.57992e+03
19.520006	3.14443e+03	-1.90145e+03	5.05328e+03	-3.71967e+03	7.56512e+03	-5.89303e+03	1.16695e+04	-7.57992e+03
19.5683	3.14443e+03	-1.89775e+03	5.05143e+03	-3.71782e+03	7.56512e+03	-5.89488e+03	1.16695e+04	-7.57992e+03
19.613315	3.14813e+03	-1.89590e+03	5.05143e+03	-3.71967e+03	7.56512e+03	-5.89488e+03	1.16695e+04	-7.57992e+03
19.648281	3.14628e+03	-1.89590e+03	5.05513e+03	-3.71967e+03	7.56512e+03	-5.89488e+03	1.16695e+04	-7.57807e+03
19.696278	3.14443e+03	-1.89775e+03	5.05143e+03	-3.71597e+03	7.56512e+03	-5.89303e+03	1.16695e+04	-7.57992e+03
19.72231	3.14258e+03	-1.89960e+03	5.04958e+03	-3.71967e+03	7.56512e+03	-5.89488e+03	1.16695e+04	-7.57992e+03
19.767955	3.14443e+03	-1.89775e+03	5.05328e+03	-3.71782e+03	7.56512e+03	-5.89303e+03	1.16695e+04	-7.57992e+03
19.801336	3.14258e+03	-1.89590e+03	5.05143e+03	-3.71782e+03	7.56512e+03	-5.89303e+03	1.16695e+04	-7.57992e+03
19.851327	3.14443e+03	-1.89775e+03	5.05328e+03	-3.71782e+03	7.56512e+03	-5.89488e+03	1.16695e+04	-7.57992e+03
19.901315	3.14443e+03	-1.89960e+03	5.05143e+03	-3.71782e+03	7.56327e+03	-5.89488e+03	1.16695e+04	-7.57992e+03
19.936297	3.14443e+03	-1.89590e+03	5.04958e+03	-3.71782e+03	7.56512e+03	-5.89303e+03	1.16695e+04	-7.57992e+03
19.983645	3.14443e+03	-1.89590e+03	5.04958e+03	-3.71597e+03	7.56512e+03	-5.89303e+03	1.16695e+04	-7.58177e+03
20.0101	3.14628e+03	-1.89405e+03	5.05143e+03	-3.71782e+03	7.56512e+03	-5.89303e+03	1.16714e+04	-7.57992e+03
20.064052	3.14443e+03	-1.89775e+03	5.05328e+03	-3.71782e+03	7.56512e+03	-5.89303e+03	1.16695e+04	-7.57992e+03
20.09628	3.14628e+03	-1.90145e+03	5.05143e+03	-3.71782e+03	7.56512e+03	-5.89303e+03	1.16714e+04	-7.57992e+03
20.135672	3.14628e+03	-1.90330e+03	5.05143e+03	-3.71597e+03	7.56512e+03	-5.89303e+03	1.16695e+04	-7.57992e+03
20.184706	3.14443e+03	-1.90145e+03	5.05143e+03	-3.71782e+03	7.56512e+03	-5.89303e+03	1.16695e+04	-7.57992e+03
20.224289	3.14258e+03	-1.90145e+03	5.05143e+03	-3.71967e+03	7.56512e+03	-5.89488e+03	1.16695e+04	-7.57992e+03
20.271053	3.14443e+03	-1.89960e+03	5.05143e+03	-3.71782e+03	7.56327e+03	-5.89488e+03	1.16695e+04	-7.57992e+03
20.302209	3.14443e+03	-1.89960e+03	5.05328e+03	-3.71782e+03	7.56327e+03	-5.89488e+03	1.16695e+04	-7.57992e+03
20.352274	3.14443e+03	-1.89590e+03	5.05328e+03	-3.71782e+03	7.56512e+03	-5.89303e+03	1.16695e+04	-7.57992e+03
20.383628	3.14443e+03	-1.89775e+03	5.05143e+03	-3.71782e+03	7.56512e+03	-5.89488e+03	1.16695e+04	-7.57992e+03
20.432139	3.14443e+03	-1.89960e+03	5.04958e+03	-3.71782e+03	7.56327e+03	-5.89303e+03	1.16695e+04	-7.58177e+03
20.480272	3.14443e+03	-1.89775e+03	5.05143e+03	-3.71782e+03	7.56327e+03	-5.89303e+03	1.16695e+04	-7.57992e+03
20.512332	3.14258e+03	-1.89960e+03	5.05143e+03	-3.71782e+03	7.56327e+03	-5.89303e+03	1.16695e+04	-7.57992e+03
20.552283	3.14443e+03	-1.89960e+03	5.05143e+03	-3.71782e+03	7.56327e+03	-5.89303e+03	1.16695e+04	-7.57992e+03
20.584578	3.14628e+03	-1.89590e+03	5.05328e+03	-3.71782e+03	7.56512e+03	-5.89303e+03	1.16695e+04	-7.57992e+03
20.635656	3.14813e+03	-1.89590e+03	5.05328e+03	-3.71782e+03	7.56512e+03	-5.89488e+03	1.16695e+04	-7.57992e+03
20.668762	3.14628e+03	-1.89775e+03	5.05513e+03	-3.71967e+03	7.56327e+03	-5.89488e+03	1.16695e+04	-7.57992e+03
20.720251	3.14813e+03	-1.89590e+03	5.05328e+03	-3.71782e+03	7.56327e+03	-5.89488e+03	1.16695e+04	-7.57992e+03
20.75228	3.14813e+03	-1.89405e+03	5.05143e+03	-3.71782e+03	7.56512e+03	-5.89488e+03	1.16695e+04	-7.57992e+03
20.800236	3.14443e+03	-1.89590e+03	5.05143e+03	-3.71967e+03	7.56512e+03	-5.89303e+03	1.16695e+04	-7.57992e+03
20.845156	3.14813e+03	-1.89775e+03	5.04958e+03	-3.71597e+03	7.56512e+03	-5.89488e+03	1.16695e+04	-7.57992e+03
20.880281	3.14813e+03	-1.89590e+03	5.05143e+03	-3.71782e+03	7.56512e+03	-5.89488e+03	1.16695e+04	-7.57992e+03
20.924647	3.14628e+03	-1.89775e+03	5.05143e+03	-3.71782e+03	7.56327e+03	-5.89488e+03	1.16695e+04	-7.58177e+03
20.951308	3.14443e+03	-1.89775e+03	5.05328e+03	-3.71782e+03	7.56327e+03	-5.89488e+03	1.16714e+04	-7.57992e+03
21.001258	3.14628e+03	-1.89960e+03	5.05328e+03	-3.71782e+03	7.56512e+03	-5.89488e+03	1.16695e+04	-7.57992e+03
21.03456	3.14443e+03	-1.89775e+03	5.05143e+03	-3.71597e+03	7.56327e+03	-5.89488e+03	1.16714e+04	-7.57992e+03
21.084537	3.14443e+03	-1.89960e+03	5.05143e+03	-3.71782e+03	7.56327e+03	-5.89488e+03	1.16695e+04	-7.57992e+03
21.1351	3.14443e+03	-1.89775e+03	5.05143e+03	-3.71782e+03	7.56327e+03	-5.89488e+03	1.16695e+04	-7.57992e+03
21.168278	3.14628e+03	-1.89775e+03	5.05143e+03	-3.71782e+03	7.56327e+03	-5.89488e+03	1.16695e+04	-7.57992e+03
21.215983	3.14628e+03	-1.89590e+03	5.05143e+03	-3.71597e+03	7.56327e+03	-5.89488e+03	1.16695e+04	-7.57992e+03
21.24768	3.14443e+03	-1.89590e+03	5.05328e+03	-3.71782e+03	7.56327e+03	-5.89303e+03	1.16695e+04	-7.57992e+03
21.288211	3.14443e+03	-1.89590e+03	5.04958e+03	-3.71967e+03	7.56327e+03	-5.89488e+03	1.16695e+04	-7.58177e+03
21.322307	3.14628e+03	-1.89775e+03	5.04958e+03	-3.71782e+03	7.56512e+03	-5.89488e+03	1.16695e+04	-7.57992e+03
21.368487	3.14443e+03	-1.89775e+03	5.04958e+03	-3.71782e+03	7.56327e+03	-5.89488e+03	1.16695e+04	-7.57992e+03
21.42426	3.14258e+03	-1.89775e+03	5.04958e+03	-3.71782e+03	7.56327e+03	-5.89303e+03	1.16695e+04	-7.58177e+03
21.451163	3.14628e+03	-1.90145e+03	5.05143e+03	-3.71597e+03	7.56327e+03	-5.89488e+03	1.16695e+04	-7.57992e+03
21.5024	3.14628e+03	-1.89960e+03	5.05143e+03	-3.71597e+03	7.56327e+03	-5.89488e+03	1.16695e+04	-7.57992e+03
21.536272	3.14628e+03	-1.89960e+03	5.04958e+03	-3.71782e+03	7.56327e+03	-5.89488e+03	1.16695e+04	-7.58177e+03
