Timestamp	I_0	Q_0	I_1	Q_1	I_2	Q_2	I_3	Q_3
0.0	3.09264e+03	-1.87556e+03	4.96080e+03	-3.73817e+03	7.52073e+03	-5.98551e+03	1.17287e+04	-7.65761e+03
0.031606	3.09264e+03	-1.87741e+03	4.96080e+03	-3.73632e+03	7.52073e+03	-5.98551e+03	1.17287e+04	-7.65761e+03
0.079049	3.09264e+03	-1.87741e+03	4.96080e+03	-3.73632e+03	7.52258e+03	-5.98551e+03	1.17306e+04	-7.65761e+03
0.110633	3.09079e+03	-1.87926e+03	4.96080e+03	-3.73632e+03	7.52073e+03	-5.98736e+03	1.17287e+04	-7.65761e+03
0.15718	3.09264e+03	-1.87926e+03	4.96265e+03	-3.73632e+03	7.52073e+03	-5.98736e+03	1.17306e+04	-7.65761e+03
0.191272	3.08709e+03	-1.88296e+03	4.96265e+03	-3.73817e+03	7.52073e+03	-5.98551e+03	1.17287e+04	-7.65761e+03
0.231044	3.09079e+03	-1.88111e+03	4.96080e+03	-3.73817e+03	7.52073e+03	-5.98736e+03	1.17287e+04	-7.65761e+03
0.280112	3.09079e+03	-1.87926e+03	4.96080e+03	-3.73632e+03	7.52073e+03	-5.98736e+03	1.17287e+04	-7.65761e+03
0.315472	3.08894e+03	-1.87741e+03	4.96265e+03	-3.73447e+03	7.52073e+03	-5.98551e+03	1.17287e+04	-7.65761e+03
0.365505	3.09079e+03	-1.87556e+03	4.96265e+03	-3.73817e+03	7.52073e+03	-5.98551e+03	1.17287e+04	-7.65761e+03
0.396772	3.09264e+03	-1.87741e+03	4.96080e+03	-3.73632e+03	7.52073e+03	-5.98736e+03	1.17287e+04	-7.65761e+03
0.446963	3.09079e+03	-1.87741e+03	4.96265e+03	-3.73632e+03	7.52073e+03	-5.98551e+03	1.17306e+04	-7.65761e+03
0.479885	3.09264e+03	-1.87556e+03	4.96080e+03	-3.73817e+03	7.52073e+03	-5.98551e+03	1.17287e+04	-7.65761e+03
0.527492	3.09264e+03	-1.87741e+03	4.96080e+03	-3.73447e+03	7.52073e+03	-5.98551e+03	1.17287e+04	-7.65761e+03
0.575496	3.09079e+03	-1.87556e+03	4.96265e+03	-3.73447e+03	7.52073e+03	-5.98366e+03	1.17306e+04	-7.65761e+03
0.606858	3.09264e+03	-1.87371e+03	4.96080e+03	-3.73817e+03	7.52073e+03	-5.98551e+03	1.17306e+04	-7.65761e+03
0.65555	3.09264e+03	-1.87741e+03	4.95895e+03	-3.73632e+03	7.52073e+03	-5.98551e+03	1.17287e+04	-7.65761e+03
0.679972	3.09449e+03	-1.87926e+03	4.96080e+03	-3.73817e+03	7.52258e+03	-5.98551e+03	1.17287e+04	-7.65761e+03
0.732659	3.09449e+03	-1.87926e+03	4.96080e+03	-3.73632e+03	7.52073e+03	-5.98551e+03	1.17287e+04	-7.65761e+03
0.76456	3.09079e+03	-1.87741e+03	4.96080e+03	-3.73447e+03	7.52073e+03	-5.98551e+03	1.17306e+04	-7.65761e+03
0.815499	3.09079e+03	-1.87926e+03	4.96265e+03	-3.73447e+03	7.52073e+03	-5.98366e+03	1.17287e+04	-7.65761e+03
0.863252	3.09079e+03	-1.87926e+03	4.95895e+03	-3.73632e+03	7.52073e+03	-5.98551e+03	1.17287e+04	-7.65761e+03
0.895702	3.09079e+03	-1.88111e+03	4.96265e+03	-3.73447e+03	7.52258e+03	-5.98366e+03	1.17306e+04	-7.65576e+03
0.941132	3.09264e+03	-1.87556e+03	4.96265e+03	-3.73447e+03	7.52073e+03	-5.98551e+03	1.17287e+04	-7.65761e+03
0.975415	3.09449e+03	-1.87926e+03	4.96265e+03	-3.73632e+03	7.52073e+03	-5.98551e+03	1.17287e+04	-7.65761e+03
1.018259	3.09264e+03	-1.87926e+03	4.95895e+03	-3.73632e+03	7.52073e+03	-5.98551e+03	1.17306e+04	-7.65761e+03
1.055499	3.09079e+03	-1.87556e+03	4.96080e+03	-3.73632e+03	7.52073e+03	-5.98551e+03	1.17306e+04	-7.65761e+03
1.103472	3.09264e+03	-1.87741e+03	4.96080e+03	-3.73817e+03	7.52073e+03	-5.98736e+03	1.17306e+04	-7.65761e+03
1.151474	3.09079e+03	-1.87741e+03	4.96080e+03	-3.73632e+03	7.52073e+03	-5.98551e+03	1.17306e+04	-7.65761e+03
1.181038	3.09264e+03	-1.87741e+03	4.96265e+03	-3.73817e+03	7.52073e+03	-5.98551e+03	1.17306e+04	-7.65761e+03
1.229946	3.09079e+03	-1.87556e+03	4.96265e+03	-3.73817e+03	7.52073e+03	-5.98736e+03	1.17287e+04	-7.65761e+03
1.263479	3.08894e+03	-1.88111e+03	4.96265e+03	-3.73632e+03	7.52073e+03	-5.98551e+03	1.17306e+04	-7.65576e+03
1.31148	3.09449e+03	-1.87926e+03	4.96080e+03	-3.73632e+03	7.52073e+03	-5.98551e+03	1.17306e+04	-7.65761e+03
1.341112	3.09264e+03	-1.87741e+03	4.96265e+03	-3.73632e+03	7.52073e+03	-5.98551e+03	1.17306e+04	-7.65761e+03
1.388649	3.09264e+03	-1.87926e+03	4.96265e+03	-3.73632e+03	7.52073e+03	-5.98366e+03	1.17287e+04	-7.65761e+03
1.429955	3.08894e+03	-1.87741e+03	4.96450e+03	-3.73817e+03	7.52073e+03	-5.98551e+03	1.17306e+04	-7.65761e+03
1.463178	3.09079e+03	-1.87556e+03	4.96080e+03	-3.73447e+03	7.52073e+03	-5.98551e+03	1.17306e+04	-7.65761e+03
1.51425	3.09079e+03	-1.87556e+03	4.96265e+03	-3.73632e+03	7.52073e+03	-5.98551e+03	1.17306e+04	-7.65576e+03
1.549161	3.09449e+03	-1.87556e+03	4.96265e+03	-3.73632e+03	7.52073e+03	-5.98551e+03	1.17306e+04	-7.65761e+03
1.596621	3.09264e+03	-1.87556e+03	4.96080e+03	-3.73632e+03	7.52073e+03	-5.98551e+03	1.17287e+04	-7.65576e+03
1.631489	3.09449e+03	-1.87741e+03	4.96265e+03	-3.73632e+03	7.52073e+03	-5.98551e+03	1.17287e+04	-7.65761e+03
1.678869	3.09264e+03	-1.87926e+03	4.96265e+03	-3.73632e+03	7.52258e+03	-5.98551e+03	1.17287e+04	-7.65761e+03
1.724207	3.09079e+03	-1.87926e+03	4.96265e+03	-3.73447e+03	7.52258e+03	-5.98551e+03	1.17306e+04	-7.65761e+03
1.759188	3.08894e+03	-1.87741e+03	4.96080e+03	-3.73632e+03	7.52258e+03	-5.98366e+03	1.17287e+04	-7.65761e+03
1.807619	3.09264e+03	-1.87371e+03	4.96080e+03	-3.73817e+03	7.52073e+03	-5.98736e+03	1.17306e+04	-7.65761e+03
1.829882	3.09449e+03	-1.87926e+03	4.96265e+03	-3.73632e+03	7.52073e+03	-5.98551e+03	1.17306e+04	-7.65576e+03
1.8809	3.09264e+03	-1.87556e+03	4.96080e+03	-3.73447e+03	7.52258e+03	-5.98551e+03	1.17306e+04	-7.65761e+03
1.915829	3.09449e+03	-1.87741e+03	4.96265e+03	-3.73632e+03	7.52073e+03	-5.98551e+03	1.17306e+04	-7.65761e+03
1.963199	3.09264e+03	-1.87926e+03	4.96265e+03	-3.73632e+03	7.52073e+03	-5.98551e+03	1.17306e+04	-7.65576e+03
2.01546	3.09264e+03	-1.87741e+03	4.96450e+03	-3.73632e+03	7.52073e+03	-5.98551e+03	1.17306e+04	-7.65576e+03
2.046833	3.09449e+03	-1.88111e+03	4.96080e+03	-3.73632e+03	7.52073e+03	-5.98551e+03	1.17287e+04	-7.65761e+03
2.095437	3.09079e+03	-1.87926e+03	4.96080e+03	-3.73447e+03	7.52258e+03	-5.98551e+03	1.17287e+04	-7.65761e+03
2.120082	3.09449e+03	-1.87556e+03	4.96080e+03	-3.73632e+03	7.52073e+03	-5.98551e+03	1.17306e+04	-7.65761e+03
2.175459	3.09264e+03	-1.87741e+03	4.96080e+03	-3.73632e+03	7.52073e+03	-5.98551e+03	1.17287e+04	-7.65761e+03
2.206638	3.09264e+03	-1.88111e+03	4.96265e+03	-3.73632e+03	7.52073e+03	-5.98551e+03	1.17306e+04	-7.65576e+03
2.249503	3.09449e+03	-1.87926e+03	4.96080e+03	-3.73817e+03	7.52073e+03	-5.98551e+03	1.17306e+04	-7.65576e+03
2.296457	3.09264e+03	-1.87741e+03	4.95895e+03	-3.73632e+03	7.52073e+03	-5.98551e+03	1.17287e+04	-7.65761e+03
2.329844	3.09264e+03	-1.87926e+03	4.96265e+03	-3.73632e+03	7.52073e+03	-5.98366e+03	1.17287e+04	-7.65761e+03
2.379792	3.09264e+03	-1.87556e+03	4.96265e+03	-3.73632e+03	7.52073e+03	-5.98551e+03	1.17287e+04	-7.65761e+03
2.413102	3.09264e+03	-1.87926e+03	4.96265e+03	-3.73632e+03	7.52073e+03	-5.98736e+03	1.17287e+04	-7.65761e+03
2.463459	3.09079e+03	-1.87926e+03	4.96080e+03	-3.73632e+03	7.52073e+03	-5.98551e+03	1.17287e+04	-7.65576e+03
2.493362	3.09264e+03	-1.87741e+03	4.95895e+03	-3.73632e+03	7.52073e+03	-5.98551e+03	1.17287e+04	-7.65761e+03
2.542824	3.09264e+03	-1.87556e+03	4.96080e+03	-3.73632e+03	7.52073e+03	-5.98736e+03	1.17287e+04	-7.65761e+03
2.591	3.09079e+03	-1.87741e+03	4.96265e+03	-3.73447e+03	7.52073e+03	-5.98551e+03	1.17287e+04	-7.65761e+03
2.623431	3.09079e+03	-1.87556e+03	4.96265e+03	-3.73632e+03	7.52073e+03	-5.98551e+03	1.17287e+04	-7.65761e+03
2.664018	3.09449e+03	-1.87926e+03	4.96080e+03	-3.73632e+03	7.52073e+03	-5.98551e+03	1.17287e+04	-7.65761e+03
2.696449	3.09264e+03	-1.88296e+03	4.96080e+03	-3.73447e+03	7.52073e+03	-5.98551e+03	1.17306e+04	-7.65761e+03
2.748558	3.09449e+03	-1.87741e+03	4.96080e+03	-3.73632e+03	7.52073e+03	-5.98551e+03	1.17287e+04	-7.65761e+03
2.779773	3.09449e+03	-1.87926e+03	4.96080e+03	-3.73632e+03	7.52073e+03	-5.98366e+03	1.17306e+04	-7.65761e+03
2.83144	3.09079e+03	-1.87741e+03	4.96265e+03	-3.73632e+03	7.52073e+03	-5.98551e+03	1.17287e+04	-7.65576e+03
2.878798	3.09449e+03	-1.87371e+03	4.96080e+03	-3.73447e+03	7.52073e+03	-5.98551e+03	1.17287e+04	-7.65761e+03
2.907562	3.09264e+03	-1.87926e+03	4.96265e+03	-3.73632e+03	7.52258e+03	-5.98551e+03	1.17287e+04	-7.65761e+03
2.95957	3.09264e+03	-1.88111e+03	4.96265e+03	-3.73632e+03	7.52073e+03	-5.98551e+03	1.17306e+04	-7.65576e+03
2.989712	3.09449e+03	-1.87926e+03	4.96450e+03	-3.73632e+03	7.52073e+03	-5.98551e+03	1.17287e+04	-7.65761e+03
3.030744	3.09264e+03	-1.87741e+03	4.96265e+03	-3.73632e+03	7.52073e+03	-5.98551e+03	1.17287e+04	-7.65761e+03
3.064469	3.09079e+03	-1.87556e+03	4.96265e+03	-3.73632e+03	7.52073e+03	-5.98551e+03	1.17287e+04	-7.65576e+03
3.113125	3.09264e+03	-1.87741e+03	4.96080e+03	-3.73632e+03	7.52073e+03	-5.98736e+03	1.17306e+04	-7.65761e+03
3.163803	3.09264e+03	-1.88111e+03	4.95895e+03	-3.73447e+03	7.52073e+03	-5.98366e+03	1.17306e+04	-7.65761e+03
3.197326	3.09079e+03	-1.87926e+03	4.96080e+03	-3.73447e+03	7.52258e+03	-5.98551e+03	1.17287e+04	-7.65761e+03
3.247413	3.09264e+03	-1.87556e+03	4.95895e+03	-3.73632e+03	7.52258e+03	-5.98551e+03	1.17306e+04	-7.65945e+03
3.278732	3.09264e+03	-1.87926e+03	4.96080e+03	-3.73632e+03	7.52258e+03	-5.98551e+03	1.17287e+04	-7.65761e+03
3.325178	3.09264e+03	-1.87926e+03	4.96265e+03	-3.73632e+03	7.52258e+03	-5.98551e+03	1.17306e+04	-7.65761e+03
3.359518	3.09264e+03	-1.87556e+03	4.96265e+03	-3.73817e+03	7.52073e+03	-5.98551e+03	1.17287e+04	-7.65761e+03
3.407436	3.09264e+03	-1.87556e+03	4.96265e+03	-3.73632e+03	7.52258e+03	-5.98551e+03	1.17306e+04	-7.65576e+03
3.430672	3.09264e+03	-1.87741e+03	4.96265e+03	-3.73632e+03	7.52073e+03	-5.98551e+03	1.17287e+04	-7.65576e+03
3.480646	3.09264e+03	-1.87556e+03	4.96450e+03	-3.73817e+03	7.52073e+03	-5.98366e+03	1.17287e+04	-7.65761e+03
3.53061	3.08894e+03	-1.87741e+03	4.96450e+03	-3.73447e+03	7.52258e+03	-5.98366e+03	1.17287e+04	-7.65576e+03
3.562932	3.09264e+03	-1.87741e+03	4.96265e+03	-3.73632e+03	7.52073e+03	-5.98551e+03	1.17287e+04	-7.65761e+03
3.612997	3.09449e+03	-1.87741e+03	4.96265e+03	-3.73817e+03	7.52073e+03	-5.98736e+03	1.17306e+04	-7.65761e+03
3.64743	3.09449e+03	-1.87926e+03	4.96080e+03	-3.73632e+03	7.52073e+03	-5.98551e+03	1.17287e+04	-7.65576e+03
3.695317	3.09264e+03	-1.87926e+03	4.96265e+03	-3.73632e+03	7.52073e+03	-5.98551e+03	1.17287e+04	-7.65761e+03
3.725092	3.09079e+03	-1.87926e+03	4.96450e+03	-3.73632e+03	7.52073e+03	-5.98551e+03	1.17287e+04	-7.65761e+03
3.775427	3.09264e+03	-1.88296e+03	4.96265e+03	-3.73447e+03	7.52073e+03	-5.98551e+03	1.17306e+04	-7.65761e+03
3.823084	3.09079e+03	-1.87926e+03	4.96265e+03	-3.73447e+03	7.52073e+03	-5.98551e+03	1.17306e+04	-7.65761e+03
3.848322	3.09264e+03	-1.87371e+03	4.96080e+03	-3.73632e+03	7.52073e+03	-5.98551e+03	1.17306e+04	-7.65761e+03
3.897343	3.09079e+03	-1.87741e+03	4.96080e+03	-3.73447e+03	7.52073e+03	-5.98551e+03	1.17287e+04	-7.65761e+03
3.929685	3.09079e+03	-1.87556e+03	4.96265e+03	-3.73632e+03	7.52073e+03	-5.98551e+03	1.17287e+04	-7.65761e+03
3.979685	3.09449e+03	-1.87741e+03	4.96080e+03	-3.73817e+03	7.52258e+03	-5.98551e+03	1.17287e+04	-7.65761e+03
4.013023	3.09079e+03	-1.87741e+03	4.96265e+03	-3.73632e+03	7.52073e+03	-5.98551e+03	1.17306e+04	-7.65576e+03
4.062621	3.09079e+03	-1.87741e+03	4.96265e+03	-3.73632e+03	7.52073e+03	-5.98551e+03	1.17287e+04	-7.65761e+03
4.109806	3.09079e+03	-1.87741e+03	4.96080e+03	-3.73632e+03	7.52258e+03	-5.98551e+03	1.17306e+04	-7.65761e+03
4.140692	3.09264e+03	-1.88111e+03	4.96080e+03	-3.73632e+03	7.52073e+03	-5.98551e+03	1.17306e+04	-7.65761e+03
4.187998	3.09449e+03	-1.88111e+03	4.96080e+03	-3.73817e+03	7.52073e+03	-5.98736e+03	1.17287e+04	-7.65761e+03
4.223536	3.09264e+03	-1.87741e+03	4.95895e+03	-3.73447e+03	7.52073e+03	-5.98551e+03	1.17287e+04	-7.65761e+03
4.263817	3.09264e+03	-1.87741e+03	4.96080e+03	-3.73447e+03	7.52073e+03	-5.98551e+03	1.17306e+04	-7.65761e+03
4.29705	3.09079e+03	-1.87926e+03	4.96080e+03	-3.73632e+03	7.52073e+03	-5.98551e+03	1.17287e+04	-7.65945e+03
4.348292	3.09264e+03	-1.88111e+03	4.96265e+03	-3.73632e+03	7.52258e+03	-5.98551e+03	1.17306e+04	-7.65761e+03
4.397267	3.09264e+03	-1.87926e+03	4.96080e+03	-3.73447e+03	7.52258e+03	-5.98551e+03	1.17287e+04	-7.65761e+03
4.42954	3.09449e+03	-1.87926e+03	4.96080e+03	-3.73632e+03	7.52073e+03	-5.98551e+03	1.17306e+04	-7.65761e+03
4.478574	3.09449e+03	-1.87926e+03	4.96080e+03	-3.73632e+03	7.52073e+03	-5.98551e+03	1.17306e+04	-7.65761e+03
4.505317	3.09264e+03	-1.87926e+03	4.96080e+03	-3.73632e+03	7.52073e+03	-5.98551e+03	1.17306e+04	-7.65761e+03
4.55907	3.09264e+03	-1.87926e+03	4.96080e+03	-3.73632e+03	7.52073e+03	-5.98551e+03	1.17306e+04	-7.65761e+03
4.590612	3.09079e+03	-1.87741e+03	4.96080e+03	-3.73447e+03	7.52258e+03	-5.98551e+03	1.17306e+04	-7.65761e+03
4.630513	3.09079e+03	-1.87556e+03	4.95895e+03	-3.73817e+03	7.52073e+03	-5.98551e+03	1.17287e+04	-7.65761e+03
4.679611	3.09449e+03	-1.87926e+03	4.95895e+03	-3.73817e+03	7.52073e+03	-5.98551e+03	1.17306e+04	-7.65761e+03
4.712958	3.09264e+03	-1.87926e+03	4.96080e+03	-3.73632e+03	7.52258e+03	-5.98551e+03	1.17306e+04	-7.65761e+03
4.762769	3.09264e+03	-1.87926e+03	4.96080e+03	-3.73632e+03	7.52073e+03	-5.98551e+03	1.17306e+04	-7.65761e+03
4.79721	3.09264e+03	-1.87926e+03	4.96265e+03	-3.73632e+03	7.52073e+03	-5.98551e+03	1.17287e+04	-7.65761e+03
4.84738	3.09264e+03	-1.88111e+03	4.96080e+03	-3.73632e+03	7.52073e+03	-5.98551e+03	1.17287e+04	-7.65761e+03
4.879508	3.09264e+03	-1.87926e+03	4.95895e+03	-3.73632e+03	7.52073e+03	-5.98551e+03	1.17287e+04	-7.65761e+03
4.926945	3.09264e+03	-1.87741e+03	4.96080e+03	-3.73817e+03	7.52073e+03	-5.98736e+03	1.17306e+04	-7.65761e+03
4.974868	3.09264e+03	-1.88111e+03	4.96265e+03	-3.73632e+03	7.52073e+03	-5.98736e+03	1.17306e+04	-7.65761e+03
5.007378	3.09264e+03	-1.87926e+03	4.96080e+03	-3.73632e+03	7.52073e+03	-5.98551e+03	1.17306e+04	-7.65761e+03
5.050375	3.09079e+03	-1.87926e+03	4.96080e+03	-3.73632e+03	7.52073e+03	-5.98551e+03	1.17306e+04	-7.65761e+03
5.08734	3.09264e+03	-1.87926e+03	4.96265e+03	-3.73447e+03	7.52073e+03	-5.98551e+03	1.17306e+04	-7.65761e+03
5.130172	3.09449e+03	-1.87741e+03	4.96265e+03	-3.73632e+03	7.52073e+03	-5.98551e+03	1.17306e+04	-7.65761e+03
5.163946	3.09449e+03	-1.88111e+03	4.96080e+03	-3.73817e+03	7.52073e+03	-5.98551e+03	1.17306e+04	-7.65761e+03
5.214806	3.09264e+03	-1.88111e+03	4.95895e+03	-3.73632e+03	7.52073e+03	-5.98551e+03	1.17306e+04	-7.65761e+03
5.263271	3.09264e+03	-1.88111e+03	4.96265e+03	-3.73632e+03	7.52073e+03	-5.98551e+03	1.17306e+04	-7.65761e+03
5.295801	3.09264e+03	-1.88111e+03	4.96080e+03	-3.73632e+03	7.52073e+03	-5.98551e+03	1.17306e+04	-7.65761e+03
5.340427	3.09079e+03	-1.87741e+03	4.96265e+03	-3.73632e+03	7.52073e+03	-5.98551e+03	1.17306e+04	-7.65761e+03
5.375375	3.09079e+03	-1.87556e+03	4.96265e+03	-3.73632e+03	7.52073e+03	-5.98551e+03	1.17306e+04	-7.65761e+03
5.423373	3.09079e+03	-1.87741e+03	4.95895e+03	-3.73632e+03	7.52073e+03	-5.98551e+03	1.17306e+04	-7.65761e+03
5.449245	3.09264e+03	-1.87741e+03	4.96080e+03	-3.73632e+03	7.52073e+03	-5.98551e+03	1.17306e+04	-7.65761e+03
5.497039	3.09449e+03	-1.87556e+03	4.96450e+03	-3.73632e+03	7.52073e+03	-5.98551e+03	1.17306e+04	-7.65761e+03
5.549154	3.09449e+03	-1.87926e+03	4.96265e+03	-3.73632e+03	7.52073e+03	-5.98551e+03	1.17306e+04	-7.65761e+03
5.579454	3.09449e+03	-1.88111e+03	4.96265e+03	-3.73262e+03	7.52073e+03	-5.98551e+03	1.17306e+04	-7.65761e+03
5.630139	3.09079e+03	-1.87741e+03	4.96265e+03	-3.73632e+03	7.52258e+03	-5.98551e+03	1.17287e+04	-7.65761e+03
5.662406	3.09264e+03	-1.87741e+03	4.96080e+03	-3.73632e+03	7.52073e+03	-5.98551e+03	1.17306e+04	-7.65761e+03
5.709308	3.09079e+03	-1.87926e+03	4.96080e+03	-3.73632e+03	7.52258e+03	-5.98366e+03	1.17306e+04	-7.65761e+03
5.743366	3.09449e+03	-1.87926e+03	4.96265e+03	-3.73632e+03	7.52073e+03	-5.98551e+03	1.17287e+04	-7.65761e+03
5.791345	3.09264e+03	-1.87741e+03	4.96265e+03	-3.73632e+03	7.52073e+03	-5.98551e+03	1.17306e+04	-7.65761e+03
5.830365	3.09264e+03	-1.87926e+03	4.96080e+03	-3.73447e+03	7.52073e+03	-5.98366e+03	1.17287e+04	-7.65761e+03
5.863908	3.09264e+03	-1.87556e+03	4.96080e+03	-3.73632e+03	7.52073e+03	-5.98551e+03	1.17287e+04	-7.65761e+03
5.912755	3.09264e+03	-1.87556e+03	4.96080e+03	-3.73447e+03	7.52073e+03	-5.98551e+03	1.17306e+04	-7.65576e+03
5.951345	3.09264e+03	-1.87556e+03	4.96265e+03	-3.73447e+03	7.52073e+03	-5.98551e+03	1.17287e+04	-7.65761e+03
5.997083	3.09079e+03	-1.87556e+03	4.96080e+03	-3.73632e+03	7.52073e+03	-5.98551e+03	1.17287e+04	-7.65761e+03
6.031358	3.09264e+03	-1.87556e+03	4.95895e+03	-3.73632e+03	7.52073e+03	-5.98366e+03	1.17306e+04	-7.65576e+03
6.079436	3.09264e+03	-1.87741e+03	4.96265e+03	-3.73447e+03	7.52073e+03	-5.98366e+03	1.17287e+04	-7.65761e+03
6.125933	3.09264e+03	-1.87741e+03	4.96080e+03	-3.73447e+03	7.52073e+03	-5.98551e+03	1.17287e+04	-7.65761e+03
6.151653	3.09079e+03	-1.87556e+03	4.96265e+03	-3.73632e+03	7.52073e+03	-5.98551e+03	1.17306e+04	-7.65761e+03
6.207366	3.09264e+03	-1.87741e+03	4.96265e+03	-3.73632e+03	7.52073e+03	-5.98551e+03	1.17287e+04	-7.65761e+03
6.230375	3.09449e+03	-1.87741e+03	4.96265e+03	-3.73632e+03	7.52073e+03	-5.98551e+03	1.17306e+04	-7.65761e+03
6.282577	3.09264e+03	-1.88111e+03	4.96080e+03	-3.73817e+03	7.52073e+03	-5.98551e+03	1.17306e+04	-7.65761e+03
6.318376	3.09079e+03	-1.87741e+03	4.96265e+03	-3.73817e+03	7.52258e+03	-5.98736e+03	1.17306e+04	-7.65761e+03
6.363624	3.09264e+03	-1.87741e+03	4.96265e+03	-3.73447e+03	7.52073e+03	-5.98551e+03	1.17287e+04	-7.65761e+03
6.41349	3.09264e+03	-1.87741e+03	4.96080e+03	-3.73262e+03	7.52073e+03	-5.98551e+03	1.17306e+04	-7.65761e+03
6.447347	3.09449e+03	-1.87926e+03	4.96080e+03	-3.73447e+03	7.52073e+03	-5.98551e+03	1.17287e+04	-7.65761e+03
6.494964	3.09449e+03	-1.87926e+03	4.96080e+03	-3.73632e+03	7.52073e+03	-5.98551e+03	1.17287e+04	-7.65761e+03
6.524873	3.09449e+03	-1.88111e+03	4.96265e+03	-3.73447e+03	7.52073e+03	-5.98551e+03	1.17306e+04	-7.65761e+03
6.573927	3.09264e+03	-1.87556e+03	4.96080e+03	-3.73817e+03	7.52073e+03	-5.98551e+03	1.17306e+04	-7.65761e+03
6.607332	3.09449e+03	-1.87741e+03	4.96080e+03	-3.73632e+03	7.52073e+03	-5.98736e+03	1.17306e+04	-7.65761e+03
6.652079	3.08894e+03	-1.87741e+03	4.96080e+03	-3.73632e+03	7.52073e+03	-5.98736e+03	1.17306e+04	-7.65761e+03
6.695738	3.09264e+03	-1.87556e+03	4.96080e+03	-3.73632e+03	7.52073e+03	-5.98551e+03	1.17306e+04	-7.65761e+03
6.730286	3.09449e+03	-1.88111e+03	4.96265e+03	-3.73632e+03	7.52073e+03	-5.98551e+03	1.17306e+04	-7.65761e+03
6.780265	3.09079e+03	-1.88111e+03	4.96080e+03	-3.73447e+03	7.52258e+03	-5.98366e+03	1.17306e+04	-7.65761e+03
6.815328	3.08894e+03	-1.87926e+03	4.95895e+03	-3.73632e+03	7.52073e+03	-5.98736e+03	1.17306e+04	-7.65761e+03
6.863325	3.09264e+03	-1.87741e+03	4.96080e+03	-3.73817e+03	7.52073e+03	-5.98736e+03	1.17306e+04	-7.65761e+03
6.894973	3.09264e+03	-1.87741e+03	4.96265e+03	-3.73632e+03	7.52073e+03	-5.98551e+03	1.17306e+04	-7.65576e+03
6.941805	3.09264e+03	-1.87741e+03	4.96265e+03	-3.73632e+03	7.52073e+03	-5.98736e+03	1.17287e+04	-7.65761e+03
6.991382	3.09264e+03	-1.87741e+03	4.96080e+03	-3.73632e+03	7.52258e+03	-5.98551e+03	1.17306e+04	-7.65761e+03
7.013575	3.09264e+03	-1.87556e+03	4.96080e+03	-3.73632e+03	7.52258e+03	-5.98551e+03	1.17306e+04	-7.65761e+03
7.06472	3.09264e+03	-1.87741e+03	4.96080e+03	-3.73632e+03	7.52073e+03	-5.98736e+03	1.17306e+04	-7.65761e+03
7.09594	3.09264e+03	-1.87741e+03	4.95895e+03	-3.73632e+03	7.52258e+03	-5.98551e+03	1.17306e+04	-7.65761e+03
7.151146	3.09079e+03	-1.87741e+03	4.95895e+03	-3.73447e+03	7.52258e+03	-5.98551e+03	1.17306e+04	-7.65761e+03
7.180206	3.09079e+03	-1.87926e+03	4.96080e+03	-3.73447e+03	7.52073e+03	-5.98736e+03	1.17287e+04	-7.65761e+03
7.230409	3.09264e+03	-1.88111e+03	4.96265e+03	-3.73632e+03	7.52073e+03	-5.98551e+03	1.17306e+04	-7.65761e+03
7.279222	3.09449e+03	-1.87926e+03	4.96265e+03	-3.73817e+03	7.52073e+03	-5.98551e+03	1.17306e+04	-7.65761e+03
7.308152	3.09634e+03	-1.87556e+03	4.96265e+03	-3.73632e+03	7.52073e+03	-5.98551e+03	1.17287e+04	-7.65761e+03
7.351524	3.09449e+03	-1.87926e+03	4.96080e+03	-3.73632e+03	7.52073e+03	-5.98551e+03	1.17306e+04	-7.65761e+03
7.391295	3.09264e+03	-1.87926e+03	4.96080e+03	-3.73632e+03	7.52073e+03	-5.98366e+03	1.17287e+04	-7.65761e+03
7.439128	3.09079e+03	-1.87926e+03	4.96080e+03	-3.73632e+03	7.52073e+03	-5.98551e+03	1.17287e+04	-7.65761e+03
7.462464	3.09079e+03	-1.88111e+03	4.96080e+03	-3.73632e+03	7.52258e+03	-5.98551e+03	1.17306e+04	-7.65761e+03
7.513668	3.09449e+03	-1.87741e+03	4.96080e+03	-3.73632e+03	7.52073e+03	-5.98551e+03	1.17306e+04	-7.65761e+03
7.562595	3.09264e+03	-1.87371e+03	4.95895e+03	-3.73817e+03	7.52073e+03	-5.98551e+03	1.17287e+04	-7.65761e+03
7.595859	3.09079e+03	-1.87371e+03	4.96080e+03	-3.73817e+03	7.52258e+03	-5.98551e+03	1.17306e+04	-7.65576e+03
7.647334	3.09449e+03	-1.87741e+03	4.96265e+03	-3.73632e+03	7.52073e+03	-5.98736e+03	1.17287e+04	-7.65761e+03
7.679186	3.09634e+03	-1.87741e+03	4.96080e+03	-3.73262e+03	7.52073e+03	-5.98551e+03	1.17306e+04	-7.65761e+03
7.724711	3.08894e+03	-1.87556e+03	4.96080e+03	-3.73447e+03	7.52258e+03	-5.98551e+03	1.17287e+04	-7.65761e+03
7.752211	3.09264e+03	-1.87741e+03	4.95895e+03	-3.73632e+03	7.52073e+03	-5.98551e+03	1.17306e+04	-7.65761e+03
7.806978	3.09449e+03	-1.87741e+03	4.95895e+03	-3.73632e+03	7.52073e+03	-5.98736e+03	1.17287e+04	-7.65761e+03
7.851319	3.09634e+03	-1.87741e+03	4.95895e+03	-3.73632e+03	7.52073e+03	-5.98736e+03	1.17306e+04	-7.65576e+03
7.880158	3.09264e+03	-1.87926e+03	4.96080e+03	-3.73632e+03	7.52073e+03	-5.98551e+03	1.17287e+04	-7.65761e+03
7.929156	3.09264e+03	-1.87926e+03	4.96080e+03	-3.73447e+03	7.52073e+03	-5.98551e+03	1.17306e+04	-7.65761e+03
7.963536	3.08894e+03	-1.87741e+03	4.96265e+03	-3.73632e+03	7.52258e+03	-5.98551e+03	1.17306e+04	-7.65761e+03
8.015283	3.09264e+03	-1.87556e+03	4.96265e+03	-3.73632e+03	7.52258e+03	-5.98551e+03	1.17306e+04	-7.65761e+03
8.047285	3.09449e+03	-1.87741e+03	4.95895e+03	-3.73632e+03	7.52258e+03	-5.98551e+03	1.17306e+04	-7.65761e+03
8.095405	3.09079e+03	-1.87741e+03	4.95895e+03	-3.73632e+03	7.52073e+03	-5.98366e+03	1.17306e+04	-7.65761e+03
8.12732	3.09264e+03	-1.87741e+03	4.96265e+03	-3.73817e+03	7.52073e+03	-5.98551e+03	1.17287e+04	-7.65761e+03
8.175254	3.09634e+03	-1.87926e+03	4.96265e+03	-3.73632e+03	7.52073e+03	-5.98736e+03	1.17287e+04	-7.65761e+03
8.223137	3.09449e+03	-1.88111e+03	4.96265e+03	-3.73632e+03	7.52073e+03	-5.98551e+03	1.17306e+04	-7.65576e+03
8.255285	3.09264e+03	-1.88111e+03	4.96080e+03	-3.73632e+03	7.52073e+03	-5.98551e+03	1.17287e+04	-7.65761e+03
8.302894	3.09449e+03	-1.88111e+03	4.96265e+03	-3.73632e+03	7.52073e+03	-5.98551e+03	1.17287e+04	-7.65576e+03
8.334809	3.09264e+03	-1.87741e+03	4.96080e+03	-3.73632e+03	7.52073e+03	-5.98551e+03	1.17287e+04	-7.65761e+03
8.38271	3.09449e+03	-1.87926e+03	4.95895e+03	-3.73632e+03	7.52073e+03	-5.98551e+03	1.17287e+04	-7.65761e+03
8.414597	3.09264e+03	-1.88296e+03	4.96265e+03	-3.73632e+03	7.52073e+03	-5.98551e+03	1.17287e+04	-7.65761e+03
8.462662	3.09264e+03	-1.87926e+03	4.96080e+03	-3.73447e+03	7.52073e+03	-5.98366e+03	1.17287e+04	-7.65761e+03
8.511529	3.09449e+03	-1.87556e+03	4.96080e+03	-3.73447e+03	7.52073e+03	-5.98366e+03	1.17287e+04	-7.65945e+03
8.543444	3.09264e+03	-1.87741e+03	4.96080e+03	-3.73632e+03	7.52258e+03	-5.98551e+03	1.17287e+04	-7.65576e+03
8.591317	3.09449e+03	-1.87926e+03	4.96080e+03	-3.73817e+03	7.52073e+03	-5.98551e+03	1.17287e+04	-7.65761e+03
8.623279	3.09079e+03	-1.87741e+03	4.96265e+03	-3.73817e+03	7.52073e+03	-5.98551e+03	1.17287e+04	-7.65761e+03
8.671323	3.08894e+03	-1.87926e+03	4.96265e+03	-3.73632e+03	7.52258e+03	-5.98366e+03	1.17306e+04	-7.65576e+03
8.703238	3.09264e+03	-1.87741e+03	4.96265e+03	-3.73447e+03	7.52073e+03	-5.98551e+03	1.17306e+04	-7.65761e+03
8.751261	3.09449e+03	-1.87371e+03	4.96265e+03	-3.73632e+03	7.52073e+03	-5.98551e+03	1.17306e+04	-7.65761e+03
8.799028	3.09079e+03	-1.87741e+03	4.96265e+03	-3.73632e+03	7.52073e+03	-5.98551e+03	1.17306e+04	-7.65576e+03
8.831274	3.09079e+03	-1.87926e+03	4.96080e+03	-3.73447e+03	7.52073e+03	-5.98551e+03	1.17287e+04	-7.65761e+03
8.878814	3.09264e+03	-1.87926e+03	4.96080e+03	-3.73632e+03	7.52073e+03	-5.98551e+03	1.17306e+04	-7.65761e+03
8.911339	3.09449e+03	-1.88111e+03	4.96080e+03	-3.73817e+03	7.52258e+03	-5.98366e+03	1.17306e+04	-7.65761e+03
8.958788	3.09449e+03	-1.87926e+03	4.96080e+03	-3.73447e+03	7.52073e+03	-5.98551e+03	1.17306e+04	-7.65761e+03
8.991272	3.09449e+03	-1.87926e+03	4.96080e+03	-3.73632e+03	7.52073e+03	-5.98551e+03	1.17287e+04	-7.65761e+03
9.038608	3.09264e+03	-1.87556e+03	4.96080e+03	-3.73632e+03	7.52258e+03	-5.98551e+03	1.17306e+04	-7.65761e+03
9.087331	3.09264e+03	-1.87556e+03	4.96080e+03	-3.73817e+03	7.52073e+03	-5.98736e+03	1.17287e+04	-7.65761e+03
9.119104	3.09264e+03	-1.87926e+03	4.96265e+03	-3.73632e+03	7.52073e+03	-5.98551e+03	1.17306e+04	-7.65761e+03
9.164048	3.09264e+03	-1.87741e+03	4.96265e+03	-3.73817e+03	7.52073e+03	-5.98551e+03	1.17306e+04	-7.65761e+03
9.195843	3.09264e+03	-1.87741e+03	4.96080e+03	-3.73817e+03	7.52258e+03	-5.98551e+03	1.17306e+04	-7.65761e+03
9.247238	3.09264e+03	-1.87926e+03	4.96080e+03	-3.73632e+03	7.52073e+03	-5.98551e+03	1.17306e+04	-7.65761e+03
9.279107	3.09079e+03	-1.87926e+03	4.96080e+03	-3.73447e+03	7.52258e+03	-5.98551e+03	1.17306e+04	-7.65576e+03
9.324792	3.09264e+03	-1.87926e+03	4.96080e+03	-3.73632e+03	7.52073e+03	-5.98736e+03	1.17287e+04	-7.65761e+03
9.374435	3.09079e+03	-1.87741e+03	4.96080e+03	-3.73632e+03	7.52073e+03	-5.98551e+03	1.17306e+04	-7.65761e+03
9.407244	3.08894e+03	-1.87741e+03	4.96080e+03	-3.73632e+03	7.52073e+03	-5.98551e+03	1.17306e+04	-7.65576e+03
9.446687	3.09264e+03	-1.87741e+03	4.96265e+03	-3.73632e+03	7.52073e+03	-5.98736e+03	1.17287e+04	-7.65761e+03
9.481002	3.09079e+03	-1.87926e+03	4.96080e+03	-3.73632e+03	7.52073e+03	-5.98551e+03	1.17306e+04	-7.65761e+03
9.528987	3.09079e+03	-1.87926e+03	4.96265e+03	-3.73632e+03	7.52073e+03	-5.98551e+03	1.17306e+04	-7.65576e+03
9.562371	3.09079e+03	-1.87741e+03	4.96265e+03	-3.73632e+03	7.52073e+03	-5.98736e+03	1.17287e+04	-7.65761e+03
9.615245	3.09264e+03	-1.87741e+03	4.96080e+03	-3.73447e+03	7.52073e+03	-5.98736e+03	1.17287e+04	-7.65761e+03
9.663245	3.09079e+03	-1.87741e+03	4.95895e+03	-3.73632e+03	7.52073e+03	-5.98736e+03	1.17306e+04	-7.65761e+03
9.695132	3.09264e+03	-1.87556e+03	4.96265e+03	-3.73632e+03	7.52073e+03	-5.98551e+03	1.17306e+04	-7.65761e+03
9.741866	3.09079e+03	-1.87741e+03	4.96080e+03	-3.73632e+03	7.52258e+03	-5.98551e+03	1.17306e+04	-7.65761e+03
9.77524	3.09264e+03	-1.87556e+03	4.95895e+03	-3.73447e+03	7.52258e+03	-5.98551e+03	1.17306e+04	-7.65761e+03
9.823374	3.09264e+03	-1.87741e+03	4.96080e+03	-3.73817e+03	7.52258e+03	-5.98551e+03	1.17306e+04	-7.65761e+03
9.846611	3.09264e+03	-1.87741e+03	4.96265e+03	-3.73447e+03	7.52073e+03	-5.98736e+03	1.17306e+04	-7.65761e+03
9.896805	3.09264e+03	-1.87741e+03	4.96265e+03	-3.73632e+03	7.52073e+03	-5.98736e+03	1.17306e+04	-7.65761e+03
9.946604	3.09449e+03	-1.87741e+03	4.96265e+03	-3.73632e+03	7.52073e+03	-5.98551e+03	1.17306e+04	-7.65761e+03
9.981146	3.09264e+03	-1.87926e+03	4.96080e+03	-3.73632e+03	7.52073e+03	-5.98551e+03	1.17306e+04	-7.65761e+03
10.029097	3.09264e+03	-1.87741e+03	4.96265e+03	-3.73632e+03	7.52258e+03	-5.98551e+03	1.17306e+04	-7.65761e+03
10.063221	3.09264e+03	-1.87741e+03	4.96080e+03	-3.73632e+03	7.52258e+03	-5.98736e+03	1.17306e+04	-7.65761e+03
10.111237	3.09264e+03	-1.87926e+03	4.96080e+03	-3.73632e+03	7.52073e+03	-5.98551e+03	1.17306e+04	-7.65761e+03
10.143193	3.09079e+03	-1.88111e+03	4.96265e+03	-3.73632e+03	7.52258e+03	-5.98551e+03	1.17306e+04	-7.65761e+03
10.19122	3.09079e+03	-1.87741e+03	4.96265e+03	-3.73632e+03	7.52073e+03	-5.98551e+03	1.17306e+04	-7.65761e+03
10.231513	3.08894e+03	-1.87741e+03	4.96265e+03	-3.73632e+03	7.52258e+03	-5.98551e+03	1.17306e+04	-7.65761e+03
10.262307	3.09449e+03	-1.87741e+03	4.96450e+03	-3.73632e+03	7.52073e+03	-5.98551e+03	1.17306e+04	-7.65761e+03
10.313166	3.09449e+03	-1.88111e+03	4.96265e+03	-3.73632e+03	7.52258e+03	-5.98736e+03	1.17306e+04	-7.65761e+03
10.346531	3.09264e+03	-1.88111e+03	4.96265e+03	-3.73447e+03	7.52258e+03	-5.98551e+03	1.17306e+04	-7.65761e+03
10.395244	3.09264e+03	-1.87741e+03	4.96450e+03	-3.73632e+03	7.52258e+03	-5.98551e+03	1.17306e+04	-7.65761e+03
10.431239	3.09264e+03	-1.87926e+03	4.96265e+03	-3.73632e+03	7.52258e+03	-5.98551e+03	1.17306e+04	-7.65761e+03
10.478826	3.09264e+03	-1.87741e+03	4.96265e+03	-3.73447e+03	7.52258e+03	-5.98551e+03	1.17306e+04	-7.65761e+03
10.525256	3.09634e+03	-1.87371e+03	4.96265e+03	-3.73632e+03	7.52073e+03	-5.98551e+03	1.17306e+04	-7.65761e+03
10.559228	3.09449e+03	-1.87741e+03	4.96080e+03	-3.73632e+03	7.52258e+03	-5.98551e+03	1.17306e+04	-7.65761e+03
10.607225	3.09079e+03	-1.87926e+03	4.96080e+03	-3.73632e+03	7.52258e+03	-5.98736e+03	1.17306e+04	-7.65761e+03
10.629807	3.09079e+03	-1.87926e+03	4.96080e+03	-3.73817e+03	7.52258e+03	-5.98551e+03	1.17306e+04	-7.65761e+03
10.681603	3.09449e+03	-1.87741e+03	4.96265e+03	-3.73632e+03	7.52258e+03	-5.98736e+03	1.17306e+04	-7.65761e+03
10.713157	3.09449e+03	-1.87741e+03	4.96265e+03	-3.73447e+03	7.52258e+03	-5.98551e+03	1.17306e+04	-7.65761e+03
10.762149	3.09449e+03	-1.87556e+03	4.96450e+03	-3.73447e+03	7.52258e+03	-5.98551e+03	1.17306e+04	-7.65761e+03
10.812934	3.09264e+03	-1.87926e+03	4.96265e+03	-3.73632e+03	7.52258e+03	-5.98551e+03	1.17306e+04	-7.65761e+03
10.8472	3.09264e+03	-1.87926e+03	4.96265e+03	-3.73632e+03	7.52258e+03	-5.98551e+03	1.17306e+04	-7.65761e+03
10.894464	3.09449e+03	-1.87741e+03	4.96265e+03	-3.73632e+03	7.52258e+03	-5.98551e+03	1.17306e+04	-7.65761e+03
10.924647	3.09449e+03	-1.87926e+03	4.96265e+03	-3.73447e+03	7.52258e+03	-5.98551e+03	1.17306e+04	-7.65761e+03
10.973363	3.09079e+03	-1.87926e+03	4.96450e+03	-3.73632e+03	7.52258e+03	-5.98736e+03	1.17306e+04	-7.65761e+03
11.007244	3.09264e+03	-1.87741e+03	4.96265e+03	-3.73817e+03	7.52258e+03	-5.98551e+03	1.17306e+04	-7.65761e+03
11.045468	3.09449e+03	-1.88111e+03	4.96265e+03	-3.73817e+03	7.52073e+03	-5.98551e+03	1.17306e+04	-7.65761e+03
11.096443	3.09449e+03	-1.88111e+03	4.96080e+03	-3.73817e+03	7.52073e+03	-5.98551e+03	1.17306e+04	-7.65576e+03
11.129793	3.09449e+03	-1.87926e+03	4.96080e+03	-3.73817e+03	7.52073e+03	-5.98736e+03	1.17324e+04	-7.65761e+03
11.178815	3.09264e+03	-1.87926e+03	4.96265e+03	-3.73632e+03	7.52258e+03	-5.98551e+03	1.17324e+04	-7.65761e+03
11.212122	3.09079e+03	-1.88111e+03	4.96450e+03	-3.73632e+03	7.52258e+03	-5.98551e+03	1.17306e+04	-7.65761e+03
11.263205	3.09079e+03	-1.87926e+03	4.96265e+03	-3.73817e+03	7.52258e+03	-5.98551e+03	1.17324e+04	-7.65945e+03
11.294466	3.09079e+03	-1.87556e+03	4.96080e+03	-3.73447e+03	7.52258e+03	-5.98551e+03	1.17306e+04	-7.65761e+03
11.343187	3.09264e+03	-1.87926e+03	4.96450e+03	-3.73817e+03	7.52258e+03	-5.98551e+03	1.17306e+04	-7.65761e+03
11.389886	3.09264e+03	-1.87926e+03	4.96450e+03	-3.73817e+03	7.52258e+03	-5.98736e+03	1.17306e+04	-7.65761e+03
11.423251	3.09264e+03	-1.88111e+03	4.96450e+03	-3.73447e+03	7.52258e+03	-5.98551e+03	1.17306e+04	-7.65761e+03
11.47046	3.09449e+03	-1.87926e+03	4.96450e+03	-3.73447e+03	7.52258e+03	-5.98551e+03	1.17306e+04	-7.65761e+03
11.496336	3.09449e+03	-1.87741e+03	4.96080e+03	-3.73447e+03	7.52258e+03	-5.98551e+03	1.17306e+04	-7.65761e+03
11.545427	3.09264e+03	-1.88111e+03	4.96080e+03	-3.73632e+03	7.52258e+03	-5.98366e+03	1.17306e+04	-7.65761e+03
11.578826	3.09449e+03	-1.87926e+03	4.96265e+03	-3.73447e+03	7.52073e+03	-5.98551e+03	1.17306e+04	-7.65761e+03
11.631186	3.09634e+03	-1.87926e+03	4.96080e+03	-3.73632e+03	7.52258e+03	-5.98551e+03	1.17324e+04	-7.65761e+03
11.678502	3.09449e+03	-1.87926e+03	4.96265e+03	-3.73447e+03	7.52258e+03	-5.98551e+03	1.17324e+04	-7.65761e+03
11.711252	3.09634e+03	-1.87926e+03	4.96265e+03	-3.73632e+03	7.52258e+03	-5.98551e+03	1.17306e+04	-7.65761e+03
11.759182	3.09449e+03	-1.88111e+03	4.96265e+03	-3.73632e+03	7.52073e+03	-5.98736e+03	1.17306e+04	-7.65761e+03
11.788019	3.09079e+03	-1.87741e+03	4.96265e+03	-3.73632e+03	7.52258e+03	-5.98551e+03	1.17306e+04	-7.65576e+03
11.833651	3.09264e+03	-1.87556e+03	4.96265e+03	-3.74002e+03	7.52258e+03	-5.98736e+03	1.17324e+04	-7.65761e+03
11.863865	3.09634e+03	-1.87371e+03	4.96265e+03	-3.73817e+03	7.52258e+03	-5.98736e+03	1.17306e+04	-7.65761e+03
11.912046	3.09264e+03	-1.87741e+03	4.96080e+03	-3.73632e+03	7.52258e+03	-5.98551e+03	1.17306e+04	-7.65761e+03
11.962975	3.09079e+03	-1.87741e+03	4.96265e+03	-3.73632e+03	7.52073e+03	-5.98551e+03	1.17306e+04	-7.65945e+03
11.996053	3.09079e+03	-1.87926e+03	4.96265e+03	-3.73632e+03	7.52258e+03	-5.98736e+03	1.17306e+04	-7.65761e+03
12.047171	3.09079e+03	-1.87926e+03	4.96265e+03	-3.73632e+03	7.52258e+03	-5.98366e+03	1.17324e+04	-7.65761e+03
12.078659	3.09079e+03	-1.87926e+03	4.96080e+03	-3.73632e+03	7.52073e+03	-5.98551e+03	1.17306e+04	-7.65945e+03
12.127167	3.09449e+03	-1.87926e+03	4.96080e+03	-3.73817e+03	7.52258e+03	-5.98551e+03	1.17324e+04	-7.65761e+03
12.157468	3.09449e+03	-1.87556e+03	4.96265e+03	-3.73632e+03	7.52258e+03	-5.98551e+03	1.17306e+04	-7.65576e+03
12.207166	3.09264e+03	-1.87741e+03	4.96080e+03	-3.73817e+03	7.52258e+03	-5.98551e+03	1.17306e+04	-7.65761e+03
12.245372	3.09264e+03	-1.87926e+03	4.96265e+03	-3.73632e+03	7.52258e+03	-5.98551e+03	1.17306e+04	-7.65761e+03
12.278654	3.09264e+03	-1.88111e+03	4.96265e+03	-3.73632e+03	7.52258e+03	-5.98551e+03	1.17306e+04	-7.65761e+03
12.329618	3.09449e+03	-1.88111e+03	4.96080e+03	-3.73632e+03	7.52258e+03	-5.98736e+03	1.17306e+04	-7.65761e+03
12.362988	3.09449e+03	-1.87741e+03	4.96080e+03	-3.73817e+03	7.52258e+03	-5.98551e+03	1.17324e+04	-7.65761e+03
12.412001	3.09264e+03	-1.87556e+03	4.96265e+03	-3.73632e+03	7.52073e+03	-5.98551e+03	1.17306e+04	-7.65761e+03
12.446381	3.09264e+03	-1.87556e+03	4.96265e+03	-3.73817e+03	7.52073e+03	-5.98551e+03	1.17324e+04	-7.65761e+03
12.495247	3.09264e+03	-1.87926e+03	4.96265e+03	-3.73632e+03	7.52258e+03	-5.98551e+03	1.17306e+04	-7.65761e+03
12.527354	3.09264e+03	-1.87741e+03	4.96265e+03	-3.73817e+03	7.52073e+03	-5.98551e+03	1.17306e+04	-7.65761e+03
12.574036	3.09634e+03	-1.87741e+03	4.96080e+03	-3.73632e+03	7.52073e+03	-5.98551e+03	1.17306e+04	-7.65945e+03
12.623035	3.09264e+03	-1.87741e+03	4.96080e+03	-3.73632e+03	7.52258e+03	-5.98551e+03	1.17306e+04	-7.65761e+03
12.655352	3.09079e+03	-1.87926e+03	4.96265e+03	-3.73632e+03	7.52258e+03	-5.98551e+03	1.17306e+04	-7.65761e+03
12.695259	3.09449e+03	-1.87741e+03	4.95895e+03	-3.73632e+03	7.52258e+03	-5.98736e+03	1.17306e+04	-7.65761e+03
12.72861	3.09079e+03	-1.87926e+03	4.96080e+03	-3.73447e+03	7.52258e+03	-5.98551e+03	1.17306e+04	-7.65761e+03
12.778638	3.09079e+03	-1.87556e+03	4.96265e+03	-3.73817e+03	7.52258e+03	-5.98551e+03	1.17306e+04	-7.65761e+03
12.812943	3.09634e+03	-1.87741e+03	4.96080e+03	-3.73817e+03	7.52258e+03	-5.98551e+03	1.17306e+04	-7.65761e+03
12.862888	3.09264e+03	-1.87926e+03	4.96265e+03	-3.73447e+03	7.52258e+03	-5.98551e+03	1.17306e+04	-7.65761e+03
12.911408	3.09264e+03	-1.87926e+03	4.96265e+03	-3.73632e+03	7.52258e+03	-5.98551e+03	1.17306e+04	-7.65761e+03
12.940626	3.09634e+03	-1.88111e+03	4.96080e+03	-3.73632e+03	7.52258e+03	-5.98551e+03	1.17306e+04	-7.65761e+03
12.990965	3.09264e+03	-1.88111e+03	4.96265e+03	-3.73632e+03	7.52073e+03	-5.98736e+03	1.17306e+04	-7.65761e+03
13.022992	3.09449e+03	-1.87371e+03	4.96265e+03	-3.73632e+03	7.52073e+03	-5.98736e+03	1.17306e+04	-7.65761e+03
13.065004	3.09264e+03	-1.87556e+03	4.96265e+03	-3.73632e+03	7.52073e+03	-5.98736e+03	1.17306e+04	-7.65761e+03
13.095259	3.09264e+03	-1.87926e+03	4.96265e+03	-3.73632e+03	7.52258e+03	-5.98551e+03	1.17306e+04	-7.65761e+03
13.146189	3.09264e+03	-1.88111e+03	4.96080e+03	-3.73632e+03	7.52258e+03	-5.98551e+03	1.17306e+04	-7.65761e+03
13.195249	3.09449e+03	-1.87926e+03	4.96450e+03	-3.73632e+03	7.52258e+03	-5.98551e+03	1.17306e+04	-7.65761e+03
13.228552	3.09449e+03	-1.87926e+03	4.96450e+03	-3.73447e+03	7.52258e+03	-5.98551e+03	1.17306e+04	-7.65576e+03
13.278507	3.09264e+03	-1.87741e+03	4.96080e+03	-3.73447e+03	7.52258e+03	-5.98551e+03	1.17306e+04	-7.65761e+03
13.310899	3.09264e+03	-1.87926e+03	4.96080e+03	-3.73632e+03	7.52258e+03	-5.98551e+03	1.17306e+04	-7.65761e+03
13.357263	3.08894e+03	-1.87926e+03	4.95895e+03	-3.73817e+03	7.52258e+03	-5.98551e+03	1.17306e+04	-7.65761e+03
13.383153	3.09079e+03	-1.87556e+03	4.95895e+03	-3.73817e+03	7.52258e+03	-5.98551e+03	1.17306e+04	-7.65761e+03
13.438722	3.08894e+03	-1.87556e+03	4.96265e+03	-3.73817e+03	7.52258e+03	-5.98551e+03	1.17306e+04	-7.65761e+03
13.479483	3.09264e+03	-1.87926e+03	4.96450e+03	-3.73632e+03	7.52258e+03	-5.98551e+03	1.17306e+04	-7.65761e+03
13.512833	3.09264e+03	-1.87741e+03	4.96265e+03	-3.73817e+03	7.52258e+03	-5.98551e+03	1.17306e+04	-7.65761e+03
13.563833	3.09449e+03	-1.87926e+03	4.96080e+03	-3.73447e+03	7.52073e+03	-5.98551e+03	1.17306e+04	-7.65761e+03
13.594944	3.09634e+03	-1.87741e+03	4.96265e+03	-3.73632e+03	7.52258e+03	-5.98551e+03	1.17306e+04	-7.65576e+03
13.647139	3.09449e+03	-1.87741e+03	4.96265e+03	-3.73632e+03	7.52073e+03	-5.98551e+03	1.17306e+04	-7.65761e+03
13.678436	3.09449e+03	-1.87926e+03	4.96080e+03	-3.73447e+03	7.52258e+03	-5.98551e+03	1.17306e+04	-7.65761e+03
13.722881	3.09264e+03	-1.87926e+03	4.96265e+03	-3.73447e+03	7.52258e+03	-5.98551e+03	1.17306e+04	-7.65761e+03
13.77513	3.09264e+03	-1.88111e+03	4.96265e+03	-3.73632e+03	7.52258e+03	-5.98551e+03	1.17306e+04	-7.65945e+03
13.807092	3.09264e+03	-1.88111e+03	4.96080e+03	-3.73447e+03	7.52258e+03	-5.98551e+03	1.17306e+04	-7.65761e+03
13.846077	3.09079e+03	-1.87741e+03	4.96080e+03	-3.73632e+03	7.52073e+03	-5.98551e+03	1.17306e+04	-7.65761e+03
13.878924	3.09264e+03	-1.87741e+03	4.96265e+03	-3.73817e+03	7.52258e+03	-5.98551e+03	1.17306e+04	-7.65761e+03
13.934961	3.09079e+03	-1.87741e+03	4.96080e+03	-3.73817e+03	7.52258e+03	-5.98551e+03	1.17306e+04	-7.65761e+03
13.96662	3.09079e+03	-1.87741e+03	4.96265e+03	-3.73632e+03	7.52258e+03	-5.98551e+03	1.17306e+04	-7.65761e+03
14.012987	3.09079e+03	-1.87741e+03	4.96265e+03	-3.73632e+03	7.52073e+03	-5.98551e+03	1.17306e+04	-7.65761e+03
14.061811	3.09449e+03	-1.87926e+03	4.96265e+03	-3.73447e+03	7.52073e+03	-5.98366e+03	1.17306e+04	-7.65761e+03
14.09511	3.09449e+03	-1.87556e+03	4.96265e+03	-3.73632e+03	7.52073e+03	-5.98551e+03	1.17306e+04	-7.65761e+03
14.140312	3.09264e+03	-1.87741e+03	4.96265e+03	-3.73632e+03	7.52258e+03	-5.98551e+03	1.17306e+04	-7.65761e+03
14.1745	3.09449e+03	-1.88111e+03	4.96080e+03	-3.73447e+03	7.52258e+03	-5.98551e+03	1.17306e+04	-7.65761e+03
14.223121	3.09449e+03	-1.88111e+03	4.96265e+03	-3.73447e+03	7.52258e+03	-5.98551e+03	1.17306e+04	-7.65761e+03
14.245048	3.09264e+03	-1.88111e+03	4.96265e+03	-3.73632e+03	7.52258e+03	-5.98551e+03	1.17287e+04	-7.65761e+03
14.295093	3.09079e+03	-1.87926e+03	4.96450e+03	-3.73632e+03	7.52258e+03	-5.98551e+03	1.17306e+04	-7.65761e+03
14.346033	3.09079e+03	-1.87741e+03	4.96265e+03	-3.73632e+03	7.52073e+03	-5.98551e+03	1.17306e+04	-7.65761e+03
14.379387	3.09079e+03	-1.87926e+03	4.95895e+03	-3.73632e+03	7.52073e+03	-5.98551e+03	1.17306e+04	-7.65761e+03
14.42851	3.09079e+03	-1.87926e+03	4.95895e+03	-3.73447e+03	7.52258e+03	-5.98736e+03	1.17306e+04	-7.65761e+03
14.463104	3.09264e+03	-1.88111e+03	4.96080e+03	-3.73632e+03	7.52073e+03	-5.98551e+03	1.17306e+04	-7.65761e+03
14.510689	3.09079e+03	-1.87926e+03	4.96265e+03	-3.73632e+03	7.52073e+03	-5.98551e+03	1.17306e+04	-7.65761e+03
14.540732	3.09079e+03	-1.88111e+03	4.96450e+03	-3.73632e+03	7.52258e+03	-5.98551e+03	1.17306e+04	-7.65761e+03
14.591108	3.09449e+03	-1.87371e+03	4.96080e+03	-3.73632e+03	7.52073e+03	-5.98551e+03	1.17306e+04	-7.65761e+03
14.638816	3.09449e+03	-1.87741e+03	4.96265e+03	-3.73632e+03	7.52258e+03	-5.98551e+03	1.17306e+04	-7.65761e+03
14.666254	3.09079e+03	-1.88111e+03	4.96265e+03	-3.73632e+03	7.52073e+03	-5.98551e+03	1.17306e+04	-7.65761e+03
14.711676	3.09449e+03	-1.87741e+03	4.96265e+03	-3.73447e+03	7.52073e+03	-5.98551e+03	1.17287e+04	-7.65761e+03
14.74504	3.09264e+03	-1.87926e+03	4.96080e+03	-3.73632e+03	7.52073e+03	-5.98551e+03	1.17306e+04	-7.65761e+03
14.795081	3.09264e+03	-1.87926e+03	4.96265e+03	-3.73632e+03	7.52258e+03	-5.98366e+03	1.17306e+04	-7.65576e+03
14.828371	3.09449e+03	-1.88296e+03	4.96450e+03	-3.73632e+03	7.52073e+03	-5.98551e+03	1.17306e+04	-7.65761e+03
14.879087	3.09264e+03	-1.88111e+03	4.96265e+03	-3.73632e+03	7.52073e+03	-5.98551e+03	1.17306e+04	-7.65761e+03
14.924724	3.09264e+03	-1.87926e+03	4.96265e+03	-3.73632e+03	7.52073e+03	-5.98551e+03	1.17287e+04	-7.65576e+03
14.951095	3.09079e+03	-1.87556e+03	4.96265e+03	-3.74002e+03	7.52073e+03	-5.98551e+03	1.17306e+04	-7.65761e+03
15.001893	3.09079e+03	-1.87741e+03	4.96080e+03	-3.73632e+03	7.52258e+03	-5.98551e+03	1.17306e+04	-7.65761e+03
15.038536	3.09079e+03	-1.87926e+03	4.96080e+03	-3.73632e+03	7.52073e+03	-5.98551e+03	1.17306e+04	-7.65761e+03
15.080108	3.09264e+03	-1.87741e+03	4.96080e+03	-3.73817e+03	7.52073e+03	-5.98551e+03	1.17306e+04	-7.65761e+03
15.111423	3.09264e+03	-1.87741e+03	4.96265e+03	-3.73632e+03	7.52258e+03	-5.98366e+03	1.17306e+04	-7.65761e+03
15.165518	3.09449e+03	-1.87741e+03	4.96265e+03	-3.73632e+03	7.52073e+03	-5.98551e+03	1.17306e+04	-7.65761e+03
15.211658	3.09449e+03	-1.87926e+03	4.96080e+03	-3.73632e+03	7.52073e+03	-5.98551e+03	1.17306e+04	-7.65761e+03
15.24709	3.09264e+03	-1.88111e+03	4.96265e+03	-3.73817e+03	7.52258e+03	-5.98551e+03	1.17306e+04	-7.65761e+03
15.295138	3.09264e+03	-1.87741e+03	4.96080e+03	-3.73632e+03	7.52258e+03	-5.98551e+03	1.17287e+04	-7.65761e+03
15.324716	3.09079e+03	-1.87926e+03	4.96080e+03	-3.73632e+03	7.52073e+03	-5.98551e+03	1.17306e+04	-7.65761e+03
15.374772	3.09079e+03	-1.88111e+03	4.96080e+03	-3.73632e+03	7.52258e+03	-5.98366e+03	1.17306e+04	-7.65761e+03
15.40715	3.09264e+03	-1.87741e+03	4.96265e+03	-3.73447e+03	7.52258e+03	-5.98551e+03	1.17287e+04	-7.65761e+03
15.445885	3.09634e+03	-1.87556e+03	4.95895e+03	-3.73632e+03	7.52073e+03	-5.98551e+03	1.17306e+04	-7.65761e+03
15.494989	3.09449e+03	-1.87556e+03	4.96080e+03	-3.73447e+03	7.52258e+03	-5.98551e+03	1.17306e+04	-7.65761e+03
15.528336	3.09264e+03	-1.87741e+03	4.96080e+03	-3.73447e+03	7.52073e+03	-5.98551e+03	1.17306e+04	-7.65761e+03
15.579226	3.09449e+03	-1.87926e+03	4.96265e+03	-3.73632e+03	7.52073e+03	-5.98551e+03	1.17287e+04	-7.65761e+03
15.612562	3.09264e+03	-1.87741e+03	4.96265e+03	-3.73632e+03	7.52258e+03	-5.98551e+03	1.17306e+04	-7.65761e+03
15.663064	3.09634e+03	-1.87741e+03	4.96080e+03	-3.73817e+03	7.52258e+03	-5.98551e+03	1.17306e+04	-7.65761e+03
15.695083	3.09449e+03	-1.87926e+03	4.96080e+03	-3.73632e+03	7.52073e+03	-5.98366e+03	1.17287e+04	-7.65761e+03
15.741532	3.09264e+03	-1.87926e+03	4.96080e+03	-3.73632e+03	7.52258e+03	-5.98366e+03	1.17287e+04	-7.65761e+03
15.791066	3.09079e+03	-1.87741e+03	4.96080e+03	-3.73632e+03	7.52258e+03	-5.98366e+03	1.17306e+04	-7.65761e+03
15.823071	3.09079e+03	-1.87926e+03	4.96080e+03	-3.73632e+03	7.52073e+03	-5.98551e+03	1.17306e+04	-7.65761e+03
15.864583	3.09079e+03	-1.87741e+03	4.96080e+03	-3.73632e+03	7.52258e+03	-5.98551e+03	1.17306e+04	-7.65576e+03
15.894905	3.09634e+03	-1.87556e+03	4.96080e+03	-3.73632e+03	7.52073e+03	-5.98551e+03	1.17306e+04	-7.65761e+03
15.945086	3.09634e+03	-1.87741e+03	4.96080e+03	-3.73632e+03	7.52258e+03	-5.98551e+03	1.17306e+04	-7.65761e+03
15.979153	3.09264e+03	-1.87741e+03	4.96265e+03	-3.73447e+03	7.52073e+03	-5.98551e+03	1.17306e+04	-7.65761e+03
16.028277	3.09449e+03	-1.87741e+03	4.96265e+03	-3.73632e+03	7.52073e+03	-5.98551e+03	1.17306e+04	-7.65761e+03
16.079167	3.09079e+03	-1.87926e+03	4.96080e+03	-3.73447e+03	7.52258e+03	-5.98551e+03	1.17306e+04	-7.65761e+03
16.110529	3.09264e+03	-1.87741e+03	4.96265e+03	-3.73447e+03	7.52258e+03	-5.98551e+03	1.17306e+04	-7.65576e+03
16.159113	3.09449e+03	-1.87556e+03	4.96265e+03	-3.73632e+03	7.52258e+03	-5.98551e+03	1.17306e+04	-7.65761e+03
16.18803	3.09264e+03	-1.87741e+03	4.96080e+03	-3.73632e+03	7.52258e+03	-5.98551e+03	1.17287e+04	-7.65761e+03
16.239052	3.09264e+03	-1.88111e+03	4.96080e+03	-3.73447e+03	7.52258e+03	-5.98366e+03	1.17306e+04	-7.65761e+03
16.266481	3.09264e+03	-1.87926e+03	4.96080e+03	-3.73632e+03	7.52073e+03	-5.98551e+03	1.17306e+04	-7.65761e+03
16.312512	3.09264e+03	-1.88481e+03	4.96265e+03	-3.73632e+03	7.52073e+03	-5.98551e+03	1.17306e+04	-7.65576e+03
16.36455	3.09264e+03	-1.88296e+03	4.96080e+03	-3.73447e+03	7.52073e+03	-5.98551e+03	1.17306e+04	-7.65761e+03
16.394866	3.09264e+03	-1.87926e+03	4.96080e+03	-3.73632e+03	7.52073e+03	-5.98551e+03	1.17287e+04	-7.65761e+03
16.447054	3.09264e+03	-1.88111e+03	4.96080e+03	-3.73447e+03	7.52258e+03	-5.98551e+03	1.17306e+04	-7.65761e+03
16.479033	3.09449e+03	-1.87926e+03	4.96080e+03	-3.73447e+03	7.52073e+03	-5.98366e+03	1.17306e+04	-7.65761e+03
16.527191	3.09264e+03	-1.87741e+03	4.96080e+03	-3.73447e+03	7.52073e+03	-5.98551e+03	1.17287e+04	-7.65761e+03
16.558909	3.09264e+03	-1.88111e+03	4.96080e+03	-3.73447e+03	7.52073e+03	-5.98551e+03	1.17306e+04	-7.65576e+03
16.605926	3.09079e+03	-1.87926e+03	4.96265e+03	-3.73632e+03	7.52073e+03	-5.98551e+03	1.17287e+04	-7.65761e+03
16.645762	3.09449e+03	-1.87741e+03	4.96265e+03	-3.73817e+03	7.52258e+03	-5.98551e+03	1.17287e+04	-7.65761e+03
16.679084	3.09264e+03	-1.87741e+03	4.96265e+03	-3.73632e+03	7.52258e+03	-5.98551e+03	1.17287e+04	-7.65761e+03
16.72818	3.09264e+03	-1.87556e+03	4.96265e+03	-3.73632e+03	7.52073e+03	-5.98551e+03	1.17287e+04	-7.65761e+03
16.767047	3.09264e+03	-1.87556e+03	4.96265e+03	-3.73817e+03	7.52258e+03	-5.98551e+03	1.17306e+04	-7.65761e+03
16.812421	3.09264e+03	-1.87556e+03	4.96450e+03	-3.73632e+03	7.52258e+03	-5.98551e+03	1.17287e+04	-7.65761e+03
16.847031	3.09264e+03	-1.87741e+03	4.96265e+03	-3.73632e+03	7.52258e+03	-5.98551e+03	1.17287e+04	-7.65761e+03
16.895033	3.09264e+03	-1.87556e+03	4.96080e+03	-3.73447e+03	7.52073e+03	-5.98551e+03	1.17306e+04	-7.65761e+03
16.940605	3.09449e+03	-1.87926e+03	4.96080e+03	-3.73632e+03	7.52073e+03	-5.98551e+03	1.17306e+04	-7.65576e+03
16.966048	3.09449e+03	-1.87741e+03	4.96265e+03	-3.73632e+03	7.52073e+03	-5.98551e+03	1.17287e+04	-7.65761e+03
17.022566	3.09079e+03	-1.87926e+03	4.96080e+03	-3.73632e+03	7.52073e+03	-5.98551e+03	1.17287e+04	-7.65761e+03
17.054841	3.09079e+03	-1.88296e+03	4.96080e+03	-3.73632e+03	7.52073e+03	-5.98366e+03	1.17306e+04	-7.65761e+03
17.094743	3.09264e+03	-1.88111e+03	4.96265e+03	-3.73632e+03	7.52073e+03	-5.98551e+03	1.17287e+04	-7.65761e+03
17.130262	3.09079e+03	-1.88111e+03	4.96080e+03	-3.73632e+03	7.52073e+03	-5.98551e+03	1.17287e+04	-7.65761e+03
17.183064	3.09449e+03	-1.88296e+03	4.96080e+03	-3.73632e+03	7.52073e+03	-5.98551e+03	1.17306e+04	-7.65576e+03
17.215112	3.09449e+03	-1.87741e+03	4.96265e+03	-3.73447e+03	7.52073e+03	-5.98551e+03	1.17287e+04	-7.65761e+03
17.263039	3.09264e+03	-1.87741e+03	4.96080e+03	-3.73817e+03	7.52073e+03	-5.98551e+03	1.17306e+04	-7.65761e+03
17.311071	3.09449e+03	-1.87926e+03	4.96080e+03	-3.73817e+03	7.52258e+03	-5.98551e+03	1.17287e+04	-7.65761e+03
17.343031	3.09079e+03	-1.87556e+03	4.96265e+03	-3.73817e+03	7.52073e+03	-5.98736e+03	1.17306e+04	-7.65761e+03
17.388567	3.09079e+03	-1.87556e+03	4.96265e+03	-3.73632e+03	7.52073e+03	-5.98551e+03	1.17287e+04	-7.65761e+03
17.423017	3.09264e+03	-1.87556e+03	4.96080e+03	-3.73632e+03	7.52073e+03	-5.98551e+03	1.17287e+04	-7.65761e+03
17.465483	3.09449e+03	-1.87741e+03	4.96080e+03	-3.73817e+03	7.52073e+03	-5.98551e+03	1.17287e+04	-7.65761e+03
17.495719	3.09449e+03	-1.87741e+03	4.96265e+03	-3.73632e+03	7.52073e+03	-5.98551e+03	1.17306e+04	-7.65761e+03
17.544786	3.09264e+03	-1.87926e+03	4.96265e+03	-3.73632e+03	7.52258e+03	-5.98551e+03	1.17287e+04	-7.65761e+03
17.595645	3.09079e+03	-1.87926e+03	4.96265e+03	-3.73632e+03	7.52073e+03	-5.98551e+03	1.17306e+04	-7.65761e+03
17.629039	3.09079e+03	-1.87926e+03	4.96080e+03	-3.73632e+03	7.52258e+03	-5.98551e+03	1.17287e+04	-7.65761e+03
17.679009	3.09079e+03	-1.87556e+03	4.96080e+03	-3.73817e+03	7.52258e+03	-5.98551e+03	1.17306e+04	-7.65576e+03
17.710377	3.09264e+03	-1.87371e+03	4.96080e+03	-3.73632e+03	7.52073e+03	-5.98551e+03	1.17287e+04	-7.65761e+03
17.756829	3.09079e+03	-1.87741e+03	4.96080e+03	-3.73447e+03	7.52073e+03	-5.98366e+03	1.17306e+04	-7.65761e+03
17.791017	3.09264e+03	-1.87741e+03	4.96450e+03	-3.73632e+03	7.52073e+03	-5.98551e+03	1.17287e+04	-7.65761e+03
17.838993	3.09634e+03	-1.88111e+03	4.96080e+03	-3.73632e+03	7.52258e+03	-5.98551e+03	1.17287e+04	-7.65761e+03
17.879028	3.09264e+03	-1.88111e+03	4.96265e+03	-3.73632e+03	7.52073e+03	-5.98551e+03	1.17306e+04	-7.65761e+03
17.911355	3.09264e+03	-1.87926e+03	4.96265e+03	-3.73632e+03	7.52073e+03	-5.98551e+03	1.17306e+04	-7.65761e+03
17.966869	3.09079e+03	-1.88111e+03	4.96265e+03	-3.73632e+03	7.52073e+03	-5.98551e+03	1.17287e+04	-7.65761e+03
17.995679	3.09264e+03	-1.87926e+03	4.96080e+03	-3.73632e+03	7.52258e+03	-5.98551e+03	1.17287e+04	-7.65761e+03
18.045597	3.09264e+03	-1.87741e+03	4.96080e+03	-3.73632e+03	7.52073e+03	-5.98551e+03	1.17287e+04	-7.65761e+03
18.079026	3.09079e+03	-1.87926e+03	4.95895e+03	-3.73632e+03	7.52073e+03	-5.98551e+03	1.17287e+04	-7.65761e+03
18.12697	3.09264e+03	-1.87741e+03	4.95895e+03	-3.73447e+03	7.52258e+03	-5.98366e+03	1.17306e+04	-7.65761e+03
18.168346	3.09264e+03	-1.87926e+03	4.96080e+03	-3.73632e+03	7.52073e+03	-5.98551e+03	1.17287e+04	-7.65761e+03
18.205697	3.08894e+03	-1.88111e+03	4.96080e+03	-3.73632e+03	7.52073e+03	-5.98551e+03	1.17287e+04	-7.65945e+03
18.25442	3.08894e+03	-1.88111e+03	4.96080e+03	-3.73632e+03	7.52258e+03	-5.98366e+03	1.17287e+04	-7.65761e+03
18.284105	3.09264e+03	-1.87926e+03	4.95895e+03	-3.73817e+03	7.52073e+03	-5.98551e+03	1.17287e+04	-7.65761e+03
18.328719	3.09264e+03	-1.87556e+03	4.96080e+03	-3.73632e+03	7.52073e+03	-5.98551e+03	1.17287e+04	-7.65761e+03
18.366739	3.08894e+03	-1.87741e+03	4.96080e+03	-3.73632e+03	7.52258e+03	-5.98736e+03	1.17306e+04	-7.65576e+03
18.41126	3.09264e+03	-1.87371e+03	4.96265e+03	-3.73817e+03	7.52073e+03	-5.98551e+03	1.17287e+04	-7.65761e+03
18.462993	3.09264e+03	-1.87556e+03	4.96080e+03	-3.73632e+03	7.52073e+03	-5.98551e+03	1.17306e+04	-7.65761e+03
18.494614	3.09079e+03	-1.87741e+03	4.96265e+03	-3.73447e+03	7.52073e+03	-5.98551e+03	1.17306e+04	-7.65761e+03
18.538976	3.09264e+03	-1.87556e+03	4.96265e+03	-3.73632e+03	7.52073e+03	-5.98551e+03	1.17287e+04	-7.65761e+03
18.566743	3.09449e+03	-1.87741e+03	4.96080e+03	-3.73447e+03	7.52073e+03	-5.98551e+03	1.17306e+04	-7.65761e+03
18.622378	3.09449e+03	-1.88111e+03	4.96265e+03	-3.73447e+03	7.52073e+03	-5.98551e+03	1.17287e+04	-7.65761e+03
18.65473	3.09264e+03	-1.88111e+03	4.96265e+03	-3.73632e+03	7.52073e+03	-5.98551e+03	1.17287e+04	-7.65761e+03
18.695583	3.09079e+03	-1.88111e+03	4.96080e+03	-3.73632e+03	7.52073e+03	-5.98551e+03	1.17287e+04	-7.65761e+03
18.744629	3.09264e+03	-1.87741e+03	4.96080e+03	-3.73632e+03	7.52073e+03	-5.98551e+03	1.17287e+04	-7.65761e+03
18.77895	3.09449e+03	-1.87371e+03	4.96080e+03	-3.73632e+03	7.52073e+03	-5.98551e+03	1.17287e+04	-7.65761e+03
18.828839	3.09079e+03	-1.87926e+03	4.96080e+03	-3.73447e+03	7.52073e+03	-5.98366e+03	1.17287e+04	-7.65761e+03
18.862993	3.09079e+03	-1.87926e+03	4.96265e+03	-3.73632e+03	7.52073e+03	-5.98551e+03	1.17287e+04	-7.65761e+03
18.910367	3.09449e+03	-1.87741e+03	4.96265e+03	-3.73817e+03	7.52073e+03	-5.98551e+03	1.17287e+04	-7.65761e+03
18.940015	3.09264e+03	-1.88296e+03	4.96265e+03	-3.73817e+03	7.52258e+03	-5.98551e+03	1.17287e+04	-7.65576e+03
18.990973	3.09079e+03	-1.87926e+03	4.96265e+03	-3.73632e+03	7.52073e+03	-5.98551e+03	1.17287e+04	-7.65576e+03
19.038923	3.09264e+03	-1.87741e+03	4.96265e+03	-3.73632e+03	7.52073e+03	-5.98551e+03	1.17287e+04	-7.65761e+03
19.067243	3.09449e+03	-1.87556e+03	4.96080e+03	-3.73632e+03	7.52258e+03	-5.98551e+03	1.17306e+04	-7.65761e+03
19.11121	3.09079e+03	-1.87556e+03	4.96265e+03	-3.73632e+03	7.52258e+03	-5.98551e+03	1.17306e+04	-7.65761e+03
19.144447	3.09079e+03	-1.87741e+03	4.96265e+03	-3.73632e+03	7.52073e+03	-5.98551e+03	1.17287e+04	-7.65761e+03
19.194497	3.08894e+03	-1.87926e+03	4.96265e+03	-3.73447e+03	7.52073e+03	-5.98551e+03	1.17306e+04	-7.65761e+03
19.227852	3.09264e+03	-1.87926e+03	4.96265e+03	-3.73447e+03	7.52073e+03	-5.98551e+03	1.17287e+04	-7.65761e+03
19.278976	3.09079e+03	-1.87556e+03	4.96080e+03	-3.73632e+03	7.52073e+03	-5.98551e+03	1.17287e+04	-7.65761e+03
19.32687	3.09079e+03	-1.87926e+03	4.96265e+03	-3.73632e+03	7.52073e+03	-5.98551e+03	1.17306e+04	-7.65761e+03
19.358416	3.09079e+03	-1.87741e+03	4.96265e+03	-3.73817e+03	7.52073e+03	-5.98551e+03	1.17287e+04	-7.65761e+03
19.406973	3.09264e+03	-1.87371e+03	4.96265e+03	-3.73817e+03	7.52073e+03	-5.98736e+03	1.17306e+04	-7.65761e+03
19.436727	3.09079e+03	-1.88111e+03	4.96080e+03	-3.73632e+03	7.52073e+03	-5.98551e+03	1.17287e+04	-7.65576e+03
19.479875	3.09079e+03	-1.88111e+03	4.96080e+03	-3.73447e+03	7.52073e+03	-5.98551e+03	1.17287e+04	-7.65761e+03
19.511101	3.09264e+03	-1.87926e+03	4.96080e+03	-3.73632e+03	7.52258e+03	-5.98551e+03	1.17306e+04	-7.65761e+03
19.56115	3.09079e+03	-1.87741e+03	4.96265e+03	-3.73632e+03	7.52073e+03	-5.98551e+03	1.17287e+04	-7.65761e+03
19.611159	3.09264e+03	-1.87926e+03	4.96265e+03	-3.73447e+03	7.52073e+03	-5.98551e+03	1.17287e+04	-7.65761e+03
19.644464	3.09079e+03	-1.87926e+03	4.96080e+03	-3.73632e+03	7.52073e+03	-5.98551e+03	1.17287e+04	-7.65761e+03
19.694434	3.09079e+03	-1.87741e+03	4.96265e+03	-3.73447e+03	7.52073e+03	-5.98366e+03	1.17306e+04	-7.65761e+03
19.726799	3.09634e+03	-1.88111e+03	4.96450e+03	-3.73632e+03	7.52073e+03	-5.98551e+03	1.17287e+04	-7.65761e+03
19.769244	3.09264e+03	-1.87741e+03	4.96265e+03	-3.73632e+03	7.52073e+03	-5.98551e+03	1.17287e+04	-7.65761e+03
19.806968	3.09079e+03	-1.87926e+03	4.96265e+03	-3.73632e+03	7.52258e+03	-5.98551e+03	1.17306e+04	-7.65761e+03
19.85457	3.09264e+03	-1.87556e+03	4.96080e+03	-3.73817e+03	7.52073e+03	-5.98736e+03	1.17287e+04	-7.65945e+03
19.895433	3.09264e+03	-1.87556e+03	4.96080e+03	-3.73447e+03	7.52073e+03	-5.98551e+03	1.17306e+04	-7.65761e+03
19.928731	3.09079e+03	-1.87741e+03	4.96080e+03	-3.73632e+03	7.52073e+03	-5.98366e+03	1.17287e+04	-7.65761e+03
19.978918	3.09079e+03	-1.87556e+03	4.96265e+03	-3.73632e+03	7.52073e+03	-5.98551e+03	1.17287e+04	-7.65761e+03
20.011135	3.09264e+03	-1.87556e+03	4.96265e+03	-3.73447e+03	7.52073e+03	-5.98551e+03	1.17287e+04	-7.65761e+03
20.062955	3.09264e+03	-1.87926e+03	4.96265e+03	-3.73632e+03	7.52258e+03	-5.98551e+03	1.17306e+04	-7.65761e+03
20.094955	3.09449e+03	-1.87741e+03	4.96265e+03	-3.73632e+03	7.52073e+03	-5.98551e+03	1.17287e+04	-7.65761e+03
20.139876	3.09264e+03	-1.87556e+03	4.96265e+03	-3.73447e+03	7.52258e+03	-5.98551e+03	1.17306e+04	-7.65761e+03
20.190888	3.09449e+03	-1.87741e+03	4.96265e+03	-3.73447e+03	7.52073e+03	-5.98551e+03	1.17287e+04	-7.65761e+03
20.222956	3.09449e+03	-1.87741e+03	4.95895e+03	-3.73632e+03	7.52073e+03	-5.98551e+03	1.17287e+04	-7.65761e+03
20.270936	3.09264e+03	-1.87926e+03	4.96080e+03	-3.73632e+03	7.52073e+03	-5.98551e+03	1.17287e+04	-7.65761e+03
20.295402	3.08894e+03	-1.87556e+03	4.96265e+03	-3.73447e+03	7.52073e+03	-5.98551e+03	1.17287e+04	-7.65761e+03
20.345462	3.09079e+03	-1.87556e+03	4.96265e+03	-3.73632e+03	7.52073e+03	-5.98551e+03	1.17287e+04	-7.65761e+03
20.378837	3.09079e+03	-1.87741e+03	4.95895e+03	-3.73447e+03	7.52073e+03	-5.98551e+03	1.17306e+04	-7.65576e+03
20.430936	3.08894e+03	-1.87926e+03	4.96080e+03	-3.73447e+03	7.52073e+03	-5.98551e+03	1.17287e+04	-7.65761e+03
20.478506	3.09264e+03	-1.87741e+03	4.96080e+03	-3.73632e+03	7.52073e+03	-5.98551e+03	1.17287e+04	-7.65761e+03
20.511135	3.09449e+03	-1.87741e+03	4.96080e+03	-3.73632e+03	7.52073e+03	-5.98551e+03	1.17287e+04	-7.65761e+03
20.55548	3.09264e+03	-1.87741e+03	4.96080e+03	-3.73632e+03	7.52073e+03	-5.98551e+03	1.17287e+04	-7.65761e+03
20.590824	3.09079e+03	-1.87926e+03	4.96265e+03	-3.73632e+03	7.52073e+03	-5.98551e+03	1.17287e+04	-7.65945e+03
20.638896	3.09079e+03	-1.87741e+03	4.96080e+03	-3.73632e+03	7.52073e+03	-5.98551e+03	1.17287e+04	-7.65761e+03
20.668068	3.09079e+03	-1.87741e+03	4.96080e+03	-3.73632e+03	7.52073e+03	-5.98551e+03	1.17287e+04	-7.65761e+03
20.710997	3.09079e+03	-1.87926e+03	4.96080e+03	-3.73632e+03	7.52073e+03	-5.98551e+03	1.17287e+04	-7.65945e+03
20.762166	3.08894e+03	-1.87741e+03	4.96265e+03	-3.73447e+03	7.52073e+03	-5.98551e+03	1.17287e+04	-7.65761e+03
20.795329	3.09264e+03	-1.87741e+03	4.96265e+03	-3.73632e+03	7.52073e+03	-5.98551e+03	1.17287e+04	-7.65761e+03
20.844361	3.09449e+03	-1.87741e+03	4.96080e+03	-3.73632e+03	7.52073e+03	-5.98551e+03	1.17287e+04	-7.65761e+03
20.878928	3.09079e+03	-1.87741e+03	4.96080e+03	-3.73632e+03	7.52073e+03	-5.98551e+03	1.17287e+04	-7.65761e+03
20.926648	3.09449e+03	-1.87371e+03	4.96265e+03	-3.73632e+03	7.52073e+03	-5.98551e+03	1.17287e+04	-7.65761e+03
20.956408	3.09449e+03	-1.87556e+03	4.96265e+03	-3.73817e+03	7.52073e+03	-5.98551e+03	1.17287e+04	-7.65761e+03
21.003022	3.09079e+03	-1.87926e+03	4.96265e+03	-3.73632e+03	7.52073e+03	-5.98551e+03	1.17287e+04	-7.65761e+03
21.054449	3.09264e+03	-1.87741e+03	4.96080e+03	-3.73817e+03	7.52073e+03	-5.98551e+03	1.17287e+04	-7.65761e+03
21.078664	3.09079e+03	-1.88111e+03	4.96080e+03	-3.73632e+03	7.52073e+03	-5.98366e+03	1.17287e+04	-7.65761e+03
21.128638	3.09079e+03	-1.87926e+03	4.96080e+03	-3.73447e+03	7.52073e+03	-5.98366e+03	1.17287e+04	-7.65761e+03
21.161909	3.09264e+03	-1.87926e+03	4.96265e+03	-3.73632e+03	7.52258e+03	-5.98551e+03	1.17287e+04	-7.65761e+03
21.210962	3.09079e+03	-1.87556e+03	4.96265e+03	-3.73632e+03	7.52073e+03	-5.98551e+03	1.17287e+04	-7.65761e+03
21.24428	3.09264e+03	-1.87741e+03	4.96265e+03	-3.73632e+03	7.52258e+03	-5.98551e+03	1.17287e+04	-7.65761e+03
21.294912	3.09264e+03	-1.87926e+03	4.96265e+03	-3.73447e+03	7.52073e+03	-5.98551e+03	1.17287e+04	-7.65761e+03
21.338622	3.09264e+03	-1.87556e+03	4.96265e+03	-3.73632e+03	7.52073e+03	-5.98551e+03	1.17287e+04	-7.65761e+03
21.372102	3.09264e+03	-1.87741e+03	4.96265e+03	-3.73632e+03	7.52258e+03	-5.98551e+03	1.17287e+04	-7.65761e+03
21.422229	3.09634e+03	-1.87926e+03	4.96265e+03	-3.73447e+03	7.52073e+03	-5.98551e+03	1.17287e+04	-7.65761e+03
21.454463	3.09079e+03	-1.88296e+03	4.96265e+03	-3.73447e+03	7.52073e+03	-5.98551e+03	1.17287e+04	-7.65761e+03
21.497015	3.09264e+03	-1.87926e+03	4.96265e+03	-3.73632e+03	7.52258e+03	-5.98366e+03	1.17287e+04	-7.65761e+03
21.527334	3.09449e+03	-1.87926e+03	4.96265e+03	-3.73817e+03	7.52073e+03	-5.98366e+03	1.17287e+04	-7.65761e+03
21.577555	3.09264e+03	-1.87556e+03	4.96080e+03	-3.73447e+03	7.52258e+03	-5.98551e+03	1.17287e+04	-7.65761e+03
21.610832	3.09079e+03	-1.88111e+03	4.96080e+03	-3.73632e+03	7.52258e+03	-5.98551e+03	1.17287e+04	-7.65761e+03
21.660897	3.09264e+03	-1.88111e+03	4.96080e+03	-3.73632e+03	7.52073e+03	-5.98551e+03	1.17287e+04	-7.65761e+03
21.710836	3.09264e+03	-1.88111e+03	4.96265e+03	-3.73447e+03	7.52258e+03	-5.98366e+03	1.17287e+04	-7.65761e+03
21.742185	3.09449e+03	-1.87741e+03	4.96080e+03	-3.73632e+03	7.52073e+03	-5.98366e+03	1.17287e+04	-7.65761e+03
