Timestamp	I_0	Q_0	I_1	Q_1	I_2	Q_2	I_3	Q_3
0.0	3.14813e+03	-1.89960e+03	5.06068e+03	-3.71412e+03	7.56512e+03	-5.87823e+03	1.16529e+04	-7.57252e+03
0.038868	3.14998e+03	-1.90145e+03	5.06253e+03	-3.71227e+03	7.56512e+03	-5.87823e+03	1.16529e+04	-7.57067e+03
0.071168	3.14998e+03	-1.89960e+03	5.06068e+03	-3.71412e+03	7.56512e+03	-5.87823e+03	1.16529e+04	-7.57067e+03
0.121223	3.15183e+03	-1.89960e+03	5.06068e+03	-3.71412e+03	7.56512e+03	-5.87823e+03	1.16529e+04	-7.57252e+03
0.154519	3.15183e+03	-1.89775e+03	5.06068e+03	-3.71227e+03	7.56512e+03	-5.87823e+03	1.16529e+04	-7.57067e+03
0.205451	3.14628e+03	-1.89775e+03	5.06438e+03	-3.71412e+03	7.56512e+03	-5.87823e+03	1.16529e+04	-7.57067e+03
0.240143	3.14813e+03	-1.89960e+03	5.06253e+03	-3.71412e+03	7.56512e+03	-5.88008e+03	1.16529e+04	-7.57067e+03
0.288155	3.14813e+03	-1.90145e+03	5.06253e+03	-3.71412e+03	7.56512e+03	-5.87823e+03	1.16529e+04	-7.57067e+03
0.333484	3.14813e+03	-1.90145e+03	5.06253e+03	-3.71227e+03	7.56512e+03	-5.87823e+03	1.16529e+04	-7.57067e+03
0.367667	3.14813e+03	-1.89960e+03	5.06253e+03	-3.71412e+03	7.56512e+03	-5.87823e+03	1.16529e+04	-7.57067e+03
0.416124	3.14998e+03	-1.89960e+03	5.06253e+03	-3.71412e+03	7.56512e+03	-5.87823e+03	1.16529e+04	-7.57067e+03
0.442315	3.14998e+03	-1.90145e+03	5.06253e+03	-3.71412e+03	7.56512e+03	-5.87823e+03	1.16529e+04	-7.57067e+03
0.487796	3.14998e+03	-1.90330e+03	5.06253e+03	-3.71227e+03	7.56512e+03	-5.87823e+03	1.16529e+04	-7.57252e+03
0.521616	3.15183e+03	-1.89960e+03	5.06253e+03	-3.71227e+03	7.56512e+03	-5.87823e+03	1.16529e+04	-7.57067e+03
0.571081	3.14813e+03	-1.89775e+03	5.06253e+03	-3.71412e+03	7.56512e+03	-5.87823e+03	1.16529e+04	-7.57067e+03
0.621931	3.14813e+03	-1.90145e+03	5.06253e+03	-3.71412e+03	7.56512e+03	-5.87823e+03	1.16529e+04	-7.57067e+03
0.65612	3.14998e+03	-1.90330e+03	5.06253e+03	-3.71412e+03	7.56327e+03	-5.87823e+03	1.16529e+04	-7.56882e+03
0.703407	3.14998e+03	-1.90145e+03	5.06253e+03	-3.71412e+03	7.56512e+03	-5.87823e+03	1.16529e+04	-7.57067e+03
0.726471	3.14998e+03	-1.90330e+03	5.06068e+03	-3.71412e+03	7.56512e+03	-5.87823e+03	1.16529e+04	-7.57067e+03
0.784061	3.14998e+03	-1.90145e+03	5.06253e+03	-3.71227e+03	7.56512e+03	-5.87823e+03	1.16529e+04	-7.57067e+03
0.815796	3.14628e+03	-1.89775e+03	5.06068e+03	-3.71227e+03	7.56512e+03	-5.87823e+03	1.16529e+04	-7.57252e+03
0.854443	3.14813e+03	-1.89960e+03	5.06068e+03	-3.71227e+03	7.56512e+03	-5.87823e+03	1.16529e+04	-7.57067e+03
0.905381	3.14813e+03	-1.89960e+03	5.06253e+03	-3.71227e+03	7.56512e+03	-5.87823e+03	1.16529e+04	-7.57067e+03
0.938704	3.14813e+03	-1.89960e+03	5.05883e+03	-3.71412e+03	7.56512e+03	-5.88008e+03	1.16529e+04	-7.57252e+03
0.989033	3.14998e+03	-1.89960e+03	5.05883e+03	-3.71227e+03	7.56512e+03	-5.87823e+03	1.16529e+04	-7.57067e+03
1.024127	3.14998e+03	-1.89960e+03	5.06068e+03	-3.71227e+03	7.56512e+03	-5.87823e+03	1.16529e+04	-7.57067e+03
1.072126	3.14813e+03	-1.89960e+03	5.06068e+03	-3.71227e+03	7.56512e+03	-5.87823e+03	1.16529e+04	-7.57067e+03
1.103524	3.15183e+03	-1.90515e+03	5.06068e+03	-3.71042e+03	7.56327e+03	-5.88008e+03	1.16510e+04	-7.57067e+03
1.149895	3.14813e+03	-1.90145e+03	5.06253e+03	-3.71227e+03	7.56327e+03	-5.87823e+03	1.16529e+04	-7.57067e+03
1.184126	3.14813e+03	-1.89590e+03	5.06068e+03	-3.71227e+03	7.56327e+03	-5.88008e+03	1.16510e+04	-7.57252e+03
1.222701	3.14998e+03	-1.89960e+03	5.06253e+03	-3.71227e+03	7.56327e+03	-5.87823e+03	1.16529e+04	-7.57067e+03
1.272145	3.14813e+03	-1.90330e+03	5.06253e+03	-3.71412e+03	7.56327e+03	-5.88008e+03	1.16529e+04	-7.57067e+03
1.305279	3.14813e+03	-1.89775e+03	5.06253e+03	-3.71227e+03	7.56512e+03	-5.88008e+03	1.16529e+04	-7.57252e+03
1.354375	3.15183e+03	-1.89775e+03	5.05883e+03	-3.71412e+03	7.56327e+03	-5.87823e+03	1.16529e+04	-7.57252e+03
1.387694	3.14998e+03	-1.89960e+03	5.06068e+03	-3.71412e+03	7.56512e+03	-5.88008e+03	1.16529e+04	-7.57067e+03
1.438753	3.14813e+03	-1.89775e+03	5.06068e+03	-3.71412e+03	7.56512e+03	-5.88008e+03	1.16510e+04	-7.57252e+03
1.472099	3.14998e+03	-1.89590e+03	5.06068e+03	-3.71412e+03	7.56512e+03	-5.88008e+03	1.16529e+04	-7.57067e+03
1.520006	3.14998e+03	-1.89960e+03	5.05883e+03	-3.71597e+03	7.56512e+03	-5.87823e+03	1.16529e+04	-7.57252e+03
1.568092	3.14813e+03	-1.90145e+03	5.05883e+03	-3.71412e+03	7.56512e+03	-5.87823e+03	1.16510e+04	-7.57252e+03
1.600091	3.14998e+03	-1.90145e+03	5.06068e+03	-3.71227e+03	7.56327e+03	-5.87823e+03	1.16510e+04	-7.57067e+03
1.638639	3.14998e+03	-1.90145e+03	5.06068e+03	-3.71412e+03	7.56512e+03	-5.87823e+03	1.16510e+04	-7.57252e+03
1.67195	3.14813e+03	-1.89960e+03	5.06253e+03	-3.71597e+03	7.56512e+03	-5.88008e+03	1.16529e+04	-7.57252e+03
1.723207	3.14998e+03	-1.89960e+03	5.05883e+03	-3.71597e+03	7.56327e+03	-5.87823e+03	1.16510e+04	-7.57067e+03
1.754377	3.14813e+03	-1.89775e+03	5.05698e+03	-3.71412e+03	7.56327e+03	-5.87823e+03	1.16510e+04	-7.57252e+03
1.805375	3.14813e+03	-1.89960e+03	5.05883e+03	-3.71412e+03	7.56327e+03	-5.88008e+03	1.16510e+04	-7.57437e+03
1.853946	3.14813e+03	-1.89960e+03	5.06068e+03	-3.71227e+03	7.56327e+03	-5.88008e+03	1.16529e+04	-7.57067e+03
1.888097	3.14628e+03	-1.89590e+03	5.06068e+03	-3.71412e+03	7.56327e+03	-5.88008e+03	1.16510e+04	-7.57252e+03
1.936086	3.14813e+03	-1.89775e+03	5.05883e+03	-3.71412e+03	7.56327e+03	-5.88008e+03	1.16529e+04	-7.57252e+03
1.965476	3.14813e+03	-1.90145e+03	5.06068e+03	-3.71412e+03	7.56327e+03	-5.87823e+03	1.16510e+04	-7.57067e+03
2.015353	3.14813e+03	-1.89775e+03	5.06068e+03	-3.71412e+03	7.56327e+03	-5.88008e+03	1.16529e+04	-7.57252e+03
2.048327	3.14998e+03	-1.89960e+03	5.05883e+03	-3.71412e+03	7.56327e+03	-5.88008e+03	1.16529e+04	-7.57252e+03
2.091646	3.14628e+03	-1.89960e+03	5.06068e+03	-3.71412e+03	7.56327e+03	-5.87823e+03	1.16529e+04	-7.57067e+03
2.144067	3.14813e+03	-1.89775e+03	5.05883e+03	-3.71227e+03	7.56327e+03	-5.88008e+03	1.16529e+04	-7.57252e+03
2.171686	3.14998e+03	-1.89960e+03	5.06068e+03	-3.71227e+03	7.56327e+03	-5.88008e+03	1.16510e+04	-7.57252e+03
2.224071	3.14998e+03	-1.89960e+03	5.06253e+03	-3.71227e+03	7.56512e+03	-5.87823e+03	1.16529e+04	-7.57252e+03
2.256075	3.14998e+03	-1.89960e+03	5.05883e+03	-3.71227e+03	7.56512e+03	-5.88008e+03	1.16529e+04	-7.57252e+03
2.304185	3.14813e+03	-1.90145e+03	5.06068e+03	-3.71412e+03	7.56512e+03	-5.87823e+03	1.16510e+04	-7.57252e+03
2.329859	3.14813e+03	-1.89960e+03	5.06068e+03	-3.71227e+03	7.56327e+03	-5.87823e+03	1.16529e+04	-7.57252e+03
2.384044	3.14998e+03	-1.89590e+03	5.06068e+03	-3.71412e+03	7.56512e+03	-5.88008e+03	1.16529e+04	-7.57252e+03
2.422947	3.15183e+03	-1.89775e+03	5.06068e+03	-3.71227e+03	7.56512e+03	-5.87823e+03	1.16529e+04	-7.57067e+03
2.454249	3.14813e+03	-1.89960e+03	5.06253e+03	-3.71227e+03	7.56512e+03	-5.87823e+03	1.16529e+04	-7.57067e+03
2.504199	3.14998e+03	-1.90145e+03	5.06253e+03	-3.71412e+03	7.56512e+03	-5.88008e+03	1.16529e+04	-7.57252e+03
2.537548	3.14998e+03	-1.89775e+03	5.06068e+03	-3.71412e+03	7.56327e+03	-5.88008e+03	1.16529e+04	-7.57067e+03
2.58752	3.14628e+03	-1.89775e+03	5.06253e+03	-3.71042e+03	7.56327e+03	-5.87823e+03	1.16529e+04	-7.57252e+03
2.624076	3.14813e+03	-1.89775e+03	5.06068e+03	-3.71412e+03	7.56512e+03	-5.87823e+03	1.16529e+04	-7.57252e+03
2.67082	3.14998e+03	-1.89960e+03	5.06068e+03	-3.71227e+03	7.56512e+03	-5.87823e+03	1.16529e+04	-7.57252e+03
2.719935	3.14813e+03	-1.89960e+03	5.06253e+03	-3.71412e+03	7.56512e+03	-5.88008e+03	1.16529e+04	-7.57067e+03
2.752066	3.14813e+03	-1.90145e+03	5.06253e+03	-3.71412e+03	7.56512e+03	-5.88008e+03	1.16529e+04	-7.57252e+03
2.800039	3.14813e+03	-1.89960e+03	5.06068e+03	-3.71412e+03	7.56327e+03	-5.87823e+03	1.16529e+04	-7.57067e+03
2.823381	3.14628e+03	-1.89960e+03	5.05883e+03	-3.71227e+03	7.56327e+03	-5.87823e+03	1.16529e+04	-7.57252e+03
2.879974	3.14813e+03	-1.90145e+03	5.05883e+03	-3.71412e+03	7.56327e+03	-5.88008e+03	1.16529e+04	-7.57252e+03
2.904099	3.14628e+03	-1.90145e+03	5.05883e+03	-3.71412e+03	7.56327e+03	-5.87823e+03	1.16529e+04	-7.57067e+03
2.954127	3.14813e+03	-1.90145e+03	5.05883e+03	-3.71412e+03	7.56327e+03	-5.88008e+03	1.16529e+04	-7.57252e+03
3.004175	3.14813e+03	-1.89960e+03	5.05883e+03	-3.71412e+03	7.56327e+03	-5.88193e+03	1.16529e+04	-7.57252e+03
3.040055	3.14998e+03	-1.89960e+03	5.05883e+03	-3.71227e+03	7.56327e+03	-5.88008e+03	1.16529e+04	-7.57067e+03
3.094193	3.14998e+03	-1.89960e+03	5.06068e+03	-3.71042e+03	7.56327e+03	-5.88008e+03	1.16529e+04	-7.57252e+03
3.12005	3.14813e+03	-1.89960e+03	5.05883e+03	-3.71227e+03	7.56327e+03	-5.88008e+03	1.16529e+04	-7.57252e+03
3.168057	3.14813e+03	-1.89775e+03	5.06438e+03	-3.71412e+03	7.56327e+03	-5.88008e+03	1.16529e+04	-7.57067e+03
3.200193	3.14813e+03	-1.90145e+03	5.06253e+03	-3.71227e+03	7.56512e+03	-5.87823e+03	1.16529e+04	-7.57252e+03
3.248033	3.15183e+03	-1.90145e+03	5.06068e+03	-3.71227e+03	7.56327e+03	-5.88008e+03	1.16529e+04	-7.57252e+03
3.288387	3.14998e+03	-1.89960e+03	5.06253e+03	-3.71412e+03	7.56327e+03	-5.88008e+03	1.16529e+04	-7.57067e+03
3.328034	3.14813e+03	-1.89960e+03	5.06253e+03	-3.71412e+03	7.56512e+03	-5.87823e+03	1.16529e+04	-7.57252e+03
3.370793	3.14998e+03	-1.90145e+03	5.06253e+03	-3.71227e+03	7.56327e+03	-5.87823e+03	1.16529e+04	-7.57252e+03
3.403802	3.14813e+03	-1.90330e+03	5.06068e+03	-3.71227e+03	7.56512e+03	-5.87823e+03	1.16529e+04	-7.57067e+03
3.45602	3.14813e+03	-1.90145e+03	5.06068e+03	-3.71412e+03	7.56512e+03	-5.88008e+03	1.16529e+04	-7.57252e+03
3.4874	3.14813e+03	-1.89775e+03	5.06253e+03	-3.71227e+03	7.56327e+03	-5.87823e+03	1.16529e+04	-7.57252e+03
3.536015	3.14813e+03	-1.89775e+03	5.06068e+03	-3.71227e+03	7.56327e+03	-5.87823e+03	1.16529e+04	-7.57067e+03
3.58291	3.14628e+03	-1.89590e+03	5.06068e+03	-3.71412e+03	7.56327e+03	-5.88008e+03	1.16529e+04	-7.57252e+03
3.616026	3.14998e+03	-1.89775e+03	5.06068e+03	-3.71412e+03	7.56327e+03	-5.88008e+03	1.16510e+04	-7.57067e+03
3.655083	3.14813e+03	-1.90145e+03	5.06253e+03	-3.71227e+03	7.56327e+03	-5.87823e+03	1.16529e+04	-7.57067e+03
3.687422	3.14813e+03	-1.89775e+03	5.06253e+03	-3.71227e+03	7.56512e+03	-5.88008e+03	1.16529e+04	-7.57252e+03
3.738375	3.15183e+03	-1.89960e+03	5.06068e+03	-3.71412e+03	7.56512e+03	-5.87823e+03	1.16529e+04	-7.57067e+03
3.770792	3.14813e+03	-1.89960e+03	5.06253e+03	-3.71227e+03	7.56512e+03	-5.87823e+03	1.16529e+04	-7.57252e+03
3.82403	3.14628e+03	-1.90145e+03	5.06068e+03	-3.71412e+03	7.56512e+03	-5.87823e+03	1.16529e+04	-7.57252e+03
3.872047	3.14813e+03	-1.89960e+03	5.06068e+03	-3.71412e+03	7.56327e+03	-5.87823e+03	1.16529e+04	-7.57067e+03
3.904065	3.14813e+03	-1.89775e+03	5.06253e+03	-3.71597e+03	7.56327e+03	-5.88008e+03	1.16510e+04	-7.57067e+03
3.946185	3.14813e+03	-1.89590e+03	5.05883e+03	-3.71227e+03	7.56512e+03	-5.87823e+03	1.16510e+04	-7.57252e+03
3.984004	3.14813e+03	-1.89960e+03	5.05883e+03	-3.71227e+03	7.56512e+03	-5.87823e+03	1.16510e+04	-7.57067e+03
4.024861	3.14628e+03	-1.89960e+03	5.06068e+03	-3.71227e+03	7.56512e+03	-5.87823e+03	1.16529e+04	-7.57067e+03
4.055055	3.14998e+03	-1.89960e+03	5.06253e+03	-3.71412e+03	7.56512e+03	-5.88193e+03	1.16510e+04	-7.57067e+03
4.104066	3.14998e+03	-1.89960e+03	5.06253e+03	-3.71227e+03	7.56327e+03	-5.87823e+03	1.16529e+04	-7.57067e+03
4.155012	3.14628e+03	-1.90145e+03	5.06253e+03	-3.71227e+03	7.56512e+03	-5.87823e+03	1.16529e+04	-7.57067e+03
4.188303	3.14813e+03	-1.89960e+03	5.06253e+03	-3.71042e+03	7.56512e+03	-5.87638e+03	1.16529e+04	-7.57252e+03
4.237152	3.14998e+03	-1.89960e+03	5.06068e+03	-3.71227e+03	7.56512e+03	-5.87823e+03	1.16529e+04	-7.57067e+03
4.272008	3.14998e+03	-1.89960e+03	5.05883e+03	-3.71412e+03	7.56512e+03	-5.87823e+03	1.16529e+04	-7.57067e+03
4.319401	3.14998e+03	-1.89960e+03	5.05883e+03	-3.71412e+03	7.56512e+03	-5.88008e+03	1.16529e+04	-7.57252e+03
4.3474	3.14813e+03	-1.89960e+03	5.05883e+03	-3.71412e+03	7.56512e+03	-5.87823e+03	1.16529e+04	-7.57067e+03
4.396071	3.14813e+03	-1.89960e+03	5.05883e+03	-3.71412e+03	7.56512e+03	-5.87823e+03	1.16529e+04	-7.57067e+03
4.447396	3.14813e+03	-1.90145e+03	5.06068e+03	-3.71412e+03	7.56512e+03	-5.88008e+03	1.16529e+04	-7.57067e+03
4.479587	3.14998e+03	-1.90145e+03	5.06068e+03	-3.71412e+03	7.56512e+03	-5.88008e+03	1.16529e+04	-7.57067e+03
4.524182	3.14813e+03	-1.89960e+03	5.06253e+03	-3.71227e+03	7.56327e+03	-5.87823e+03	1.16510e+04	-7.57252e+03
4.554017	3.14998e+03	-1.90145e+03	5.06253e+03	-3.71412e+03	7.56512e+03	-5.88008e+03	1.16529e+04	-7.57067e+03
4.603887	3.14998e+03	-1.90145e+03	5.06253e+03	-3.71227e+03	7.56512e+03	-5.87823e+03	1.16529e+04	-7.57067e+03
4.637437	3.14813e+03	-1.89960e+03	5.06068e+03	-3.71227e+03	7.56512e+03	-5.87823e+03	1.16529e+04	-7.57067e+03
4.687996	3.14998e+03	-1.89960e+03	5.06068e+03	-3.71042e+03	7.56512e+03	-5.87823e+03	1.16529e+04	-7.57067e+03
4.735949	3.14813e+03	-1.89960e+03	5.06068e+03	-3.71227e+03	7.56327e+03	-5.87823e+03	1.16529e+04	-7.56882e+03
4.767725	3.14813e+03	-1.89960e+03	5.06253e+03	-3.71412e+03	7.56512e+03	-5.88008e+03	1.16510e+04	-7.57067e+03
4.815296	3.14813e+03	-1.89960e+03	5.05883e+03	-3.71227e+03	7.56512e+03	-5.87823e+03	1.16529e+04	-7.57067e+03
4.838345	3.14813e+03	-1.89960e+03	5.06068e+03	-3.71412e+03	7.56512e+03	-5.87823e+03	1.16529e+04	-7.57067e+03
4.887277	3.14813e+03	-1.90145e+03	5.06253e+03	-3.71597e+03	7.56327e+03	-5.88008e+03	1.16529e+04	-7.57067e+03
4.925271	3.14998e+03	-1.89775e+03	5.06068e+03	-3.71597e+03	7.56327e+03	-5.88008e+03	1.16529e+04	-7.57067e+03
4.971551	3.14998e+03	-1.89775e+03	5.06068e+03	-3.71412e+03	7.56512e+03	-5.87823e+03	1.16529e+04	-7.57067e+03
5.021746	3.14813e+03	-1.89775e+03	5.06068e+03	-3.71412e+03	7.56512e+03	-5.87823e+03	1.16529e+04	-7.57252e+03
5.05599	3.14998e+03	-1.90145e+03	5.06253e+03	-3.71412e+03	7.56512e+03	-5.87823e+03	1.16510e+04	-7.57067e+03
5.103882	3.14998e+03	-1.90145e+03	5.06253e+03	-3.71597e+03	7.56327e+03	-5.87823e+03	1.16529e+04	-7.57067e+03
5.135959	3.14813e+03	-1.89590e+03	5.05883e+03	-3.71412e+03	7.56512e+03	-5.88008e+03	1.16510e+04	-7.57252e+03
5.184	3.14813e+03	-1.89590e+03	5.05883e+03	-3.71412e+03	7.56512e+03	-5.87823e+03	1.16529e+04	-7.57067e+03
5.216084	3.14998e+03	-1.90145e+03	5.05883e+03	-3.71412e+03	7.56327e+03	-5.87823e+03	1.16529e+04	-7.57067e+03
5.25565	3.14998e+03	-1.89775e+03	5.05883e+03	-3.71412e+03	7.56327e+03	-5.88008e+03	1.16529e+04	-7.57252e+03
5.304817	3.14998e+03	-1.89590e+03	5.05883e+03	-3.71412e+03	7.56327e+03	-5.87823e+03	1.16510e+04	-7.57067e+03
5.337231	3.14813e+03	-1.90330e+03	5.05698e+03	-3.71412e+03	7.56327e+03	-5.87823e+03	1.16529e+04	-7.57252e+03
5.388287	3.14813e+03	-1.90145e+03	5.05883e+03	-3.71412e+03	7.56512e+03	-5.88008e+03	1.16510e+04	-7.57252e+03
5.422289	3.14998e+03	-1.89960e+03	5.06068e+03	-3.71227e+03	7.56327e+03	-5.87823e+03	1.16529e+04	-7.57067e+03
5.47197	3.14628e+03	-1.90330e+03	5.06068e+03	-3.71042e+03	7.56327e+03	-5.87823e+03	1.16529e+04	-7.57252e+03
5.503811	3.14998e+03	-1.89960e+03	5.06068e+03	-3.71412e+03	7.56327e+03	-5.88008e+03	1.16510e+04	-7.57067e+03
5.548148	3.15183e+03	-1.90145e+03	5.06068e+03	-3.71227e+03	7.56512e+03	-5.87823e+03	1.16529e+04	-7.57067e+03
5.599972	3.14998e+03	-1.89960e+03	5.05883e+03	-3.71042e+03	7.56327e+03	-5.87823e+03	1.16529e+04	-7.57067e+03
5.626853	3.14998e+03	-1.89775e+03	5.05883e+03	-3.71227e+03	7.56512e+03	-5.87823e+03	1.16510e+04	-7.57252e+03
5.670501	3.14998e+03	-1.89775e+03	5.06068e+03	-3.71227e+03	7.56512e+03	-5.87823e+03	1.16529e+04	-7.57067e+03
5.704806	3.14813e+03	-1.89590e+03	5.05883e+03	-3.71042e+03	7.56512e+03	-5.88008e+03	1.16529e+04	-7.57252e+03
5.753857	3.14813e+03	-1.89775e+03	5.05883e+03	-3.71412e+03	7.56327e+03	-5.88008e+03	1.16529e+04	-7.57252e+03
5.787211	3.14813e+03	-1.89960e+03	5.06253e+03	-3.71042e+03	7.56327e+03	-5.87823e+03	1.16529e+04	-7.57067e+03
5.839968	3.14813e+03	-1.89775e+03	5.06438e+03	-3.71412e+03	7.56327e+03	-5.87823e+03	1.16529e+04	-7.57252e+03
5.871965	3.14813e+03	-1.89775e+03	5.06068e+03	-3.71412e+03	7.56512e+03	-5.87823e+03	1.16529e+04	-7.57252e+03
5.919501	3.15183e+03	-1.90145e+03	5.06068e+03	-3.71227e+03	7.56512e+03	-5.87823e+03	1.16529e+04	-7.57067e+03
5.96404	3.14813e+03	-1.90145e+03	5.06253e+03	-3.71227e+03	7.56327e+03	-5.87823e+03	1.16529e+04	-7.57252e+03
5.997194	3.14998e+03	-1.89775e+03	5.06068e+03	-3.71227e+03	7.56512e+03	-5.87823e+03	1.16510e+04	-7.57067e+03
6.047786	3.14998e+03	-1.89775e+03	5.06253e+03	-3.71412e+03	7.56512e+03	-5.87823e+03	1.16529e+04	-7.57067e+03
6.071304	3.14813e+03	-1.89960e+03	5.05883e+03	-3.71412e+03	7.56512e+03	-5.87823e+03	1.16529e+04	-7.57252e+03
6.127949	3.14998e+03	-1.89960e+03	5.05883e+03	-3.71412e+03	7.56512e+03	-5.87823e+03	1.16510e+04	-7.57252e+03
6.153807	3.14628e+03	-1.90145e+03	5.06253e+03	-3.71412e+03	7.56512e+03	-5.87823e+03	1.16529e+04	-7.57067e+03
6.204786	3.14813e+03	-1.90145e+03	5.06068e+03	-3.71227e+03	7.56512e+03	-5.87823e+03	1.16529e+04	-7.57252e+03
6.253807	3.14998e+03	-1.89960e+03	5.06253e+03	-3.71412e+03	7.56512e+03	-5.88008e+03	1.16529e+04	-7.57252e+03
6.287947	3.14813e+03	-1.89590e+03	5.06253e+03	-3.71412e+03	7.56327e+03	-5.88008e+03	1.16529e+04	-7.57067e+03
6.335933	3.14813e+03	-1.89960e+03	5.06068e+03	-3.71412e+03	7.56327e+03	-5.88008e+03	1.16529e+04	-7.57252e+03
6.367648	3.14813e+03	-1.89960e+03	5.06068e+03	-3.71412e+03	7.56327e+03	-5.88008e+03	1.16529e+04	-7.57067e+03
6.415937	3.14813e+03	-1.89775e+03	5.05883e+03	-3.71412e+03	7.56327e+03	-5.87823e+03	1.16529e+04	-7.57252e+03
6.448187	3.14998e+03	-1.89775e+03	5.05883e+03	-3.71227e+03	7.56327e+03	-5.88008e+03	1.16529e+04	-7.57437e+03
6.488885	3.14998e+03	-1.89960e+03	5.06068e+03	-3.71227e+03	7.56327e+03	-5.88008e+03	1.16529e+04	-7.57252e+03
6.538004	3.14813e+03	-1.89775e+03	5.06253e+03	-3.71227e+03	7.56327e+03	-5.88008e+03	1.16529e+04	-7.57252e+03
6.571357	3.15183e+03	-1.89960e+03	5.06253e+03	-3.71412e+03	7.56512e+03	-5.88008e+03	1.16529e+04	-7.57252e+03
6.621558	3.14998e+03	-1.90145e+03	5.06253e+03	-3.71412e+03	7.56327e+03	-5.88008e+03	1.16529e+04	-7.57067e+03
6.653762	3.14998e+03	-1.89960e+03	5.05883e+03	-3.71597e+03	7.56512e+03	-5.88008e+03	1.16529e+04	-7.57067e+03
6.703639	3.14998e+03	-1.89960e+03	5.06068e+03	-3.71597e+03	7.56327e+03	-5.88008e+03	1.16510e+04	-7.57252e+03
6.73597	3.15183e+03	-1.89590e+03	5.06253e+03	-3.71412e+03	7.56327e+03	-5.87823e+03	1.16529e+04	-7.57252e+03
6.782759	3.15183e+03	-1.89960e+03	5.06438e+03	-3.71412e+03	7.56327e+03	-5.88008e+03	1.16529e+04	-7.57252e+03
6.826041	3.15368e+03	-1.89960e+03	5.06068e+03	-3.71227e+03	7.56327e+03	-5.88193e+03	1.16529e+04	-7.57252e+03
6.863935	3.15183e+03	-1.89775e+03	5.06068e+03	-3.71042e+03	7.56327e+03	-5.88008e+03	1.16529e+04	-7.57067e+03
6.90365	3.14998e+03	-1.89775e+03	5.05883e+03	-3.71227e+03	7.56512e+03	-5.87823e+03	1.16529e+04	-7.57252e+03
6.936958	3.14813e+03	-1.90330e+03	5.06068e+03	-3.71597e+03	7.56327e+03	-5.88008e+03	1.16510e+04	-7.57252e+03
6.98703	3.14998e+03	-1.90330e+03	5.06253e+03	-3.71412e+03	7.56512e+03	-5.87823e+03	1.16529e+04	-7.57067e+03
7.020346	3.14813e+03	-1.89960e+03	5.06438e+03	-3.71412e+03	7.56512e+03	-5.87823e+03	1.16529e+04	-7.57252e+03
7.071921	3.14813e+03	-1.89590e+03	5.06253e+03	-3.71412e+03	7.56512e+03	-5.87823e+03	1.16529e+04	-7.57252e+03
7.119996	3.14998e+03	-1.90145e+03	5.06253e+03	-3.71412e+03	7.56327e+03	-5.87823e+03	1.16529e+04	-7.57067e+03
7.151929	3.14998e+03	-1.90145e+03	5.06253e+03	-3.71412e+03	7.56327e+03	-5.88008e+03	1.16529e+04	-7.57252e+03
7.198143	3.14998e+03	-1.89775e+03	5.06253e+03	-3.71412e+03	7.56512e+03	-5.88008e+03	1.16510e+04	-7.57067e+03
7.227531	3.14813e+03	-1.90145e+03	5.06253e+03	-3.71227e+03	7.56512e+03	-5.87823e+03	1.16529e+04	-7.57067e+03
7.271263	3.14813e+03	-1.89960e+03	5.06253e+03	-3.71412e+03	7.56327e+03	-5.88008e+03	1.16529e+04	-7.57067e+03
7.304646	3.14998e+03	-1.89960e+03	5.06068e+03	-3.71412e+03	7.56512e+03	-5.87823e+03	1.16510e+04	-7.57067e+03
7.353658	3.14998e+03	-1.89960e+03	5.06068e+03	-3.71227e+03	7.56512e+03	-5.87823e+03	1.16529e+04	-7.57067e+03
7.404597	3.14628e+03	-1.89960e+03	5.06068e+03	-3.71412e+03	7.56327e+03	-5.88008e+03	1.16529e+04	-7.57067e+03
7.437981	3.14998e+03	-1.90145e+03	5.06068e+03	-3.71412e+03	7.56327e+03	-5.87823e+03	1.16529e+04	-7.57067e+03
7.487908	3.14998e+03	-1.89960e+03	5.06068e+03	-3.71227e+03	7.56327e+03	-5.87823e+03	1.16529e+04	-7.57067e+03
7.519673	3.14998e+03	-1.89960e+03	5.05883e+03	-3.71412e+03	7.56327e+03	-5.88008e+03	1.16510e+04	-7.57252e+03
7.565438	3.14998e+03	-1.90330e+03	5.06253e+03	-3.71412e+03	7.56327e+03	-5.88008e+03	1.16510e+04	-7.57067e+03
7.59694	3.14998e+03	-1.89960e+03	5.06068e+03	-3.71227e+03	7.56327e+03	-5.87823e+03	1.16529e+04	-7.57067e+03
7.64802	3.14998e+03	-1.89775e+03	5.05883e+03	-3.71227e+03	7.56327e+03	-5.87823e+03	1.16510e+04	-7.57252e+03
7.688091	3.15183e+03	-1.89960e+03	5.05883e+03	-3.71412e+03	7.56327e+03	-5.88008e+03	1.16510e+04	-7.57067e+03
7.726414	3.14998e+03	-1.90330e+03	5.06068e+03	-3.71412e+03	7.56327e+03	-5.87638e+03	1.16529e+04	-7.57067e+03
7.771223	3.14813e+03	-1.90145e+03	5.06253e+03	-3.71412e+03	7.56327e+03	-5.88008e+03	1.16529e+04	-7.57252e+03
7.804583	3.14813e+03	-1.89775e+03	5.06253e+03	-3.71227e+03	7.56327e+03	-5.87823e+03	1.16529e+04	-7.57067e+03
7.854114	3.14443e+03	-1.90145e+03	5.06068e+03	-3.71227e+03	7.56327e+03	-5.87823e+03	1.16510e+04	-7.57067e+03
7.887889	3.14628e+03	-1.90145e+03	5.05883e+03	-3.71412e+03	7.56512e+03	-5.87823e+03	1.16510e+04	-7.57252e+03
7.935825	3.14998e+03	-1.90145e+03	5.06068e+03	-3.71412e+03	7.56327e+03	-5.87823e+03	1.16529e+04	-7.57067e+03
7.983885	3.14813e+03	-1.89960e+03	5.05883e+03	-3.71412e+03	7.56512e+03	-5.87638e+03	1.16510e+04	-7.57252e+03
8.015954	3.14813e+03	-1.89590e+03	5.05883e+03	-3.71227e+03	7.56327e+03	-5.88008e+03	1.16510e+04	-7.57252e+03
8.063935	3.14998e+03	-1.89775e+03	5.06068e+03	-3.71227e+03	7.56327e+03	-5.87823e+03	1.16510e+04	-7.57067e+03
8.086922	3.14813e+03	-1.89775e+03	5.05883e+03	-3.71597e+03	7.56327e+03	-5.88008e+03	1.16510e+04	-7.57067e+03
8.138057	3.14998e+03	-1.89960e+03	5.06068e+03	-3.71412e+03	7.56327e+03	-5.88008e+03	1.16510e+04	-7.57252e+03
8.170879	3.15368e+03	-1.89960e+03	5.06068e+03	-3.71412e+03	7.56512e+03	-5.87823e+03	1.16510e+04	-7.57067e+03
8.220233	3.14998e+03	-1.89960e+03	5.06253e+03	-3.71227e+03	7.56327e+03	-5.87823e+03	1.16510e+04	-7.57067e+03
8.271897	3.14998e+03	-1.89960e+03	5.06253e+03	-3.71412e+03	7.56327e+03	-5.87823e+03	1.16510e+04	-7.57067e+03
8.303493	3.15183e+03	-1.89960e+03	5.06068e+03	-3.71412e+03	7.56512e+03	-5.87823e+03	1.16510e+04	-7.56882e+03
8.349777	3.14813e+03	-1.89960e+03	5.05883e+03	-3.71042e+03	7.56512e+03	-5.87638e+03	1.16529e+04	-7.57067e+03
8.383884	3.14998e+03	-1.89960e+03	5.05883e+03	-3.71412e+03	7.56327e+03	-5.87823e+03	1.16529e+04	-7.57252e+03
8.425245	3.14998e+03	-1.89775e+03	5.06068e+03	-3.71412e+03	7.56512e+03	-5.87823e+03	1.16510e+04	-7.57067e+03
8.463717	3.14813e+03	-1.89775e+03	5.06068e+03	-3.71227e+03	7.56327e+03	-5.87638e+03	1.16510e+04	-7.57252e+03
8.507455	3.14998e+03	-1.89775e+03	5.05883e+03	-3.71227e+03	7.56327e+03	-5.87823e+03	1.16510e+04	-7.57252e+03
8.555267	3.14998e+03	-1.89960e+03	5.05883e+03	-3.71227e+03	7.56327e+03	-5.87823e+03	1.16510e+04	-7.57067e+03
8.586839	3.14628e+03	-1.89775e+03	5.06068e+03	-3.71227e+03	7.56142e+03	-5.87823e+03	1.16510e+04	-7.57252e+03
8.637318	3.14628e+03	-1.89960e+03	5.05883e+03	-3.71412e+03	7.56327e+03	-5.88008e+03	1.16510e+04	-7.57252e+03
8.670109	3.14998e+03	-1.89960e+03	5.05883e+03	-3.71412e+03	7.56327e+03	-5.87823e+03	1.16510e+04	-7.57067e+03
8.72	3.14998e+03	-1.89960e+03	5.05883e+03	-3.71412e+03	7.56327e+03	-5.88008e+03	1.16510e+04	-7.57252e+03
8.751147	3.14998e+03	-1.89775e+03	5.05883e+03	-3.71412e+03	7.56327e+03	-5.87823e+03	1.16510e+04	-7.57067e+03
8.797042	3.15368e+03	-1.89590e+03	5.06068e+03	-3.71412e+03	7.56327e+03	-5.87823e+03	1.16510e+04	-7.57067e+03
8.847917	3.14813e+03	-1.90145e+03	5.06068e+03	-3.71227e+03	7.56327e+03	-5.87823e+03	1.16510e+04	-7.57252e+03
8.879373	3.14813e+03	-1.90145e+03	5.06253e+03	-3.71227e+03	7.56327e+03	-5.87823e+03	1.16510e+04	-7.57067e+03
8.925669	3.14813e+03	-1.90145e+03	5.05883e+03	-3.71412e+03	7.56327e+03	-5.87638e+03	1.16510e+04	-7.57067e+03
8.953517	3.14998e+03	-1.89960e+03	5.05883e+03	-3.71227e+03	7.56327e+03	-5.87823e+03	1.16510e+04	-7.57252e+03
9.003371	3.14998e+03	-1.90145e+03	5.05883e+03	-3.71412e+03	7.56327e+03	-5.87823e+03	1.16510e+04	-7.57252e+03
9.037767	3.14813e+03	-1.89960e+03	5.06068e+03	-3.71412e+03	7.56327e+03	-5.87823e+03	1.16510e+04	-7.57067e+03
9.086815	3.14998e+03	-1.89590e+03	5.06253e+03	-3.71412e+03	7.56327e+03	-5.87823e+03	1.16510e+04	-7.57252e+03
9.135689	3.14813e+03	-1.89590e+03	5.06068e+03	-3.71412e+03	7.56327e+03	-5.87823e+03	1.16510e+04	-7.57067e+03
9.162104	3.14628e+03	-1.89775e+03	5.05883e+03	-3.71412e+03	7.56327e+03	-5.87823e+03	1.16510e+04	-7.57252e+03
9.215846	3.14813e+03	-1.89960e+03	5.05698e+03	-3.71412e+03	7.56512e+03	-5.87823e+03	1.16510e+04	-7.57067e+03
9.247846	3.15183e+03	-1.90145e+03	5.05883e+03	-3.71227e+03	7.56327e+03	-5.87823e+03	1.16510e+04	-7.57252e+03
9.287759	3.14813e+03	-1.90145e+03	5.05883e+03	-3.71412e+03	7.56327e+03	-5.87823e+03	1.16510e+04	-7.57067e+03
9.327792	3.14813e+03	-1.90145e+03	5.05883e+03	-3.71597e+03	7.56327e+03	-5.88008e+03	1.16510e+04	-7.57252e+03
9.370276	3.15183e+03	-1.89960e+03	5.06068e+03	-3.71412e+03	7.56327e+03	-5.87823e+03	1.16510e+04	-7.57067e+03
9.421081	3.14813e+03	-1.89775e+03	5.06068e+03	-3.71227e+03	7.56327e+03	-5.87823e+03	1.16510e+04	-7.57067e+03
9.455846	3.14813e+03	-1.89590e+03	5.05883e+03	-3.71227e+03	7.56327e+03	-5.87823e+03	1.16510e+04	-7.57252e+03
9.503856	3.14813e+03	-1.89960e+03	5.05883e+03	-3.71227e+03	7.56512e+03	-5.87823e+03	1.16510e+04	-7.57067e+03
9.535823	3.14998e+03	-1.90330e+03	5.06068e+03	-3.71412e+03	7.56327e+03	-5.88008e+03	1.16510e+04	-7.57067e+03
9.583269	3.14998e+03	-1.89775e+03	5.06068e+03	-3.71412e+03	7.56327e+03	-5.88008e+03	1.16510e+04	-7.57252e+03
9.615923	3.14813e+03	-1.89590e+03	5.06068e+03	-3.71227e+03	7.56142e+03	-5.87823e+03	1.16510e+04	-7.57067e+03
9.663255	3.14813e+03	-1.89590e+03	5.06253e+03	-3.71412e+03	7.56327e+03	-5.88008e+03	1.16510e+04	-7.57067e+03
9.703374	3.15183e+03	-1.89590e+03	5.06068e+03	-3.71412e+03	7.56327e+03	-5.87823e+03	1.16510e+04	-7.57067e+03
9.737715	3.15183e+03	-1.89775e+03	5.06068e+03	-3.71227e+03	7.56327e+03	-5.87823e+03	1.16510e+04	-7.57067e+03
9.787433	3.14813e+03	-1.89775e+03	5.06068e+03	-3.71227e+03	7.56327e+03	-5.87823e+03	1.16510e+04	-7.57067e+03
9.821039	3.14998e+03	-1.89960e+03	5.05883e+03	-3.71227e+03	7.56327e+03	-5.87823e+03	1.16510e+04	-7.57252e+03
9.871824	3.14998e+03	-1.90145e+03	5.06068e+03	-3.71412e+03	7.56327e+03	-5.87823e+03	1.16510e+04	-7.56882e+03
9.903818	3.14998e+03	-1.90145e+03	5.06068e+03	-3.71412e+03	7.56327e+03	-5.87823e+03	1.16510e+04	-7.57067e+03
9.948849	3.14813e+03	-1.90145e+03	5.06068e+03	-3.71227e+03	7.56512e+03	-5.87823e+03	1.16510e+04	-7.57067e+03
9.997691	3.14813e+03	-1.89960e+03	5.06253e+03	-3.71227e+03	7.56327e+03	-5.87823e+03	1.16510e+04	-7.57067e+03
10.028002	3.14813e+03	-1.90145e+03	5.06253e+03	-3.71412e+03	7.56327e+03	-5.88008e+03	1.16510e+04	-7.57067e+03
10.069957	3.14813e+03	-1.90145e+03	5.05883e+03	-3.71227e+03	7.56327e+03	-5.87823e+03	1.16510e+04	-7.57067e+03
10.103338	3.14628e+03	-1.90145e+03	5.05883e+03	-3.71227e+03	7.56327e+03	-5.87823e+03	1.16510e+04	-7.57067e+03
10.154317	3.14998e+03	-1.89775e+03	5.06253e+03	-3.71412e+03	7.56327e+03	-5.87823e+03	1.16510e+04	-7.57252e+03
10.187692	3.14813e+03	-1.90145e+03	5.05883e+03	-3.71227e+03	7.56327e+03	-5.88008e+03	1.16510e+04	-7.57067e+03
10.237667	3.14628e+03	-1.89960e+03	5.05883e+03	-3.71227e+03	7.56327e+03	-5.87823e+03	1.16510e+04	-7.57067e+03
10.270017	3.14628e+03	-1.89960e+03	5.05883e+03	-3.71227e+03	7.56327e+03	-5.87823e+03	1.16510e+04	-7.57252e+03
10.319092	3.14998e+03	-1.89960e+03	5.06068e+03	-3.71227e+03	7.56327e+03	-5.87823e+03	1.16510e+04	-7.57067e+03
10.365352	3.14998e+03	-1.89775e+03	5.06253e+03	-3.71227e+03	7.56327e+03	-5.87823e+03	1.16510e+04	-7.57067e+03
10.399825	3.14813e+03	-1.89960e+03	5.06253e+03	-3.71412e+03	7.56142e+03	-5.88008e+03	1.16510e+04	-7.57252e+03
10.447602	3.15183e+03	-1.89775e+03	5.06068e+03	-3.71412e+03	7.56327e+03	-5.87823e+03	1.16510e+04	-7.57067e+03
10.469933	3.14813e+03	-1.89775e+03	5.06068e+03	-3.71227e+03	7.56327e+03	-5.87823e+03	1.16510e+04	-7.57067e+03
10.526373	3.14813e+03	-1.89775e+03	5.06253e+03	-3.71412e+03	7.56327e+03	-5.88008e+03	1.16510e+04	-7.57252e+03
10.55422	3.14813e+03	-1.89590e+03	5.06068e+03	-3.71412e+03	7.56327e+03	-5.87823e+03	1.16510e+04	-7.57067e+03
10.607804	3.14628e+03	-1.89775e+03	5.06253e+03	-3.71412e+03	7.56327e+03	-5.87823e+03	1.16510e+04	-7.57252e+03
10.655418	3.14813e+03	-1.89960e+03	5.06253e+03	-3.71412e+03	7.56327e+03	-5.87823e+03	1.16510e+04	-7.57252e+03
10.687804	3.14813e+03	-1.89960e+03	5.06068e+03	-3.71227e+03	7.56327e+03	-5.87823e+03	1.16510e+04	-7.57252e+03
10.735633	3.14628e+03	-1.89590e+03	5.05883e+03	-3.71412e+03	7.56327e+03	-5.87823e+03	1.16510e+04	-7.57067e+03
10.767797	3.14998e+03	-1.89960e+03	5.06068e+03	-3.71412e+03	7.56327e+03	-5.88008e+03	1.16492e+04	-7.57252e+03
10.815335	3.14998e+03	-1.90145e+03	5.06068e+03	-3.71412e+03	7.56327e+03	-5.87823e+03	1.16510e+04	-7.57067e+03
10.847592	3.14813e+03	-1.89960e+03	5.05883e+03	-3.71042e+03	7.56327e+03	-5.87823e+03	1.16510e+04	-7.57252e+03
10.886564	3.14813e+03	-1.89960e+03	5.05698e+03	-3.71227e+03	7.56327e+03	-5.88008e+03	1.16492e+04	-7.57252e+03
10.937557	3.14813e+03	-1.89960e+03	5.05698e+03	-3.71227e+03	7.56142e+03	-5.87823e+03	1.16510e+04	-7.57067e+03
10.96986	3.14813e+03	-1.89960e+03	5.06068e+03	-3.71412e+03	7.56142e+03	-5.88008e+03	1.16510e+04	-7.57252e+03
11.019873	3.14998e+03	-1.89960e+03	5.05883e+03	-3.71227e+03	7.56142e+03	-5.88008e+03	1.16510e+04	-7.57252e+03
11.053165	3.14998e+03	-1.89960e+03	5.05698e+03	-3.71042e+03	7.56142e+03	-5.87823e+03	1.16510e+04	-7.57067e+03
11.103161	3.14813e+03	-1.89960e+03	5.06068e+03	-3.71227e+03	7.56142e+03	-5.88008e+03	1.16510e+04	-7.57067e+03
11.135456	3.14998e+03	-1.90145e+03	5.05698e+03	-3.71412e+03	7.56327e+03	-5.88008e+03	1.16510e+04	-7.57067e+03
11.183781	3.15183e+03	-1.89960e+03	5.05883e+03	-3.71412e+03	7.56327e+03	-5.87823e+03	1.16510e+04	-7.57067e+03
11.227291	3.14628e+03	-1.90145e+03	5.05698e+03	-3.71227e+03	7.56142e+03	-5.87823e+03	1.16492e+04	-7.57252e+03
11.263442	3.14813e+03	-1.89960e+03	5.05883e+03	-3.71227e+03	7.56142e+03	-5.88008e+03	1.16492e+04	-7.57252e+03
11.303141	3.14813e+03	-1.89960e+03	5.05883e+03	-3.71227e+03	7.56142e+03	-5.88008e+03	1.16492e+04	-7.57067e+03
11.336517	3.14813e+03	-1.89775e+03	5.05883e+03	-3.71227e+03	7.56142e+03	-5.88193e+03	1.16510e+04	-7.57252e+03
11.387604	3.14813e+03	-1.89775e+03	5.05698e+03	-3.71227e+03	7.56142e+03	-5.88008e+03	1.16510e+04	-7.57252e+03
11.420869	3.14813e+03	-1.90145e+03	5.05698e+03	-3.71227e+03	7.56142e+03	-5.87638e+03	1.16510e+04	-7.57252e+03
11.471792	3.14813e+03	-1.90145e+03	5.05698e+03	-3.71227e+03	7.56142e+03	-5.87823e+03	1.16510e+04	-7.57252e+03
11.519819	3.14628e+03	-1.89775e+03	5.06068e+03	-3.71227e+03	7.56327e+03	-5.87823e+03	1.16510e+04	-7.57252e+03
11.548701	3.14998e+03	-1.89590e+03	5.06068e+03	-3.71412e+03	7.56142e+03	-5.87823e+03	1.16510e+04	-7.57067e+03
11.598548	3.14998e+03	-1.89775e+03	5.05698e+03	-3.71412e+03	7.56327e+03	-5.88008e+03	1.16510e+04	-7.57252e+03
11.628377	3.14813e+03	-1.89590e+03	5.05513e+03	-3.71227e+03	7.56327e+03	-5.87823e+03	1.16510e+04	-7.57252e+03
11.670867	3.14628e+03	-1.89960e+03	5.05698e+03	-3.71227e+03	7.56142e+03	-5.87823e+03	1.16510e+04	-7.57067e+03
11.703094	3.14628e+03	-1.89960e+03	5.05698e+03	-3.71412e+03	7.56142e+03	-5.88008e+03	1.16510e+04	-7.57252e+03
11.754176	3.14628e+03	-1.89590e+03	5.05698e+03	-3.71227e+03	7.56142e+03	-5.87638e+03	1.16510e+04	-7.57252e+03
11.807778	3.14813e+03	-1.89590e+03	5.06068e+03	-3.71042e+03	7.56327e+03	-5.87823e+03	1.16510e+04	-7.57252e+03
11.839765	3.14998e+03	-1.89405e+03	5.05698e+03	-3.71227e+03	7.56327e+03	-5.87823e+03	1.16510e+04	-7.57252e+03
11.887189	3.15183e+03	-1.89775e+03	5.05698e+03	-3.71227e+03	7.56327e+03	-5.87823e+03	1.16510e+04	-7.57067e+03
11.919719	3.14998e+03	-1.90145e+03	5.05883e+03	-3.71227e+03	7.56327e+03	-5.87823e+03	1.16510e+04	-7.57252e+03
11.965291	3.14813e+03	-1.89775e+03	5.06068e+03	-3.71227e+03	7.56327e+03	-5.87823e+03	1.16510e+04	-7.57252e+03
11.997442	3.14813e+03	-1.89775e+03	5.05883e+03	-3.71227e+03	7.56142e+03	-5.87823e+03	1.16510e+04	-7.57252e+03
12.047772	3.14998e+03	-1.89960e+03	5.05883e+03	-3.71227e+03	7.56142e+03	-5.87823e+03	1.16510e+04	-7.57252e+03
12.087411	3.14813e+03	-1.90145e+03	5.05883e+03	-3.71412e+03	7.56142e+03	-5.88008e+03	1.16510e+04	-7.57252e+03
12.127405	3.14998e+03	-1.89960e+03	5.05883e+03	-3.71042e+03	7.56142e+03	-5.87823e+03	1.16510e+04	-7.57067e+03
12.169758	3.14628e+03	-1.89590e+03	5.06068e+03	-3.71227e+03	7.56142e+03	-5.87823e+03	1.16510e+04	-7.57252e+03
12.203095	3.14813e+03	-1.89775e+03	5.05883e+03	-3.71412e+03	7.56142e+03	-5.88008e+03	1.16510e+04	-7.57252e+03
12.255762	3.14998e+03	-1.89775e+03	5.05883e+03	-3.71042e+03	7.56142e+03	-5.87823e+03	1.16510e+04	-7.57252e+03
12.287775	3.14813e+03	-1.89960e+03	5.06253e+03	-3.71227e+03	7.56142e+03	-5.87823e+03	1.16510e+04	-7.57252e+03
12.335386	3.14998e+03	-1.89590e+03	5.05883e+03	-3.71227e+03	7.56142e+03	-5.88008e+03	1.16510e+04	-7.57437e+03
12.383762	3.14998e+03	-1.89775e+03	5.05883e+03	-3.71042e+03	7.56142e+03	-5.87823e+03	1.16492e+04	-7.57252e+03
12.415706	3.14813e+03	-1.89775e+03	5.05883e+03	-3.71227e+03	7.56142e+03	-5.88008e+03	1.16510e+04	-7.57437e+03
12.463915	3.14813e+03	-1.90145e+03	5.05883e+03	-3.71042e+03	7.56142e+03	-5.88008e+03	1.16492e+04	-7.57437e+03
12.48637	3.14998e+03	-1.89590e+03	5.06068e+03	-3.71042e+03	7.56142e+03	-5.87638e+03	1.16510e+04	-7.57252e+03
12.536365	3.14813e+03	-1.89960e+03	5.05698e+03	-3.71412e+03	7.56142e+03	-5.88008e+03	1.16510e+04	-7.57437e+03
12.569693	3.14628e+03	-1.90330e+03	5.05698e+03	-3.71227e+03	7.56142e+03	-5.88008e+03	1.16510e+04	-7.57252e+03
12.619671	3.14813e+03	-1.89960e+03	5.05698e+03	-3.71227e+03	7.55957e+03	-5.88008e+03	1.16510e+04	-7.57252e+03
12.669724	3.14998e+03	-1.89590e+03	5.05883e+03	-3.71227e+03	7.56142e+03	-5.88008e+03	1.16510e+04	-7.57437e+03
12.703734	3.14998e+03	-1.89775e+03	5.05698e+03	-3.71227e+03	7.56142e+03	-5.87823e+03	1.16510e+04	-7.57252e+03
12.751711	3.14628e+03	-1.89960e+03	5.05883e+03	-3.71042e+03	7.56142e+03	-5.87823e+03	1.16510e+04	-7.57067e+03
12.783743	3.14628e+03	-1.89775e+03	5.05883e+03	-3.71412e+03	7.56142e+03	-5.88008e+03	1.16510e+04	-7.57437e+03
12.82796	3.14813e+03	-1.90145e+03	5.05883e+03	-3.71227e+03	7.56142e+03	-5.88008e+03	1.16510e+04	-7.57252e+03
12.853508	3.14628e+03	-1.90145e+03	5.05883e+03	-3.71227e+03	7.56142e+03	-5.87823e+03	1.16510e+04	-7.57252e+03
12.911853	3.14628e+03	-1.90145e+03	5.05698e+03	-3.71412e+03	7.56142e+03	-5.88008e+03	1.16510e+04	-7.57252e+03
12.953771	3.14998e+03	-1.90330e+03	5.05883e+03	-3.71227e+03	7.56142e+03	-5.88008e+03	1.16510e+04	-7.57252e+03
12.987143	3.14998e+03	-1.89775e+03	5.05883e+03	-3.71042e+03	7.56142e+03	-5.88008e+03	1.16510e+04	-7.57252e+03
13.036259	3.15183e+03	-1.89590e+03	5.05883e+03	-3.71412e+03	7.56142e+03	-5.88193e+03	1.16510e+04	-7.57252e+03
13.069628	3.14813e+03	-1.89775e+03	5.05883e+03	-3.71412e+03	7.56142e+03	-5.88008e+03	1.16510e+04	-7.57252e+03
13.119738	3.14998e+03	-1.90145e+03	5.05698e+03	-3.71227e+03	7.56142e+03	-5.87823e+03	1.16510e+04	-7.57252e+03
13.149552	3.14813e+03	-1.90330e+03	5.05513e+03	-3.71227e+03	7.56142e+03	-5.88008e+03	1.16510e+04	-7.57437e+03
13.197356	3.14628e+03	-1.90330e+03	5.05513e+03	-3.71227e+03	7.56142e+03	-5.87823e+03	1.16510e+04	-7.57252e+03
13.247473	3.14443e+03	-1.89960e+03	5.05698e+03	-3.71042e+03	7.55957e+03	-5.88008e+03	1.16510e+04	-7.57252e+03
13.279696	3.14998e+03	-1.90145e+03	5.05698e+03	-3.71227e+03	7.55957e+03	-5.88193e+03	1.16510e+04	-7.57437e+03
13.319592	3.14998e+03	-1.90145e+03	5.05883e+03	-3.71412e+03	7.55957e+03	-5.88008e+03	1.16510e+04	-7.57252e+03
13.352997	3.14628e+03	-1.89960e+03	5.05883e+03	-3.71227e+03	7.55957e+03	-5.88008e+03	1.16510e+04	-7.57252e+03
13.402898	3.14813e+03	-1.89775e+03	5.05698e+03	-3.71412e+03	7.55957e+03	-5.88008e+03	1.16510e+04	-7.57437e+03
13.436279	3.14998e+03	-1.89590e+03	5.05883e+03	-3.71227e+03	7.56142e+03	-5.87823e+03	1.16510e+04	-7.57252e+03
13.487726	3.14813e+03	-1.89960e+03	5.05883e+03	-3.71227e+03	7.56142e+03	-5.87823e+03	1.16510e+04	-7.57252e+03
13.535212	3.14813e+03	-1.89960e+03	5.05698e+03	-3.71227e+03	7.56327e+03	-5.88008e+03	1.16510e+04	-7.57252e+03
13.565056	3.14998e+03	-1.89590e+03	5.05883e+03	-3.71227e+03	7.56142e+03	-5.87823e+03	1.16510e+04	-7.57067e+03
13.615724	3.14813e+03	-1.90145e+03	5.05883e+03	-3.71227e+03	7.56327e+03	-5.88008e+03	1.16510e+04	-7.57252e+03
13.647337	3.14998e+03	-1.89775e+03	5.05883e+03	-3.71227e+03	7.56327e+03	-5.88008e+03	1.16492e+04	-7.57252e+03
13.686263	3.14998e+03	-1.89775e+03	5.06068e+03	-3.71227e+03	7.56142e+03	-5.87823e+03	1.16510e+04	-7.57067e+03
13.719582	3.14628e+03	-1.89960e+03	5.05883e+03	-3.71412e+03	7.56142e+03	-5.87823e+03	1.16510e+04	-7.57252e+03
13.769541	3.14628e+03	-1.89590e+03	5.05883e+03	-3.71227e+03	7.56142e+03	-5.88008e+03	1.16510e+04	-7.57252e+03
13.819564	3.14813e+03	-1.89775e+03	5.05883e+03	-3.71042e+03	7.56142e+03	-5.87823e+03	1.16510e+04	-7.57252e+03
13.855698	3.14628e+03	-1.89960e+03	5.05698e+03	-3.71412e+03	7.56142e+03	-5.88008e+03	1.16510e+04	-7.57252e+03
13.903701	3.14813e+03	-1.89775e+03	5.05883e+03	-3.71227e+03	7.56327e+03	-5.88008e+03	1.16510e+04	-7.57252e+03
13.93564	3.14998e+03	-1.89775e+03	5.05698e+03	-3.71227e+03	7.56142e+03	-5.87823e+03	1.16510e+04	-7.57067e+03
13.983702	3.14998e+03	-1.89960e+03	5.05883e+03	-3.71412e+03	7.56142e+03	-5.88008e+03	1.16510e+04	-7.57252e+03
14.015294	3.14813e+03	-1.90145e+03	5.05883e+03	-3.71042e+03	7.56142e+03	-5.87823e+03	1.16492e+04	-7.57437e+03
14.055009	3.14813e+03	-1.89775e+03	5.05883e+03	-3.71042e+03	7.56142e+03	-5.87823e+03	1.16510e+04	-7.57067e+03
14.103777	3.14813e+03	-1.89590e+03	5.05883e+03	-3.71042e+03	7.56142e+03	-5.87823e+03	1.16510e+04	-7.57437e+03
14.136154	3.14998e+03	-1.89775e+03	5.05883e+03	-3.71042e+03	7.56142e+03	-5.88008e+03	1.16510e+04	-7.57252e+03
14.186198	3.14813e+03	-1.89775e+03	5.05698e+03	-3.71227e+03	7.56142e+03	-5.87823e+03	1.16492e+04	-7.57252e+03
14.219534	3.14813e+03	-1.89775e+03	5.05883e+03	-3.71227e+03	7.56142e+03	-5.88008e+03	1.16492e+04	-7.57252e+03
14.271721	3.15183e+03	-1.89775e+03	5.05698e+03	-3.71227e+03	7.56142e+03	-5.87823e+03	1.16492e+04	-7.57252e+03
14.302776	3.14998e+03	-1.89775e+03	5.06068e+03	-3.71227e+03	7.56327e+03	-5.87823e+03	1.16510e+04	-7.57067e+03
14.35187	3.14813e+03	-1.89960e+03	5.05883e+03	-3.71042e+03	7.56327e+03	-5.88008e+03	1.16510e+04	-7.57252e+03
14.396741	3.14813e+03	-1.89960e+03	5.05883e+03	-3.71227e+03	7.56327e+03	-5.87823e+03	1.16510e+04	-7.57252e+03
14.429558	3.14813e+03	-1.90145e+03	5.05883e+03	-3.71227e+03	7.56142e+03	-5.87823e+03	1.16510e+04	-7.57252e+03
14.470446	3.14998e+03	-1.89960e+03	5.05883e+03	-3.71227e+03	7.56327e+03	-5.87823e+03	1.16492e+04	-7.57437e+03
14.50374	3.15183e+03	-1.89775e+03	5.05883e+03	-3.71227e+03	7.56142e+03	-5.88008e+03	1.16510e+04	-7.57252e+03
14.553631	3.14628e+03	-1.89775e+03	5.05883e+03	-3.71227e+03	7.56142e+03	-5.88008e+03	1.16510e+04	-7.57067e+03
14.587192	3.14813e+03	-1.89960e+03	5.05883e+03	-3.71412e+03	7.56142e+03	-5.88008e+03	1.16510e+04	-7.57252e+03
14.636551	3.14998e+03	-1.89960e+03	5.06068e+03	-3.71227e+03	7.56327e+03	-5.87823e+03	1.16510e+04	-7.57252e+03
14.687691	3.14998e+03	-1.89590e+03	5.06068e+03	-3.71412e+03	7.56142e+03	-5.87823e+03	1.16510e+04	-7.57252e+03
14.719677	3.14998e+03	-1.89960e+03	5.05883e+03	-3.71227e+03	7.56327e+03	-5.88008e+03	1.16510e+04	-7.57252e+03
14.767676	3.14998e+03	-1.90145e+03	5.05883e+03	-3.71227e+03	7.56142e+03	-5.87823e+03	1.16510e+04	-7.57067e+03
14.797333	3.14813e+03	-1.90145e+03	5.06068e+03	-3.71227e+03	7.56327e+03	-5.87823e+03	1.16510e+04	-7.57252e+03
14.847703	3.14813e+03	-1.90145e+03	5.06068e+03	-3.71227e+03	7.56142e+03	-5.88008e+03	1.16510e+04	-7.57252e+03
14.870438	3.14813e+03	-1.89960e+03	5.05883e+03	-3.71227e+03	7.56142e+03	-5.88008e+03	1.16492e+04	-7.57252e+03
14.920361	3.14813e+03	-1.89960e+03	5.05883e+03	-3.71227e+03	7.56142e+03	-5.88008e+03	1.16510e+04	-7.57252e+03
14.952733	3.14813e+03	-1.89960e+03	5.05883e+03	-3.71227e+03	7.56142e+03	-5.88008e+03	1.16492e+04	-7.57252e+03
15.007473	3.14998e+03	-1.89590e+03	5.05883e+03	-3.71412e+03	7.56142e+03	-5.87823e+03	1.16510e+04	-7.57252e+03
15.055661	3.14998e+03	-1.89590e+03	5.05883e+03	-3.71227e+03	7.56142e+03	-5.88008e+03	1.16510e+04	-7.57437e+03
15.087328	3.14998e+03	-1.89775e+03	5.05883e+03	-3.71042e+03	7.56142e+03	-5.88008e+03	1.16510e+04	-7.57252e+03
15.135029	3.14813e+03	-1.89775e+03	5.06068e+03	-3.71227e+03	7.56142e+03	-5.87823e+03	1.16510e+04	-7.57252e+03
15.165197	3.14998e+03	-1.89590e+03	5.06068e+03	-3.71412e+03	7.56142e+03	-5.87823e+03	1.16510e+04	-7.57252e+03
15.212751	3.14998e+03	-1.89960e+03	5.05883e+03	-3.71227e+03	7.56142e+03	-5.87823e+03	1.16492e+04	-7.57252e+03
15.247237	3.14998e+03	-1.90145e+03	5.06068e+03	-3.71042e+03	7.56142e+03	-5.87823e+03	1.16510e+04	-7.57252e+03
15.28602	3.14998e+03	-1.89775e+03	5.06253e+03	-3.71227e+03	7.56142e+03	-5.88008e+03	1.16510e+04	-7.57252e+03
15.335982	3.15183e+03	-1.89960e+03	5.06068e+03	-3.71227e+03	7.56327e+03	-5.87823e+03	1.16510e+04	-7.57252e+03
15.36935	3.14813e+03	-1.90145e+03	5.06068e+03	-3.71412e+03	7.56142e+03	-5.87823e+03	1.16510e+04	-7.57252e+03
15.419347	3.14813e+03	-1.89960e+03	5.06068e+03	-3.71227e+03	7.56142e+03	-5.88008e+03	1.16510e+04	-7.57252e+03
15.452642	3.15183e+03	-1.89405e+03	5.06068e+03	-3.71042e+03	7.56142e+03	-5.88008e+03	1.16510e+04	-7.57252e+03
15.503655	3.14813e+03	-1.89590e+03	5.05883e+03	-3.71227e+03	7.56142e+03	-5.87823e+03	1.16510e+04	-7.57252e+03
15.534973	3.14813e+03	-1.89775e+03	5.05883e+03	-3.71412e+03	7.56327e+03	-5.87823e+03	1.16510e+04	-7.57252e+03
15.580566	3.15183e+03	-1.90145e+03	5.05698e+03	-3.71227e+03	7.56142e+03	-5.87823e+03	1.16510e+04	-7.57252e+03
15.631294	3.14998e+03	-1.89775e+03	5.05698e+03	-3.71227e+03	7.56142e+03	-5.87823e+03	1.16510e+04	-7.57252e+03
15.663818	3.14998e+03	-1.89775e+03	5.05883e+03	-3.71227e+03	7.56142e+03	-5.88008e+03	1.16510e+04	-7.57252e+03
15.703637	3.15183e+03	-1.90145e+03	5.05698e+03	-3.71227e+03	7.56142e+03	-5.88008e+03	1.16510e+04	-7.57252e+03
15.736978	3.15183e+03	-1.89590e+03	5.06068e+03	-3.71227e+03	7.56142e+03	-5.87823e+03	1.16510e+04	-7.57252e+03
15.78598	3.14813e+03	-1.89775e+03	5.05883e+03	-3.71042e+03	7.56142e+03	-5.88008e+03	1.16492e+04	-7.57252e+03
15.819321	3.14813e+03	-1.89775e+03	5.05883e+03	-3.71227e+03	7.56142e+03	-5.87823e+03	1.16510e+04	-7.57252e+03
15.871645	3.15183e+03	-1.89775e+03	5.05698e+03	-3.71227e+03	7.55957e+03	-5.88008e+03	1.16510e+04	-7.57252e+03
15.91964	3.15183e+03	-1.89775e+03	5.05698e+03	-3.71042e+03	7.56142e+03	-5.88008e+03	1.16510e+04	-7.57252e+03
15.951816	3.14998e+03	-1.89960e+03	5.05698e+03	-3.71042e+03	7.56142e+03	-5.87823e+03	1.16510e+04	-7.57252e+03
15.999641	3.14628e+03	-1.89960e+03	5.05883e+03	-3.71042e+03	7.56142e+03	-5.87823e+03	1.16510e+04	-7.57252e+03
16.031654	3.14998e+03	-1.89775e+03	5.05698e+03	-3.71042e+03	7.56142e+03	-5.88008e+03	1.16492e+04	-7.57252e+03
16.070295	3.14998e+03	-1.89775e+03	5.05883e+03	-3.71227e+03	7.56142e+03	-5.87823e+03	1.16510e+04	-7.57252e+03
16.110262	3.14998e+03	-1.89775e+03	5.05883e+03	-3.71227e+03	7.56142e+03	-5.88008e+03	1.16510e+04	-7.57252e+03
16.152337	3.15183e+03	-1.89590e+03	5.05883e+03	-3.71042e+03	7.55957e+03	-5.88008e+03	1.16510e+04	-7.57252e+03
16.203581	3.14998e+03	-1.89590e+03	5.05883e+03	-3.71042e+03	7.56142e+03	-5.88008e+03	1.16510e+04	-7.57252e+03
16.238238	3.14813e+03	-1.89405e+03	5.05883e+03	-3.71227e+03	7.56142e+03	-5.88008e+03	1.16510e+04	-7.57252e+03
16.287637	3.14813e+03	-1.89405e+03	5.06068e+03	-3.71412e+03	7.56142e+03	-5.88008e+03	1.16510e+04	-7.57437e+03
16.319615	3.14998e+03	-1.89775e+03	5.06068e+03	-3.71227e+03	7.56142e+03	-5.87823e+03	1.16510e+04	-7.57252e+03
16.367608	3.14998e+03	-1.89775e+03	5.05883e+03	-3.71227e+03	7.56142e+03	-5.88008e+03	1.16510e+04	-7.57252e+03
16.399617	3.15368e+03	-1.89775e+03	5.05698e+03	-3.71042e+03	7.55957e+03	-5.87823e+03	1.16510e+04	-7.57437e+03
16.438467	3.14628e+03	-1.89590e+03	5.05698e+03	-3.71042e+03	7.56142e+03	-5.87823e+03	1.16510e+04	-7.57252e+03
16.485911	3.14443e+03	-1.89590e+03	5.05698e+03	-3.71042e+03	7.56142e+03	-5.88008e+03	1.16492e+04	-7.57437e+03
16.527618	3.14813e+03	-1.89775e+03	5.05883e+03	-3.71227e+03	7.56142e+03	-5.88008e+03	1.16510e+04	-7.57437e+03
16.570209	3.14998e+03	-1.89960e+03	5.05883e+03	-3.71227e+03	7.55957e+03	-5.87823e+03	1.16510e+04	-7.57252e+03
16.603554	3.14813e+03	-1.89960e+03	5.05883e+03	-3.71412e+03	7.56142e+03	-5.88008e+03	1.16510e+04	-7.57437e+03
16.655623	3.14998e+03	-1.89590e+03	5.05883e+03	-3.71227e+03	7.56142e+03	-5.88008e+03	1.16492e+04	-7.57252e+03
16.685709	3.14813e+03	-1.89590e+03	5.05698e+03	-3.71412e+03	7.56142e+03	-5.87823e+03	1.16510e+04	-7.57252e+03
16.735762	3.14998e+03	-1.89590e+03	5.05883e+03	-3.71227e+03	7.55957e+03	-5.88008e+03	1.16492e+04	-7.57437e+03
16.781359	3.15183e+03	-1.89590e+03	5.06068e+03	-3.71227e+03	7.55957e+03	-5.88008e+03	1.16510e+04	-7.57437e+03
16.813649	3.14998e+03	-1.89960e+03	5.06068e+03	-3.71227e+03	7.55957e+03	-5.87823e+03	1.16510e+04	-7.57252e+03
16.863037	3.14813e+03	-1.90145e+03	5.05883e+03	-3.71227e+03	7.56142e+03	-5.88008e+03	1.16492e+04	-7.57437e+03
16.891023	3.14998e+03	-1.89960e+03	5.05698e+03	-3.71227e+03	7.56142e+03	-5.87823e+03	1.16510e+04	-7.57252e+03
16.939946	3.14813e+03	-1.89960e+03	5.05883e+03	-3.71412e+03	7.55957e+03	-5.88008e+03	1.16510e+04	-7.57252e+03
16.970186	3.14813e+03	-1.89775e+03	5.05883e+03	-3.71042e+03	7.56142e+03	-5.88008e+03	1.16492e+04	-7.57437e+03
17.019194	3.15183e+03	-1.89960e+03	5.05513e+03	-3.71042e+03	7.56142e+03	-5.87823e+03	1.16492e+04	-7.57437e+03
17.071598	3.14813e+03	-1.89590e+03	5.06068e+03	-3.71412e+03	7.55957e+03	-5.88008e+03	1.16510e+04	-7.57437e+03
17.103595	3.14443e+03	-1.89775e+03	5.06068e+03	-3.71227e+03	7.55957e+03	-5.88008e+03	1.16492e+04	-7.57437e+03
17.151524	3.14998e+03	-1.89960e+03	5.05698e+03	-3.71227e+03	7.56142e+03	-5.87823e+03	1.16510e+04	-7.57252e+03
17.182913	3.14813e+03	-1.89960e+03	5.05698e+03	-3.71042e+03	7.56142e+03	-5.87823e+03	1.16492e+04	-7.57252e+03
17.231598	3.14628e+03	-1.89590e+03	5.05698e+03	-3.71227e+03	7.55957e+03	-5.88008e+03	1.16492e+04	-7.57437e+03
17.261565	3.14998e+03	-1.89590e+03	5.05698e+03	-3.71042e+03	7.55957e+03	-5.88008e+03	1.16492e+04	-7.57252e+03
17.302423	3.14813e+03	-1.89775e+03	5.05698e+03	-3.71227e+03	7.55957e+03	-5.88008e+03	1.16492e+04	-7.57252e+03
17.35341	3.14628e+03	-1.89960e+03	5.05698e+03	-3.71227e+03	7.56142e+03	-5.88008e+03	1.16492e+04	-7.57252e+03
17.385789	3.14813e+03	-1.89590e+03	5.05883e+03	-3.71042e+03	7.56142e+03	-5.88008e+03	1.16510e+04	-7.57252e+03
17.439592	3.14998e+03	-1.89775e+03	5.05698e+03	-3.71227e+03	7.56142e+03	-5.87823e+03	1.16510e+04	-7.57252e+03
17.469139	3.15183e+03	-1.89775e+03	5.05883e+03	-3.71042e+03	7.56142e+03	-5.87823e+03	1.16492e+04	-7.57252e+03
17.519595	3.14998e+03	-1.89775e+03	5.05698e+03	-3.71042e+03	7.55957e+03	-5.87823e+03	1.16492e+04	-7.57252e+03
17.551386	3.14628e+03	-1.89775e+03	5.05698e+03	-3.70857e+03	7.56142e+03	-5.87823e+03	1.16492e+04	-7.57437e+03
17.599596	3.14998e+03	-1.89775e+03	5.05883e+03	-3.71042e+03	7.55957e+03	-5.88008e+03	1.16492e+04	-7.57437e+03
17.63826	3.15183e+03	-1.89775e+03	5.05698e+03	-3.71042e+03	7.55957e+03	-5.88008e+03	1.16510e+04	-7.57252e+03
17.67919	3.14813e+03	-1.89775e+03	5.05883e+03	-3.71042e+03	7.56142e+03	-5.88008e+03	1.16492e+04	-7.57437e+03
17.719748	3.14998e+03	-1.89590e+03	5.05883e+03	-3.71042e+03	7.56142e+03	-5.88008e+03	1.16492e+04	-7.57252e+03
17.753083	3.14998e+03	-1.89775e+03	5.05883e+03	-3.71042e+03	7.56142e+03	-5.87823e+03	1.16492e+04	-7.57252e+03
17.802454	3.14813e+03	-1.89775e+03	5.05883e+03	-3.71227e+03	7.56142e+03	-5.88008e+03	1.16492e+04	-7.57252e+03
17.838247	3.15183e+03	-1.89775e+03	5.05698e+03	-3.71227e+03	7.56142e+03	-5.88008e+03	1.16492e+04	-7.57252e+03
17.887574	3.14998e+03	-1.89960e+03	5.05698e+03	-3.71042e+03	7.55957e+03	-5.88008e+03	1.16492e+04	-7.57252e+03
17.93472	3.14813e+03	-1.89590e+03	5.05698e+03	-3.71227e+03	7.55957e+03	-5.88008e+03	1.16492e+04	-7.57252e+03
17.967571	3.14813e+03	-1.90145e+03	5.05698e+03	-3.71412e+03	7.56142e+03	-5.88008e+03	1.16492e+04	-7.57252e+03
18.015573	3.14998e+03	-1.89590e+03	5.05698e+03	-3.71042e+03	7.56142e+03	-5.87823e+03	1.16492e+04	-7.57252e+03
18.038303	3.15183e+03	-1.89775e+03	5.06068e+03	-3.71227e+03	7.56142e+03	-5.87823e+03	1.16492e+04	-7.57252e+03
18.086702	3.14998e+03	-1.89960e+03	5.05883e+03	-3.71227e+03	7.55957e+03	-5.88008e+03	1.16492e+04	-7.57252e+03
18.120047	3.14998e+03	-1.89775e+03	5.06068e+03	-3.71042e+03	7.55957e+03	-5.87823e+03	1.16492e+04	-7.57252e+03
18.169362	3.14998e+03	-1.89590e+03	5.05883e+03	-3.71227e+03	7.55957e+03	-5.88008e+03	1.16492e+04	-7.57252e+03
18.223572	3.14813e+03	-1.89775e+03	5.05698e+03	-3.71227e+03	7.55957e+03	-5.88008e+03	1.16492e+04	-7.57252e+03
18.255571	3.14813e+03	-1.89405e+03	5.05698e+03	-3.71227e+03	7.55957e+03	-5.88008e+03	1.16492e+04	-7.57252e+03
18.303534	3.14813e+03	-1.89775e+03	5.05513e+03	-3.71227e+03	7.55957e+03	-5.88008e+03	1.16492e+04	-7.57252e+03
18.335709	3.14813e+03	-1.90330e+03	5.05513e+03	-3.71042e+03	7.55957e+03	-5.87823e+03	1.16492e+04	-7.57437e+03
18.381123	3.14628e+03	-1.89590e+03	5.05513e+03	-3.71042e+03	7.55957e+03	-5.87823e+03	1.16492e+04	-7.57252e+03
18.408386	3.14628e+03	-1.89590e+03	5.05698e+03	-3.71227e+03	7.55957e+03	-5.88008e+03	1.16492e+04	-7.57437e+03
18.463152	3.14998e+03	-1.89775e+03	5.05883e+03	-3.71412e+03	7.55957e+03	-5.88008e+03	1.16492e+04	-7.57437e+03
18.502333	3.14813e+03	-1.89590e+03	5.05698e+03	-3.71042e+03	7.55957e+03	-5.88008e+03	1.16492e+04	-7.57252e+03
18.538203	3.14813e+03	-1.89775e+03	5.05698e+03	-3.71042e+03	7.55957e+03	-5.88193e+03	1.16492e+04	-7.57437e+03
18.586572	3.14998e+03	-1.89960e+03	5.05698e+03	-3.71412e+03	7.56142e+03	-5.87823e+03	1.16492e+04	-7.57252e+03
18.619508	3.14813e+03	-1.90145e+03	5.05883e+03	-3.71227e+03	7.55957e+03	-5.87823e+03	1.16510e+04	-7.57252e+03
18.669018	3.14998e+03	-1.89960e+03	5.05883e+03	-3.71042e+03	7.56142e+03	-5.87823e+03	1.16492e+04	-7.57252e+03
18.703569	3.15183e+03	-1.89775e+03	5.05883e+03	-3.70857e+03	7.55957e+03	-5.88008e+03	1.16492e+04	-7.57252e+03
18.751185	3.14998e+03	-1.89590e+03	5.05698e+03	-3.71227e+03	7.56142e+03	-5.88008e+03	1.16492e+04	-7.57252e+03
18.798648	3.14813e+03	-1.89775e+03	5.05698e+03	-3.71227e+03	7.55957e+03	-5.88008e+03	1.16492e+04	-7.57252e+03
18.831212	3.14813e+03	-1.89960e+03	5.05698e+03	-3.70857e+03	7.55957e+03	-5.87823e+03	1.16492e+04	-7.57252e+03
18.86992	3.14813e+03	-1.89405e+03	5.05883e+03	-3.71042e+03	7.55957e+03	-5.87823e+03	1.16492e+04	-7.57252e+03
18.90227	3.15183e+03	-1.89405e+03	5.05883e+03	-3.71227e+03	7.56142e+03	-5.88008e+03	1.16492e+04	-7.57252e+03
18.953198	3.14998e+03	-1.89960e+03	5.05698e+03	-3.71227e+03	7.55957e+03	-5.87823e+03	1.16492e+04	-7.57252e+03
18.985513	3.14998e+03	-1.89775e+03	5.05698e+03	-3.71227e+03	7.56142e+03	-5.88008e+03	1.16492e+04	-7.57252e+03
19.038146	3.14813e+03	-1.89960e+03	5.05883e+03	-3.71227e+03	7.56142e+03	-5.88008e+03	1.16492e+04	-7.57252e+03
19.087536	3.14628e+03	-1.89775e+03	5.06068e+03	-3.71227e+03	7.55957e+03	-5.88008e+03	1.16492e+04	-7.57252e+03
19.119547	3.14813e+03	-1.89775e+03	5.05883e+03	-3.71042e+03	7.56142e+03	-5.88008e+03	1.16492e+04	-7.57252e+03
19.164449	3.14998e+03	-1.89775e+03	5.05698e+03	-3.71042e+03	7.56142e+03	-5.87823e+03	1.16492e+04	-7.57437e+03
19.196894	3.14813e+03	-1.89590e+03	5.05698e+03	-3.71227e+03	7.55957e+03	-5.88008e+03	1.16492e+04	-7.57252e+03
19.238141	3.14813e+03	-1.89590e+03	5.05698e+03	-3.71042e+03	7.55957e+03	-5.87823e+03	1.16492e+04	-7.57252e+03
19.269951	3.14998e+03	-1.89775e+03	5.05883e+03	-3.71042e+03	7.55957e+03	-5.88008e+03	1.16492e+04	-7.57252e+03
19.319727	3.14998e+03	-1.89590e+03	5.05698e+03	-3.71227e+03	7.55957e+03	-5.88008e+03	1.16492e+04	-7.57252e+03
19.353158	3.14813e+03	-1.90145e+03	5.05883e+03	-3.71227e+03	7.56142e+03	-5.88008e+03	1.16492e+04	-7.57252e+03
19.403951	3.14813e+03	-1.89960e+03	5.05883e+03	-3.71227e+03	7.55957e+03	-5.88008e+03	1.16492e+04	-7.57437e+03
19.453128	3.14998e+03	-1.89960e+03	5.05698e+03	-3.71227e+03	7.56142e+03	-5.87823e+03	1.16492e+04	-7.57252e+03
19.487533	3.14998e+03	-1.89960e+03	5.05698e+03	-3.71227e+03	7.55957e+03	-5.88008e+03	1.16492e+04	-7.57252e+03
19.535518	3.14998e+03	-1.89960e+03	5.05698e+03	-3.71227e+03	7.55957e+03	-5.87823e+03	1.16492e+04	-7.57437e+03
19.564214	3.14443e+03	-1.89590e+03	5.05698e+03	-3.71227e+03	7.55957e+03	-5.88008e+03	1.16492e+04	-7.57252e+03
19.614837	3.14628e+03	-1.89775e+03	5.05698e+03	-3.71412e+03	7.55957e+03	-5.88008e+03	1.16492e+04	-7.57252e+03
19.639597	3.14998e+03	-1.89775e+03	5.05698e+03	-3.71227e+03	7.55957e+03	-5.88008e+03	1.16492e+04	-7.57252e+03
19.695566	3.14998e+03	-1.89775e+03	5.05883e+03	-3.71227e+03	7.55957e+03	-5.88008e+03	1.16492e+04	-7.57252e+03
19.739602	3.14813e+03	-1.89775e+03	5.05698e+03	-3.71412e+03	7.56142e+03	-5.88008e+03	1.16492e+04	-7.57437e+03
19.771764	3.14628e+03	-1.89960e+03	5.05698e+03	-3.71227e+03	7.55957e+03	-5.88008e+03	1.16492e+04	-7.57252e+03
19.818844	3.14813e+03	-1.89775e+03	5.05698e+03	-3.71042e+03	7.55957e+03	-5.88008e+03	1.16492e+04	-7.57252e+03
19.854098	3.14998e+03	-1.89960e+03	5.05883e+03	-3.71412e+03	7.55957e+03	-5.88008e+03	1.16492e+04	-7.57437e+03
19.903519	3.14998e+03	-1.90145e+03	5.05883e+03	-3.71042e+03	7.55957e+03	-5.87823e+03	1.16492e+04	-7.57252e+03
19.935452	3.14628e+03	-1.89590e+03	5.05698e+03	-3.71042e+03	7.55957e+03	-5.88008e+03	1.16510e+04	-7.57437e+03
19.980983	3.14813e+03	-1.89590e+03	5.05698e+03	-3.71412e+03	7.55957e+03	-5.88008e+03	1.16492e+04	-7.57252e+03
20.031516	3.14813e+03	-1.90145e+03	5.05698e+03	-3.71227e+03	7.55957e+03	-5.87823e+03	1.16492e+04	-7.57252e+03
20.063484	3.14628e+03	-1.89590e+03	5.05883e+03	-3.71042e+03	7.55957e+03	-5.88008e+03	1.16492e+04	-7.57252e+03
20.103156	3.14813e+03	-1.89960e+03	5.05883e+03	-3.71227e+03	7.56142e+03	-5.88008e+03	1.16492e+04	-7.57437e+03
20.140112	3.14813e+03	-1.89960e+03	5.05883e+03	-3.71042e+03	7.56142e+03	-5.88008e+03	1.16510e+04	-7.57252e+03
20.18564	3.14628e+03	-1.89960e+03	5.05698e+03	-3.71227e+03	7.56142e+03	-5.87823e+03	1.16492e+04	-7.57252e+03
20.218799	3.14998e+03	-1.89775e+03	5.05883e+03	-3.71227e+03	7.56142e+03	-5.88008e+03	1.16492e+04	-7.57252e+03
20.271517	3.14998e+03	-1.89960e+03	5.05883e+03	-3.71227e+03	7.55957e+03	-5.88008e+03	1.16492e+04	-7.57252e+03
20.318692	3.14998e+03	-1.90145e+03	5.05883e+03	-3.71227e+03	7.55957e+03	-5.88008e+03	1.16510e+04	-7.57252e+03
20.351588	3.14628e+03	-1.89960e+03	5.05883e+03	-3.71412e+03	7.55957e+03	-5.88008e+03	1.16492e+04	-7.57437e+03
20.399488	3.14813e+03	-1.89590e+03	5.05883e+03	-3.71412e+03	7.55957e+03	-5.87823e+03	1.16492e+04	-7.57252e+03
20.428178	3.14813e+03	-1.89775e+03	5.05698e+03	-3.71227e+03	7.56142e+03	-5.87823e+03	1.16492e+04	-7.57252e+03
20.47968	3.14998e+03	-1.89960e+03	5.05698e+03	-3.71042e+03	7.55957e+03	-5.88008e+03	1.16492e+04	-7.57437e+03
20.503034	3.14813e+03	-1.90145e+03	5.05698e+03	-3.71227e+03	7.55957e+03	-5.88008e+03	1.16492e+04	-7.57252e+03
20.552103	3.14813e+03	-1.89960e+03	5.05513e+03	-3.71227e+03	7.56142e+03	-5.88008e+03	1.16492e+04	-7.57252e+03
20.603085	3.14998e+03	-1.90145e+03	5.05513e+03	-3.71227e+03	7.55957e+03	-5.88008e+03	1.16492e+04	-7.57252e+03
20.636324	3.14998e+03	-1.89960e+03	5.05513e+03	-3.71227e+03	7.56142e+03	-5.87823e+03	1.16492e+04	-7.57252e+03
20.687503	3.14813e+03	-1.89775e+03	5.05883e+03	-3.71227e+03	7.55957e+03	-5.88008e+03	1.16492e+04	-7.57252e+03
20.718753	3.14628e+03	-1.90145e+03	5.05883e+03	-3.71227e+03	7.55957e+03	-5.88008e+03	1.16492e+04	-7.57437e+03
20.765218	3.14628e+03	-1.89960e+03	5.05698e+03	-3.71227e+03	7.55957e+03	-5.87823e+03	1.16492e+04	-7.57252e+03
20.799493	3.14628e+03	-1.89590e+03	5.05883e+03	-3.71227e+03	7.55957e+03	-5.87823e+03	1.16492e+04	-7.57252e+03
20.840931	3.14998e+03	-1.89590e+03	5.05883e+03	-3.71227e+03	7.55957e+03	-5.87823e+03	1.16492e+04	-7.57252e+03
20.895495	3.14813e+03	-1.89590e+03	5.05698e+03	-3.71042e+03	7.55957e+03	-5.88008e+03	1.16492e+04	-7.57252e+03
20.919869	3.14813e+03	-1.89590e+03	5.05698e+03	-3.71227e+03	7.55957e+03	-5.88008e+03	1.16492e+04	-7.57437e+03
20.969675	3.14813e+03	-1.89590e+03	5.05698e+03	-3.71227e+03	7.55957e+03	-5.88008e+03	1.16492e+04	-7.57252e+03
21.003007	3.14813e+03	-1.89775e+03	5.05698e+03	-3.71227e+03	7.55957e+03	-5.88008e+03	1.16510e+04	-7.57252e+03
21.052009	3.14813e+03	-1.89960e+03	5.05698e+03	-3.71227e+03	7.55957e+03	-5.88008e+03	1.16492e+04	-7.57252e+03
21.087473	3.14628e+03	-1.89775e+03	5.05513e+03	-3.71227e+03	7.56142e+03	-5.87823e+03	1.16492e+04	-7.57252e+03
21.135471	3.14813e+03	-1.90145e+03	5.05883e+03	-3.71227e+03	7.55957e+03	-5.88008e+03	1.16492e+04	-7.57252e+03
21.180879	3.14813e+03	-1.90145e+03	5.05698e+03	-3.71227e+03	7.56142e+03	-5.87823e+03	1.16492e+04	-7.57437e+03
21.215473	3.14813e+03	-1.89960e+03	5.05883e+03	-3.71042e+03	7.56142e+03	-5.87823e+03	1.16492e+04	-7.57437e+03
21.263249	3.14628e+03	-1.89775e+03	5.06068e+03	-3.71042e+03	7.56142e+03	-5.87823e+03	1.16492e+04	-7.57252e+03
21.295586	3.14628e+03	-1.89590e+03	5.05883e+03	-3.71227e+03	7.55957e+03	-5.88008e+03	1.16492e+04	-7.57252e+03
21.343475	3.14813e+03	-1.89775e+03	5.05883e+03	-3.71042e+03	7.56142e+03	-5.88008e+03	1.16492e+04	-7.57252e+03
21.369608	3.14998e+03	-1.89775e+03	5.05883e+03	-3.71042e+03	7.56142e+03	-5.88008e+03	1.16492e+04	-7.57252e+03
21.42333	3.14998e+03	-1.89775e+03	5.05883e+03	-3.71227e+03	7.56142e+03	-5.87823e+03	1.16492e+04	-7.57252e+03
21.468767	3.14813e+03	-1.89960e+03	5.05883e+03	-3.71227e+03	7.56142e+03	-5.88008e+03	1.16492e+04	-7.57252e+03
21.502679	3.14813e+03	-1.89775e+03	5.05698e+03	-3.71042e+03	7.55957e+03	-5.88008e+03	1.16492e+04	-7.57252e+03
21.550869	3.14443e+03	-1.89960e+03	5.05513e+03	-3.71227e+03	7.55957e+03	-5.87823e+03	1.16492e+04	-7.57437e+03
